{"text_format":"2","workbook":"xlsx","n_sheets":13,"sheets":["PO","Cronograma","Composições","Memória_Cálculo","Composições Aux. SINAPI","Planilha_M.O.","Planilha Cotações","Insumos","Cotações","BDI","Quadro_Comparativo","Encargos Sociais","Curva ABC"],"not_rendered":{"charts":0,"images":3,"macros":0,"external_links":6,"defined_names":14,"comments":1,"pivot_tables":0},"unopened":[],"bounds":{"document_bytes":16777216,"sheet_cells":100000,"run_cost":"one","rows_first":2000,"rows_last":500,"rows_between":2000,"halvings":0,"cell_chars":16384,"cell_head_chars":4096},"cells_cut":0,"cells_raw":0,"read":"whole","date_system":"1900"}

{"sheet":"PO","index":0,"n_rows":163,"n_cols":12,"rows_kept":163,"cut":false,"hidden":false,"merged":[[12,0,12,11],[60,0,60,11],[162,0,163,0],[162,1,163,10],[162,11,163,11],[103,2,103,10],[105,1,105,10],[106,0,107,0],[106,1,107,10],[106,11,107,11],[65,1,65,10],[66,2,66,10],[76,1,76,10],[77,2,77,10],[79,1,79,10],[58,11,59,11],[131,1,131,10],[128,2,128,10],[113,1,113,10],[124,1,124,10],[127,1,127,10],[110,2,110,10],[114,2,114,10],[125,2,125,10],[62,2,62,10],[92,1,92,10],[93,2,93,10],[102,1,102,10],[108,0,108,11],[80,2,80,10],[83,1,83,10],[84,2,84,10],[88,1,88,10],[89,2,89,10],[58,0,59,0],[58,1,59,10],[42,1,42,10],[43,2,43,10],[54,1,54,10],[55,2,55,10],[57,1,57,10],[14,2,14,10],[30,2,30,10],[33,1,33,10],[34,2,34,10],[38,1,38,10],[39,2,39,10],[16,1,16,10],[17,2,17,10],[26,1,26,10],[27,2,27,10],[29,1,29,10],[11,3,11,10],[10,3,10,10],[9,3,9,10],[11,0,11,2],[0,1,0,11],[8,1,8,2],[9,1,9,2],[10,1,10,2],[2,0,2,11],[1,0,1,11],[8,3,8,10],[7,0,7,11],[5,0,5,11],[3,0,3,11],[6,0,6,11],[4,9,4,10],[159,0,160,0],[159,11,160,11],[158,1,158,10],[159,1,160,10],[156,2,156,10],[155,1,155,10],[141,2,141,10],[132,2,132,10],[138,2,138,10],[140,1,140,10],[137,1,137,10],[145,2,145,10],[144,1,144,10]]}
[]
["PLANILHA ORÇAMENTÁRIA"]
["LOCALIDADE SINAPI: PORTO ALEGRE/RS"]
[]
[{"$nulls":9},"DATA BASE SINAPI RS:",null,{"$f":"+'Planilha_M.O.'!$E$17","v":"JUNHO / 2021"}]
[]
[]
[]
["OBJETO:","Obras de Aquisição e Instalação de Academias de Ginástica ao ar livre na Praça Professor Emílio Mabilde Rípole (155/02), Praça Irene Elisalde Stricher (145/10) e Praça José Mariano de Freitas Beck (164/09).",null,{"$f":"CONCATENATE(\"Leis Sociais Horistas \",'Planilha_M.O.'!$D$5,\" (SINAPI)\")","v":"Leis Sociais Horistas s/desoneração (SINAPI)"},{"$nulls":7},{"$f":"+'Planilha_M.O.'!$D$7","v":1.111}]
["DATA:","2021-08-10",null,{"$f":"CONCATENATE(\"Leis Sociais Mensalistas \",'Planilha_M.O.'!$D$5,\" (SINAP)I\")","v":"Leis Sociais Mensalistas s/desoneração (SINAP)I"},{"$nulls":7},{"$f":"+'Planilha_M.O.'!$D$8","v":0.69159999999999999}]
["ART nº:",null,null,"BDI:",{"$nulls":7},{"$f":"+'Planilha_M.O.'!$F$7","v":"22,15%"}]
[null,null,null,"BDI diferenciado p/ Academia ar Livre:",{"$nulls":7},{"$f":"IF($L$11=\"28,21%\",19.35%,13.7%)","v":0.13699999999999998}]
["PRAÇA PROFESSOR EMÍLIO MABILDE RÍPOLE (155/02)"]
["Composição","Item","Descrição","Quantidade","Un","Custo Unit.Mat.+Eq.","Custo Unit. M.O.","Custo Unit.","Preço Unit.Mat.+Eq.","Preço Unit. M.O.","Preço Unit.","Total"]
[null,1,"DESPESAS LEGAIS, LICENÇAS, TAXAS, CONTRIBUIÇÕES"]
["SMAMS 450","1.1","ART (ANOTAÇÃO DE RESPONSABILIDADE TÉCNICA PELA EXECUÇÃO TOTAL DO OBJETO)",1,"un",{"$f":"Composições!C77","v":226},{"$f":"+[1]Composições!C1026","v":0},{"$f":"+F16+G16","v":226},{"$f":"+K16-J16","v":276.05},{"$f":"+TRUNC((G16*(1+$L$11)),2)","v":0},{"$f":"Composições!F83","v":276.05},{"$f":"TRUNC((D16*K16),2)","v":276.05}]
[null,"TOTAL DE DESPESAS LEGAIS, LICENÇAS, TAXAS, CONTRIBUIÇÕES",{"$nulls":9},{"$f":"SUM(L16:L16)","v":276.05}]
[null,2,"INSTALAÇÕES PROVISÓRIAS"]
["SMAMS 500","2.1","TAPUME EM CHAPA DE COMPENSADO RESINADO (L=9,90m; C=15,40m e H=2,20M)",111.32,"m²",{"$f":"Composições!C96","v":26.48},{"$f":"Composições!C101","v":41.089999999999996},{"$f":"+F19+G19","v":67.569999999999993},{"$f":"+K19-J19","v":32.3386},{"$f":"+TRUNC((G19*(1+$L$11)),4)","v":50.191400000000002},{"$f":"Composições!F107","v":82.53},{"$f":"TRUNC((D19*K19),2)","v":9187.23}]
["SMAMS 510","2.2","LOCAÇÃO DE BANHEIRO QUÍMICO",100,"%",{"$f":"Composições!C112","v":6.8},0,6.8,8.3062000000000005,{"$f":"+TRUNC((G20*(1+$L$11)),4)","v":0},{"$f":"Composições!F118","v":8.3062000000000005},830.62]
["SMAMS 520","2.3","FRETE P/ BANHEIRO QUÍMICO LOCADO (IDA E VOLTA)",1,"cj",{"$f":"Composições!C125","v":888.65},0,888.65,1085.48,{"$f":"+TRUNC((G21*(1+$L$11)),4)","v":0},{"$f":"Composições!F131","v":1085.48},1085.48]
["SMAMS 530","2.4","INSTALAÇÃO PROVISÓRIA DE ENERGIA, AÉREA, BIFÁSICA, COM CAIXA DE EMBUTIR C/ POSTE H=9,00M",1,"pt",{"$f":"Composições!C156","v":2353.6200000000003},{"$f":"Composições!C159","v":86},2439.6200000000003,2874.9410000000003,105.04900000000001,{"$f":"Composições!F166","v":2979.9900000000002},2979.99]
["SMAMS 535","2.5","INSTALAÇÃO PROVISÓRIA DE ÁGUA",1,"pt",{"$f":"Composições!C178","v":734.47},0,734.47,897.15000000000009,0,{"$f":"Composições!F184","v":897.15000000000009},897.15]
["SMAMS 542","2.6","PLACA DE OBRA EM CHAPA GALVANIZADA",{"$f":"2*1.25","v":2.5},"m²",{"$f":"Composições!C196","v":281.44},{"$f":"Composições!C201","v":21.639999999999997},{"$f":"+F24+G24","v":303.08},343.77679999999998,26.433199999999999,{"$f":"Composições!F207","v":370.21},925.52]
["SINAPI C 99064","2.7","LOCAÇÃO DE OBRA",49,"m",{"$f":"Composições!C228","v":0.51},0,0.51,0.62,0,{"$f":"Composições!F234","v":0.62},30.38]
["SMAMS 565","2.8","NIVELAMENTO",168.5,"m²",{"$f":"Composições!C240","v":0.03},{"$f":"Composições!C244","v":0.22},0.25,3.999999999999998E-2,{"$f":"+TRUNC((G26*(1+$L$11)),2)","v":0.26},{"$f":"Composições!F250","v":0.3},50.55]
[null,"TOTAL DE INSTALAÇÕES PROVISÓRIAS",{"$nulls":9},{"$f":"SUM(L19:L26)","v":15986.919999999998}]
[null,3,"ADMINISTRAÇÃO LOCAL"]
["SMAMS 700","3.1","ADMINISTRAÇÃO LOCAL",100,"%",{"$f":"Composições!C276","v":202.7122},0,{"$f":"+F29+G29","v":202.7122},{"$f":"+K29-J29","v":247.6129},{"$f":"+TRUNC((G29*(1+$L$11)),4)","v":0},{"$f":"Composições!F282","v":247.6129},{"$f":"TRUNC((D29*K29),2)","v":24761.29}]
[null,"TOTAL DE ADMINISTRAÇÃO LOCAL",{"$nulls":9},{"$f":"SUM(L29)","v":24761.29}]
[null,4,"MOVIMENTO DE TERRA"]
["SMAMS 1002","4.1","MODELAGEM (MOVIMENTO DE TERRA ATÉ 15CM)",168.5,"m²",{"$f":"Composições!C313","v":0.08},{"$f":"Composições!C316","v":2.34},{"$f":"+F32+G32","v":2.42},{"$f":"+K32-J32","v":0.10000000000000009},{"$f":"+TRUNC((G32*(1+$L$11)),2)","v":2.85},{"$f":"Composições!F322","v":2.95},{"$f":"TRUNC((D32*K32),2)","v":497.07}]
["SMAMS 1010","4.2","ATERRO MANUAL C/MATERIAL IMPORTADO C/COMPACTAÇÃO MANUAL",12,"m³",{"$f":"Composições!C338","v":39.479999999999997},{"$f":"Composições!C340","v":41.04},80.52,48.219999999999992,50.13,{"$f":"Composições!F346","v":98.35},1180.2]
[null,"TOTAL DE MOVIMENTO DE TERRA",{"$nulls":9},{"$f":"SUM(L32:L33)","v":1677.27}]
[null,5,"PAVIMENTAÇÃO"]
["SINAPI C 94994","5.1","EXECUÇÃO DE PASSEIO (CALÇADA) OU PISO DE CONCRETO COM CONCRETO USINADO, MOLDADO IN LOCO,  ACABAMENTO VASSOURADO, ESPESSURA 8 CM, ARMADO",2.25,"m²",{"$f":"Composições!C356","v":97.59},{"$f":"Composições!C360","v":17.25},{"$f":"+F36+G36","v":114.84},{"$f":"+K36-J36","v":119.20000000000002},{"$f":"+TRUNC((G36*(1+$L$11)),2)","v":21.07},{"$f":"Composições!F366","v":140.27000000000001},{"$f":"TRUNC((D36*K36),2)","v":315.60000000000002}]
["SMAMS 2023","5.2","PISO CONCRETO ARMADO E= 10 cm - ACADEMIA AO AR LIVRE",116,"m²",{"$f":"Composições!C385","v":81.759999999999991},{"$f":"Composições!C391","v":15.1},96.859999999999985,99.86999999999999,18.440000000000001,{"$f":"Composições!F397","v":118.30999999999999},13723.96]
["SMAMS 2070","5.3","PISO PODOTÁTIL 25x25 cm - E=2,0 cm",3,"m",{"$f":"Composições!C427","v":19.529999999999998},{"$f":"Composições!C430","v":8.14},27.669999999999998,23.85,9.94,{"$f":"Composições!F436","v":33.79},101.37]
[null,"TOTAL DE PAVIMENTAÇÃO",{"$nulls":9},{"$f":"SUM(L36:L38)","v":14140.93}]
[null,6,"MOBILIÁRIO URBANO"]
["SMAMS 2601","6.1","BANCO B (C/ ENCOSTO) - L=2,00 m - PADRÃO SMAMS",2,"un",{"$f":"Composições!C493","v":1021.8400000000001},{"$f":"Composições!C500","v":355.29},{"$f":"+F41+G41","v":1377.13},{"$f":"+K41-J41","v":1248.18},{"$f":"+TRUNC((G41*(1+$L$11)),2)","v":433.98},{"$f":"Composições!F506","v":1682.16},{"$f":"TRUNC((D41*K41),2)","v":3364.32}]
["SMAMS 2671","6.2","LIXEIRA METÁLICA - V=30 LITROS INSTALADA",1,"un",{"$f":"Composições!C603","v":971.95},{"$f":"Composições!C606","v":52.81},1024.76,1187.24,64.5,{"$f":"Composições!F612","v":1251.74},1251.74]
[null,"TOTAL DE EQUIPAMENTOS/MOBILIÁRIO URBANO",{"$nulls":9},{"$f":"SUM(L41:L42)","v":4616.0600000000004}]
[null,7,"ACADEMIA AO AR LIVRE GALVANIZADA"]
["SMAMS 3205","7.1","PLACA ORIENTATIVA - GALVANIZADA",1,"un",{"$f":"Composições!C698+Composições!C700","v":7782.09},{"$f":"Composições!C703","v":44.72},{"$f":"+F45+G45","v":7826.81},{"$f":"+K45-J45","v":8855.57},{"$f":"+TRUNC((G45*(1+$L$11)),2)","v":54.62},{"$f":"Composições!F710","v":8910.19},{"$f":"TRUNC((D45*K45),2)","v":8910.19}]
["SMAMS 3025","7.2","ESPALDAR PADRÃO SMAMS ",1,"un",{"$f":"Composições!C625","v":1643.62},{"$f":"Composições!C629","v":596.02},{"$f":"+F46+G46","v":2239.64},{"$f":"+K46-J46","v":2007.6899999999998},{"$f":"+TRUNC((G46*(1+$L$11)),2)","v":728.03},{"$f":"Composições!F635","v":2735.72},2735.72]
["SMAMS 3030","7.3","PRANCHA DE ABDOMINAL PADRÃO SMAMS",1,"un",{"$f":"Composições!C652","v":1135.76},{"$f":"Composições!C657","v":319.19},1454.95,1387.33,389.89,{"$f":"Composições!F663","v":1777.22},1777.22]
["SMAMS 3220","7.4","SIMULADOR DE CAMINHADA TRIPLO CONJUGADO - GALVANIZADO",1,"un",{"$f":"Composições!C735","v":13224.66},{"$f":"Composições!C738","v":24.08},13248.74,15036.43,29.41,{"$f":"Composições!F745","v":15065.84},15065.84]
["SMAMS 3230","7.5","ESQUI TRIPLO CONJUGADO - GALVANIZADO",1,"un",{"$f":"Composições!C750","v":16140},{"$f":"Composições!C753","v":24.08},16164.08,18351.18,29.41,{"$f":"Composições!F760","v":18380.59},18380.59]
["SMAMS 3235","7.6","ADUÇÃO E ABDUÇÃO DE PERNAS DUPLO - GALVANIZADO",1,"un",{"$f":"Composições!C766+Composições!C768","v":9193.3799999999992},{"$f":"Composições!C771","v":28.77},9222.15,10456.539999999999,35.14,{"$f":"Composições!F778","v":10491.679999999998},10491.68]
["SMAMS 3240","7.7","PRESSÃO DE PERNAS TRIPLO CONJUGADO - GALVANIZADO",1,"un",{"$f":"Composições!C784+Composições!C786","v":9515.3799999999992},{"$f":"Composições!C789","v":28.77},9544.15,10822.65,35.14,{"$f":"Composições!F796","v":10857.789999999999},10857.79]
["SMAMS 3252","7.8","SIMULADOR DE REMADA SENTADA  - GALVANIZADO",1,"un",{"$f":"Composições!C818","v":5640},{"$f":"Composições!C821","v":24.08},5664.08,6412.68,29.41,{"$f":"Composições!F828","v":6442.09},6442.09]
["SMAMS 3276","7.9","REMADA ESPECIAL PPNE - GALVANIZADA",1,"un",{"$f":"Composições!C888","v":5940},{"$f":"Composições!C891","v":18.899999999999999},5958.9,6753.78,23.08,{"$f":"Composições!F898","v":6776.86},6776.86]
["SMAMS 3280","7.10","VOADOR PEITORAL E VOADOR DORSAL - GALVANIZADO",1,"un",{"$f":"Composições!C904+Composições!C906","v":6243.38},{"$f":"Composições!C909","v":28.77},6272.1500000000005,7102.3899999999994,35.14,{"$f":"Composições!F916","v":7137.53},7137.53]
[null,"TOTAL DE ACADEMIA AO AR LIVRE",{"$nulls":9},{"$f":"SUM(L45:L54)","v":88575.51}]
[null,8,"PLANTIO"]
["SINAPI C 4105","8.1","PLANTIO DE GRAMA CATARINA COM COMPOSTO ORGÂNICO",49.5,"m²",{"$f":"Composições!C2102","v":24.439999999999998},{"$f":"Composições!C2105","v":3.45},{"$f":"+F57+G57","v":27.889999999999997},{"$f":"+K57-J57","v":29.849999999999994},{"$f":"+TRUNC((G57*(1+$L$11)),2)","v":4.21},{"$f":"Composições!F2111","v":34.059999999999995},{"$f":"TRUNC((D57*K57),2)","v":1685.97}]
[null,"TOTAL DE PLANTIO",{"$nulls":9},{"$f":"SUM(L56:L57)","v":1685.97}]
[null,"SUBTOTAL PRAÇA PROFESSOR EMÍLIO MABILDE RÍPOLE (1)",{"$nulls":9},{"$f":"SUM(L16:L58)/2","v":151719.99999999994}]
[]
["PRAÇA IRENE ELISALDE STRICHER 145/10"]
["Composição","Item","Descrição","Quantidade","Un","Custo Unit.Mat.+Eq.","Custo Unit. M.O.","Custo Unit.","Preço Unit.Mat.+Eq.","Preço Unit. M.O.","Preço Unit.","Total"]
[null,9,"SERVIÇOS PRELIMINARES"]
["SMAMS 120","9.1","DEMOLIÇÃO CHURRASQUEIRA C/REMOÇÃO DE ENTULHOS",1,"un",{"$f":"Composições!C44","v":76.600000000000009},{"$f":"Composições!C47","v":65.510000000000005},{"$f":"+F64+G64","v":142.11000000000001},{"$f":"+K64-J64","v":93.560000000000016},{"$f":"+TRUNC((G64*(1+$L$11)),2)","v":80.02},{"$f":"Composições!F53","v":173.58},{"$f":"TRUNC((D64*K64),2)","v":173.58}]
["SMAMS 122","9.2","DEMOLIÇÃO DE MESA DE CONCRETO C/REMOÇÃO DE ENTULHOS",1,"cj",{"$f":"Composições!C63","v":130.49},{"$f":"Composições!C66","v":37.49},167.98000000000002,159.39000000000001,45.79,{"$f":"Composições!F72","v":205.18},205.18]
[null,"TOTAL DE SERVIÇOS PRELIMINARES",{"$nulls":9},{"$f":"SUM(L64:L65)","v":378.76}]
[null,10,"INSTALAÇÕES PROVISÓRIAS"]
["SMAMS 500","10.1","TAPUME EM CHAPA DE COMPENSADO RESINADO (L=7,70m; C=11,00m e H=2,20M)",82.28,"m²",{"$f":"Composições!C96","v":26.48},{"$f":"Composições!C101","v":41.089999999999996},{"$f":"+F68+G68","v":67.569999999999993},{"$f":"+K68-J68","v":32.3386},{"$f":"+TRUNC((G68*(1+$L$11)),4)","v":50.191400000000002},{"$f":"Composições!F107","v":82.53},{"$f":"TRUNC((D68*K68),2)","v":6790.56}]
["SMAMS 510","10.2","LOCAÇÃO DE BANHEIRO QUÍMICO",100,"%",{"$f":"Composições!C112","v":6.8},0,6.8,8.3062000000000005,{"$f":"+TRUNC((G69*(1+$L$11)),4)","v":0},{"$f":"Composições!F118","v":8.3062000000000005},830.62]
["SMAMS 520","10.3","FRETE P/ BANHEIRO QUÍMICO LOCADO (IDA E VOLTA)",1,"cj",{"$f":"Composições!C125","v":888.65},0,888.65,1085.48,{"$f":"+TRUNC((G70*(1+$L$11)),4)","v":0},{"$f":"Composições!F131","v":1085.48},1085.48]
["SMAMS 530","10.4","INSTALAÇÃO PROVISÓRIA DE ENERGIA, AÉREA, BIFÁSICA, COM CAIXA DE EMBUTIR C/ POSTE H=9,00M",1,"pt",{"$f":"Composições!C156","v":2353.6200000000003},{"$f":"Composições!C159","v":86},2439.6200000000003,2874.9410000000003,105.04900000000001,{"$f":"Composições!F166","v":2979.9900000000002},2979.99]
["SMAMS 535","10.5","INSTALAÇÃO PROVISÓRIA DE ÁGUA",1,"pt",{"$f":"Composições!C178","v":734.47},0,734.47,897.15000000000009,0,{"$f":"Composições!F184","v":897.15000000000009},897.15]
["SMAMS 542","10.6","PLACA DE OBRA EM CHAPA GALVANIZADA",{"$f":"2*1.25","v":2.5},"m²",{"$f":"Composições!C196","v":281.44},{"$f":"Composições!C201","v":21.639999999999997},{"$f":"+F73+G73","v":303.08},343.77679999999998,26.433199999999999,{"$f":"Composições!F207","v":370.21},925.52]
["SMAMS 552","10.7","SINALIZAÇÃO COM TELA PLÁSTICA LARANJA FIXADA EM CONE PLÁSTICO",58,"m",{"$f":"Composições!C214","v":22.339999999999996},{"$f":"Composições!C217","v":5.6899999999999995},{"$f":"+F74+G74","v":28.029999999999994},27.279699999999998,6.9503000000000004,{"$f":"Composições!F223","v":34.229999999999997},1985.34]
["SINAPI C 99064","10.8","LOCAÇÃO DE OBRA",52,"m",{"$f":"Composições!C228","v":0.51},0,0.51,0.62,0,{"$f":"Composições!F234","v":0.62},32.24]
["SMAMS 565","10.9","NIVELAMENTO",154,"m²",{"$f":"Composições!C240","v":0.03},{"$f":"Composições!C244","v":0.22},0.25,3.999999999999998E-2,{"$f":"+TRUNC((G76*(1+$L$11)),2)","v":0.26},{"$f":"Composições!F250","v":0.3},46.2]
[null,"TOTAL DE INSTALAÇÕES PROVISÓRIAS",{"$nulls":9},{"$f":"SUM(L68:L76)","v":15573.1}]
[null,11,"ADMINISTRAÇÃO LOCAL"]
["SMAMS 700","11.1","ADMINISTRAÇÃO LOCAL",100,"%",0,{"$f":"Composições!C276","v":202.7122},{"$f":"+F79+G79","v":202.7122},{"$f":"+K79-J79","v":0},{"$f":"+TRUNC((G79*(1+$L$11)),4)","v":247.6129},{"$f":"Composições!F282","v":247.6129},{"$f":"TRUNC((D79*K79),2)","v":24761.29}]
[null,"TOTAL DE ADMINISTRAÇÃO LOCAL",{"$nulls":9},{"$f":"SUM(L79)","v":24761.29}]
[null,12,"MOVIMENTO DE TERRA"]
["SMAMS 1002","12.1","MODELAGEM (MOVIMENTO DE TERRA ATÉ 15CM)",154,"m²",{"$f":"Composições!C313","v":0.08},{"$f":"Composições!C316","v":2.34},{"$f":"+F82+G82","v":2.42},{"$f":"+K82-J82","v":0.10000000000000009},{"$f":"+TRUNC((G82*(1+$L$11)),2)","v":2.85},{"$f":"Composições!F322","v":2.95},{"$f":"TRUNC((D82*K82),2)","v":454.3}]
["SMAMS 1010","12.2","ATERRO MANUAL C/MATERIAL IMPORTADO C/COMPACTAÇÃO MANUAL",2.5,"m³",{"$f":"Composições!C338","v":39.479999999999997},{"$f":"Composições!C340","v":41.04},80.52,48.219999999999992,50.13,{"$f":"Composições!F346","v":98.35},245.87]
[null,"TOTAL DE MOVIMENTO DE TERRA",{"$nulls":9},{"$f":"SUM(L82:L83)","v":700.17000000000007}]
[null,13,"PAVIMENTAÇÃO"]
["SINAPI C 94994","13.1","EXECUÇÃO DE PASSEIO (CALÇADA) OU PISO DE CONCRETO COM CONCRETO USINADO, MOLDADO IN LOCO,  ACABAMENTO VASSOURADO, ESPESSURA 8 CM, ARMADO",1,"m²",{"$f":"Composições!C356","v":97.59},{"$f":"Composições!C360","v":17.25},{"$f":"+F86+G86","v":114.84},{"$f":"+K86-J86","v":119.20000000000002},{"$f":"+TRUNC((G86*(1+$L$11)),2)","v":21.07},{"$f":"Composições!F366","v":140.27000000000001},{"$f":"TRUNC((D86*K86),2)","v":140.27000000000001}]
["SINAPI C 94994","13.2","PISO CONCRETO ARMADO E= 10 cm - ACADEMIA AO AR LIVRE",100,"m²",{"$f":"Composições!C385","v":81.759999999999991},{"$f":"Composições!C391","v":15.1},96.859999999999985,99.86999999999999,18.440000000000001,{"$f":"Composições!F397","v":118.30999999999999},11831]
["SMAMS 2070","13.3","PISO PODOTÁTIL 25x25 cm - E=2,0 cm",4,"m",{"$f":"Composições!C427","v":19.529999999999998},{"$f":"Composições!C430","v":8.14},27.669999999999998,23.85,9.94,{"$f":"Composições!F436","v":33.79},135.16]
[null,"TOTAL DE PAVIMENTAÇÃO",{"$nulls":9},{"$f":"SUM(L86:L88)","v":12106.43}]
[null,14,"MOBILIÁRIO URBANO"]
["SMAMS 2601","14.1","BANCO B (C/ ENCOSTO) - L=2,00 m - PADRÃO SMAM",2,"un",{"$f":"Composições!C493","v":1021.8400000000001},{"$f":"Composições!C500","v":355.29},{"$f":"+F91+G91","v":1377.13},{"$f":"+K91-J91","v":1248.18},{"$f":"+TRUNC((G91*(1+$L$11)),2)","v":433.98},{"$f":"Composições!F506","v":1682.16},{"$f":"TRUNC((D91*K91),2)","v":3364.32}]
["SMAMS 2071","14.2","LIXEIRA METÁLICA - V=30 LITROS INSTALADA",1,"un",{"$f":"Composições!C603","v":971.95},{"$f":"Composições!C606","v":52.81},1024.76,1187.24,64.5,{"$f":"Composições!F612","v":1251.74},1251.74]
[null,"TOTAL DE EQUIPAMENTOS/MOBILIÁRIO URBANO",{"$nulls":9},{"$f":"SUM(L91:L92)","v":4616.0600000000004}]
[null,15,"ACADEMIA AO AR LIVRE - GALVANIZADA"]
["SINAPI C 3205","15.1","PLACA ORIENTATIVA - GALVANIZADA",1,"un",{"$f":"Composições!C698+Composições!C700","v":7782.09},{"$f":"Composições!C703","v":44.72},{"$f":"+F95+G95","v":7826.81},{"$f":"+K95-J95","v":8855.57},{"$f":"+TRUNC((G95*(1+$L$11)),2)","v":54.62},{"$f":"Composições!F710","v":8910.19},{"$f":"TRUNC((D95*K95),2)","v":8910.19}]
["SINAPI C 3220","15.2","SIMULADOR DE CAMINHADA TRIPLO CONJUGADO - GALVANIZADO",1,"un",{"$f":"Composições!C735","v":13224.66},{"$f":"Composições!C738","v":24.08},13248.74,15036.43,29.41,{"$f":"Composições!F745","v":15065.84},15065.84]
["SINAPI C 3230","15.3","ESQUI TRIPLO CONJUGADO - GALVANIZADO",1,"un",{"$f":"Composições!C750","v":16140},{"$f":"Composições!C753","v":24.08},16164.08,18351.18,29.41,{"$f":"Composições!F760","v":18380.59},18380.59]
["SINAPI C 3235","15.4","ADUÇÃO E ABDUÇÃO DE PERNAS DUPLO - GALVANIZADO",1,"un",{"$f":"Composições!C766+Composições!C768","v":9193.3799999999992},{"$f":"Composições!C771","v":28.77},9222.15,10456.539999999999,35.14,{"$f":"Composições!F778","v":10491.679999999998},10491.68]
["SINAPI C 3245","15.5","MULTIEXERCITADOR CONJUGADO 6 FUNÇÕES - GALVANIZADO",1,"un",{"$f":"Composições!C802","v":16191.33},{"$f":"Composições!C805","v":28.36},16219.69,18409.54,34.64,{"$f":"Composições!F812","v":18444.18},18444.18]
["SINAPI C 3252","15.6","SIMULADOR DE REMO - GALVANIZADO",1,"un",{"$f":"Composições!C818","v":5640},{"$f":"Composições!C821","v":24.08},5664.08,6412.68,29.41,{"$f":"Composições!F828","v":6442.09},6442.09]
["SINAPI C 3276","15.7","REMADA ESPECIAL PPNE - GALVANIZADA",1,"un",{"$f":"Composições!C888","v":5940},{"$f":"Composições!C891","v":18.899999999999999},5958.9,6753.78,23.08,{"$f":"Composições!F898","v":6776.86},6776.86]
["SINAPI C 3280","15.8","VOADOR PEITORAL E VOADOR DORSAL - GALVANIZADO",1,"un",{"$f":"Composições!C904+Composições!C906","v":6243.38},{"$f":"Composições!C909","v":28.77},6272.1500000000005,7102.3899999999994,35.14,{"$f":"Composições!F916","v":7137.53},7137.53]
[null,"TOTAL DE ACADEMIA AO AR LIVRE",{"$nulls":9},{"$f":"SUM(L95:L102)","v":91648.959999999992}]
[null,16,"PLANTIO"]
["SINAPI C 4105","16.1","PLANTIO DE GRAMA CATARINA COM COMPOSTO ORGÂNICO",52,"m²",{"$f":"Composições!C2102","v":24.439999999999998},{"$f":"Composições!C2105","v":3.45},{"$f":"+F105+G105","v":27.889999999999997},{"$f":"+K105-J105","v":29.849999999999994},{"$f":"+TRUNC((G105*(1+$L$11)),2)","v":4.21},{"$f":"Composições!F2111","v":34.059999999999995},{"$f":"TRUNC((D105*K105),2)","v":1771.12}]
[null,"TOTAL DE PLANTIO",{"$nulls":9},{"$f":"SUM(L104:L105)","v":1771.12}]
[null,"SUBTOTAL PRAÇA IRENE ELISALDE STRICHER (2)",{"$nulls":9},{"$f":"SUM(L64:L106)/2","v":151555.88999999998}]
[]
["PRAÇA JOSÉ MARIANO DE FREITAS BECK (164/09)"]
["Composição","Item","Descrição","Quantidade","Un","Custo Unit.Mat.+Eq.","Custo Unit. M.O.","Custo Unit.","Preço Unit.Mat.+Eq.","Preço Unit. M.O.","Preço Unit.","Total"]
[null,17,"SERVIÇOS PRELIMINARES"]
[{"$f":"CONCATENATE(\"SMAMS \",Composições!A11)","v":"SMAMS 25"},"17.1","REMOÇÃO DE PASSEIOS - SEM REMOÇÃO DE ENTULHOS",7,"m²",0,{"$f":"+Composições!C14","v":8.11},{"$f":"+F112+G112","v":8.11},{"$f":"+K112-J112","v":0},{"$f":"+TRUNC((G112*(1+$L$11)),2)","v":9.9},{"$f":"+Composições!F20","v":9.8999999999999986},{"$f":"TRUNC((D112*K112),2)","v":69.3}]
["SMAMS 390","17.2","REMOÇÃO DE ENTULHOS COM CAÇAMBA 4M³",0.69,"m³",{"$f":"Composições!C26","v":110.83},{"$f":"Composições!C28","v":11.97},{"$f":"+F113+G113","v":122.8},{"$f":"+K113-J113","v":135.38},{"$f":"+TRUNC((G113*(1+$L$11)),2)","v":14.62},{"$f":"Composições!F34","v":150},{"$f":"TRUNC((D113*K113),2)","v":103.5}]
[null,"TOTAL DE SERVIÇOS PRELIMINARES",{"$nulls":9},{"$f":"SUM(L112:L113)","v":172.8}]
[null,18,"INSTALAÇÕES PROVISÓRIAS"]
["SMAMS 500","18.1","TAPUME EM CHAPA DE COMPENSADO RESINADO (L=7,70m; C=11,00m e H=2,20M)",82.28,"m²",{"$f":"Composições!C96","v":26.48},{"$f":"Composições!C101","v":41.089999999999996},{"$f":"+F116+G116","v":67.569999999999993},{"$f":"+K116-J116","v":32.3386},{"$f":"+TRUNC((G116*(1+$L$11)),4)","v":50.191400000000002},{"$f":"Composições!F107","v":82.53},{"$f":"TRUNC((D116*K116),2)","v":6790.56}]
[{"$f":"CONCATENATE(\"SMAMS \",Composições!A110)","v":"SMAMS 510"},"18.2","LOCAÇÃO DE BANHEIRO QUÍMICO",100,"%",{"$f":"Composições!C112","v":6.8},0,{"$f":"+F117+G117","v":6.8},{"$f":"+K117-J117","v":8.3062000000000005},{"$f":"+TRUNC((G117*(1+$L$11)),4)","v":0},{"$f":"Composições!F118","v":8.3062000000000005},{"$f":"TRUNC((D117*K117),2)","v":830.62}]
["SMAMS 520","18.3","FRETE P/ BANHEIRO QUÍMICO LOCADO (IDA E VOLTA)",1,"cj",{"$f":"Composições!C125","v":888.65},0,{"$f":"+F118+G118","v":888.65},{"$f":"+K118-J118","v":1085.48},{"$f":"+TRUNC((G118*(1+$L$11)),4)","v":0},{"$f":"Composições!F131","v":1085.48},{"$f":"TRUNC((D118*K118),2)","v":1085.48}]
["SMAMS 530","18.4","INSTALAÇÃO PROVISÓRIA DE ENERGIA, AÉREA, BIFÁSICA, COM CAIXA DE EMBUTIR C/ POSTE H=9,00M",1,"pt",{"$f":"Composições!C156","v":2353.6200000000003},{"$f":"Composições!C159","v":86},{"$f":"+F119+G119","v":2439.6200000000003},{"$f":"+K119-J119","v":2874.9410000000003},{"$f":"+TRUNC((G119*(1+$L$11)),4)","v":105.04900000000001},{"$f":"Composições!F166","v":2979.9900000000002},{"$f":"TRUNC((D119*K119),2)","v":2979.99}]
["SMAMS 535","18.5","INSTALAÇÃO PROVISÓRIA DE ÁGUA",1,"pt",{"$f":"Composições!C178","v":734.47},{"$f":"Composições!C160","v":0},{"$f":"+F120+G120","v":734.47},{"$f":"+K120-J120","v":897.15000000000009},{"$f":"+TRUNC((G120*(1+$L$11)),4)","v":0},{"$f":"Composições!F184","v":897.15000000000009},{"$f":"TRUNC((D120*K120),2)","v":897.15}]
["SMAMS 542","18.6","PLACA DE OBRA EM CHAPA GALVANIZADA",2.5,"m²",{"$f":"Composições!C196","v":281.44},{"$f":"Composições!C201","v":21.639999999999997},{"$f":"+F121+G121","v":303.08},{"$f":"+K121-J121","v":343.77679999999998},{"$f":"+TRUNC((G121*(1+$L$11)),4)","v":26.433199999999999},{"$f":"Composições!F207","v":370.21},{"$f":"TRUNC((D121*K121),2)","v":925.52}]
["SMAMS 552","18.7","SINALIZAÇÃO COM TELA PLÁSTICA LARANJA FIXADA EM CONE PLÁSTICO",55,"m",{"$f":"Composições!C214","v":22.339999999999996},{"$f":"Composições!C217","v":5.6899999999999995},{"$f":"+F122+G122","v":28.029999999999994},27.279699999999998,6.9503000000000004,{"$f":"Composições!F223","v":34.229999999999997},1882.65]
["SINAPI C 99064","18.8","LOCAÇÃO DE OBRA",51,"m",0,{"$f":"Composições!C228","v":0.51},0.51,-2.9000000000000137E-3,0.62290000000000001,{"$f":"Composições!F234","v":0.62},31.62]
["SMAMS 565","18.9","NIVELAMENTO",183.38,"m²",{"$f":"Composições!C240","v":0.03},{"$f":"Composições!C244","v":0.22},0.25,3.999999999999998E-2,{"$f":"+TRUNC((G124*(1+$L$11)),2)","v":0.26},{"$f":"Composições!F250","v":0.3},55.01]
[null,"TOTAL DE INSTALAÇÕES PROVISÓRIAS",{"$nulls":9},{"$f":"SUM(L116:L124)","v":15478.6}]
[null,19,"ADMINISTRAÇÃO LOCAL"]
[{"$f":"CONCATENATE(\"SMAMS \",Composições!A268)","v":"SMAMS 700"},"19.1","ADMINISTRAÇÃO LOCAL",100,"%",0,{"$f":"Composições!C276","v":202.7122},{"$f":"+F127+G127","v":202.7122},{"$f":"+K127-J127","v":0},{"$f":"+TRUNC((G127*(1+$L$11)),4)","v":247.6129},{"$f":"Composições!F282","v":247.6129},{"$f":"TRUNC((D127*K127),2)","v":24761.29}]
[null,"TOTAL DE ADMINISTRAÇÃO LOCAL",{"$nulls":9},{"$f":"SUM(L127)","v":24761.29}]
[null,20,"MOVIMENTO DE TERRA"]
["SMAMS 1002","20.1","MODELAGEM (MOVIMENTO DE TERRA ATÉ 15CM)",183.38,"m²",{"$f":"Composições!C313","v":0.08},{"$f":"Composições!C316","v":2.34},{"$f":"+F130+G130","v":2.42},{"$f":"+K130-J130","v":0.10000000000000009},{"$f":"+TRUNC((G130*(1+$L$11)),2)","v":2.85},{"$f":"Composições!F322","v":2.95},{"$f":"TRUNC((D130*K130),2)","v":540.97}]
["SMAMS 1010","20.2","ATERRO MANUAL C/MATERIAL IMPORTADO C/COMPACTAÇÃO MANUAL",13.05,"m³",{"$f":"Composições!C338","v":39.479999999999997},{"$f":"Composições!C340","v":41.04},{"$f":"+F131+G131","v":80.52},{"$f":"+K131-J131","v":48.219999999999992},{"$f":"+TRUNC((G131*(1+$L$11)),2)","v":50.13},{"$f":"Composições!F346","v":98.35},{"$f":"TRUNC((D131*K131),2)","v":1283.46}]
[null,"TOTAL DE MOVIMENTO DE TERRA",{"$nulls":9},{"$f":"SUM(L130:L131)","v":1824.43}]
[null,21,"PAVIMENTAÇÃO"]
["SINAPI C 94994","21.1","EXECUÇÃO DE PASSEIO (CALÇADA) OU PISO DE CONCRETO COM CONCRETO USINADO, MOLDADO IN LOCO,  ACABAMENTO VASSOURADO, ESPESSURA 8 CM, ARMADO",3,"m²",{"$f":"Composições!C356","v":97.59},{"$f":"Composições!C360","v":17.25},{"$f":"+F134+G134","v":114.84},{"$f":"+K134-J134","v":119.20000000000002},{"$f":"+TRUNC((G134*(1+$L$11)),2)","v":21.07},{"$f":"Composições!F366","v":140.27000000000001},{"$f":"TRUNC((D134*K134),2)","v":420.81}]
[{"$f":"CONCATENATE(\"SMAMS \",Composições!A370)","v":"SMAMS 2023"},"21.2","PISO CONCRETO ARMADO E= 10 cm - ACADEMIA AO AR LIVRE",130.5,"m²",{"$f":"+Composições!C385","v":81.759999999999991},{"$f":"Composições!C391","v":15.1},{"$f":"+F135+G135","v":96.859999999999985},{"$f":"+K135-J135","v":99.86999999999999},{"$f":"+TRUNC((G135*(1+$L$11)),2)","v":18.440000000000001},{"$f":"Composições!F397","v":118.30999999999999},{"$f":"TRUNC((D135*K135),2)","v":15439.45}]
[{"$f":"CONCATENATE(\"SMAMS \",Composições!A403)","v":"SMAMS 2040"},"21.3","LAJE DE GRÊS ASSENTADA NA AREIA",4,"m²",{"$f":"+Composições!C407","v":28.45},{"$f":"+Composições!C410","v":27.009999999999998},55.459999999999994,34.749999999999993,32.99,{"$f":"+Composições!F416","v":67.739999999999995},270.95999999999998]
[{"$f":"CONCATENATE(\"SMAMS \",Composições!A421)","v":"SMAMS 2070"},"21.4","PISO PODOTÁTIL 25x25 cm - E=2,0cm",1.5,"m",{"$f":"+Composições!C427","v":19.529999999999998},{"$f":"+Composições!C430","v":8.14},27.669999999999998,23.85,9.94,{"$f":"+Composições!F436","v":33.79},50.68]
[null,"TOTAL DE PAVIMENTAÇÃO",{"$nulls":9},{"$f":"SUM(L134:L137)","v":16181.9}]
[null,22,"ACESSIBILIDADE"]
["SMAMS 2308","22.1","RAMPA PPNE'S TIPO 1 - 1,80 m (ABA 1,50 m)",1,"un",{"$f":"Composições!C457","v":553.16999999999996},{"$f":"Composições!C463","v":363.2},{"$f":"+F140+G140","v":916.36999999999989},{"$f":"+K140-J140","v":675.69999999999993},{"$f":"+TRUNC((G140*(1+$L$11)),2)","v":443.64},{"$f":"Composições!F469","v":1119.3399999999999},{"$f":"TRUNC((D140*K140),2)","v":1119.3399999999999}]
[null,"TOTAL DE ACESSIBILIDADE",{"$nulls":9},{"$f":"SUM(L140:L140)","v":1119.3399999999999}]
[null,23,"MOBILIÁRIO URBANO"]
[{"$f":"CONCATENATE(\"SMAMS \",Composições!A473)","v":"SMAMS 2601"},"23.1","BANCO B (C/ ENCOSTO) - L=2,00 m - PADRÃO SMAM",2,"un",{"$f":"+Composições!C493","v":1021.8400000000001},{"$f":"+Composições!C500","v":355.29},{"$f":"+F143+G143","v":1377.13},{"$f":"+K143-J143","v":1248.18},{"$f":"+TRUNC((G143*(1+$L$11)),2)","v":433.98},{"$f":"+Composições!F506","v":1682.16},{"$f":"TRUNC((D143*K143),2)","v":3364.32}]
[{"$f":"CONCATENATE(\"SMAMS \",Composições!A599)","v":"SMAMS 2671"},"23.2","LIXEIRA METÁLICA - V=30 LITROS INSTALADA",1,"un",{"$f":"+Composições!C603","v":971.95},{"$f":"+Composições!C606","v":52.81},1024.76,1187.24,64.5,{"$f":"+Composições!F612","v":1251.74},1251.74]
[null,"TOTAL DE EQUIPAMENTOS/MOBILIÁRIO URBANO",{"$nulls":9},{"$f":"SUM(L143:L144)","v":4616.0600000000004}]
[null,24,"ACADEMIA AO AR LIVRE - GALVANIZADA"]
[{"$f":"CONCATENATE(\"SMAMS \",Composições!A695)","v":"SMAMS 3205"},"24.1","PLACA ORIENTATIVA - GALVANIZADA",1,"un",{"$f":"+Composições!C698+Composições!C700","v":7782.09},{"$f":"+Composições!C703","v":44.72},{"$f":"+F147+G147","v":7826.81},{"$f":"+K147-J147","v":8855.57},{"$f":"+TRUNC((G147*(1+$L$11)),2)","v":54.62},{"$f":"+Composições!F710","v":8910.19},{"$f":"TRUNC((D147*K147),2)","v":8910.19}]
["SMAMS 3212","24.2","JOGO DE BARRAS - GALVANIZADO",1,"un",{"$f":"Composições!C717+Composições!C719","v":9532.86},{"$f":"Composições!C722","v":75.44},{"$f":"+F148+G148","v":9608.3000000000011},{"$f":"+K148-J148","v":10853.52},{"$f":"+TRUNC((G148*(1+$L$11)),2)","v":92.14},{"$f":"Composições!F729","v":10945.66},{"$f":"TRUNC((D148*K148),2)","v":10945.66}]
[{"$f":"CONCATENATE(\"SMAMS \",Composições!A733)","v":"SMAMS 3220"},"24.3","SIMULADOR DE CAMINHADA TRIPLO CONJUGADO - GALVANIZADO",1,"un",{"$f":"+Composições!C735","v":13224.66},{"$f":"+Composições!C738","v":24.08},13248.74,15036.43,29.41,{"$f":"+Composições!F745","v":15065.84},15065.84]
[{"$f":"CONCATENATE(\"SMAMS \",Composições!A763)","v":"SMAMS 3235"},"24.4","ADUÇÃO E ABDUÇÃO DE PERNAS DUPLO - GALVANIZADO",1,"un",{"$f":"+Composições!C766+Composições!C768","v":9193.3799999999992},{"$f":"+Composições!C771","v":28.77},9222.15,10456.539999999999,35.14,{"$f":"+Composições!F778","v":10491.679999999998},10491.68]
[{"$f":"CONCATENATE(\"SMAMS \",Composições!A781)","v":"SMAMS 3240"},"24.5","PRESSÃO DE PERNAS TRIPLO CONJUGADO - GALVANIZADO",1,"un",{"$f":"+Composições!C784+Composições!C786","v":9515.3799999999992},{"$f":"+Composições!C789","v":28.77},9544.15,10822.65,35.14,{"$f":"+Composições!F796","v":10857.789999999999},10857.79]
[{"$f":"CONCATENATE(\"SMAMS \",Composições!A816)","v":"SMAMS 3252"},"24.6","SIMULADOR DE REMO - GALVANIZADO",1,"un",{"$f":"+Composições!F817","v":5640},{"$f":"+Composições!C821","v":24.08},5664.08,6412.68,29.41,{"$f":"+Composições!F828","v":6442.09},6442.09]
[{"$f":"CONCATENATE(\"SMAMS \",Composições!A868)","v":"SMAMS 3270"},"24.7","ABDOMINAL SIMPLES - GALVANIZADO",1,"un",{"$f":"+Composições!C871+Composições!C873","v":4980.04},{"$f":"+Composições!C876","v":28.77},5008.8100000000004,5665.9699999999993,35.14,{"$f":"+Composições!F883","v":5701.11},5701.11]
[{"$f":"CONCATENATE(\"SMAMS \",Composições!A886)","v":"SMAMS 3276"},"24.8","REMADA ESPECIAL PPNE - GALVANIZADA",1,"un",{"$f":"+Composições!C888","v":5940},{"$f":"+Composições!C891","v":18.899999999999999},5958.9,6753.78,23.08,{"$f":"+Composições!F898","v":6776.86},6776.86]
[{"$f":"CONCATENATE(\"SMAMS \",Composições!A901)","v":"SMAMS 3280"},"24.9","VOADOR PEITORAL E VOADOR DORSAL - GALVANIZADO",1,"un",{"$f":"+Composições!C904+Composições!C906","v":6243.38},{"$f":"+Composições!C909","v":28.77},6272.1500000000005,7102.3899999999994,35.14,{"$f":"+Composições!F916","v":7137.53},7137.53]
[null,"TOTAL DE ACADEMIA AO AR LIVRE",{"$nulls":9},{"$f":"SUM(L147:L155)","v":82328.75}]
[null,25,"PLANTIO"]
[{"$f":"CONCATENATE(\"SMAMS \",Composições!A2099)","v":"SMAMS 4105"},"25.1","PLANTIO DE GRAMA CATARINA COM COMPOSTO ORGÂNICO",49.5,"m²",{"$f":"+Composições!C2102","v":24.439999999999998},{"$f":"+Composições!C2105","v":3.45},{"$f":"+F158+G158","v":27.889999999999997},{"$f":"+K158-J158","v":29.849999999999994},{"$f":"+TRUNC((G158*(1+$L$11)),2)","v":4.21},{"$f":"+Composições!F2111","v":34.059999999999995},{"$f":"TRUNC((D158*K158),2)","v":1685.97}]
[null,"TOTAL DE PLANTIO",{"$nulls":9},{"$f":"SUM(L158:L158)","v":1685.97}]
[null,"SUBTOTAL PRAÇA JOSÉ MARIANO DE FREITAS BECK (3)",{"$nulls":9},{"$f":"SUM(L112:L159)/2","v":148169.13999999996}]
[]
[]
[null,"TOTAL OBRA (1) + (2) + (3)",{"$nulls":9},{"$f":"L160+L107+L59","v":451445.02999999985}]

{"sheet":"Cronograma","index":1,"n_rows":126,"n_cols":31,"rows_kept":126,"cut":false,"hidden":false,"merged":[[2,1,2,8],[8,1,8,8],[45,1,45,8],[82,1,82,8],[124,0,124,1],[124,2,125,2],[125,0,125,1],[6,3,6,4],[6,1,7,1],[6,2,7,2],[1,28,5,30],[0,28,0,30],[3,2,3,8],[0,0,0,26],[6,5,6,6],[6,7,6,8],[6,9,6,10],[6,11,6,12],[6,13,6,14],[6,21,6,22],[6,23,6,24],[6,25,6,26],[6,15,6,16],[6,17,6,18],[6,19,6,20],[6,0,7,0]]}
["CRONOGRAMA FÍSICO-FINANCEIRO",{"$nulls":27},"INSTRUÇÕES"]
[{"$nulls":28},"*Preencher com as porcentagens de cada item.     *Ocultar colunas não utilizadas (não deletar).                                 *As linhas devem ser ocultadas, nunca deletadas.    *Não preencher as porcentagens de engenheiro, mestre e encarregado."]
["OBJETO:",{"$f":"+PO!$B$9","v":"Obras de Aquisição e Instalação de Academias de Ginástica ao ar livre na Praça Professor Emílio Mabilde Rípole (155/02), Praça Irene Elisalde Stricher (145/10) e Praça José Mariano de Freitas Beck (164/09)."}]
["DATA:",{"$f":"IF(PO!$B$10=\"\",\"\",PO!$B$10)","v":"2021-08-10"},{"$f":"+PO!B3:L3","v":0}]
["ART nº:",{"$f":"IF(PO!$B$11=\"\",\"\",PO!$B$11)","v":""}]
[]
["ITEM","SERVIÇO","VALOR DO SERVIÇO","30 dias",null,"60 dias",null,"90 dias",null,"120 dias",null,"150 dias",null,"180 dias",null,"210 dias",null,"240 dias",null,"270 dias",null,"300 dias",null,"330 dias",null,"360 dias"]
[null,null,null,"%","Valor","%","Valor","%","Valor","%","Valor","%","Valor","%","Valor","%","Valor","%","Valor","%","Valor","%","Valor","%","Valor","%","Valor"]
[null,"PRAÇA PROFESSOR EMÍLIO MABILDE RÍPOLE"]
[1,"DESPESAS LEGAIS, LICENÇAS, TAXAS, CONTRIBUIÇÕES"]
["1.1","ART (ANOTAÇÃO DE RESPONSABILIDADE TÉCNICA)",{"$f":"PO!L16","v":276.05},1,{"$f":"D11*$C11","v":276.05},null,{"$f":"F11*$C11","v":0},null,{"$f":"H11*$C11","v":0},null,{"$f":"J11*$C11","v":0},null,{"$f":"L11*$C11","v":0},null,{"$f":"N11*$C11","v":0},null,{"$f":"P11*$C11","v":0},null,{"$f":"R11*$C11","v":0},null,{"$f":"T11*$C11","v":0},null,{"$f":"V11*$C11","v":0},null,{"$f":"X11*$C11","v":0},null,{"$f":"Z11*$C11","v":0},null,{"$f":"+D11+F11+H11+J11+L11+N11+P11+R11+T11+V11+X11+Z11","v":1},276.05,{"$f":"IF(C11=AD11,\"ok!\",\"incompleto\")","v":"ok!"}]
[2,"INSTALAÇÕES PROVISÓRIAS"]
["2.1","TAPUME EM CHAPA DE COMPENSADO RESINADO (L=9,90m; C=15,40m e H=2,20M)",{"$f":"PO!L19","v":9187.23},1,9187.23,null,{"$f":"F13*$C13","v":0},null,0,null,{"$f":"J13*$C13","v":0},null,{"$f":"L13*$C13","v":0},null,{"$f":"N13*$C13","v":0},null,{"$f":"P13*$C13","v":0},null,{"$f":"R13*$C13","v":0},null,{"$f":"T13*$C13","v":0},null,{"$f":"V13*$C13","v":0},null,{"$f":"X13*$C13","v":0},null,{"$f":"Z13*$C13","v":0},null,{"$f":"+D13+F13+H13+J13+L13+N13+P13+R13+T13+V13+X13+Z13","v":1},{"$f":"+E13+G13+I13+K13+M13+O13+Q13+S13+U13+W13+Y13+AA13","v":9187.23},{"$f":"IF(C13=AD13,\"ok!\",\"incompleto\")","v":"ok!"}]
["2.2","LOCAÇÃO DE BANHEIRO QUÍMICO",{"$f":"PO!L20","v":830.62},1,830.62,null,0,null,0,null,0,null,0,null,0,null,0,null,0,null,0,null,0,null,0,null,0,null,1,830.62,"ok!"]
["2.3","FRETE P/ BANHEIRO QUÍMICO LOCADO (IDA E VOLTA)",{"$f":"PO!L21","v":1085.48},1,{"$f":"D15*$C15","v":1085.48},null,{"$f":"F15*$C15","v":0},null,{"$f":"H15*$C15","v":0},null,{"$f":"J15*$C15","v":0},null,{"$f":"L15*$C15","v":0},null,{"$f":"N15*$C15","v":0},null,{"$f":"P15*$C15","v":0},null,{"$f":"R15*$C15","v":0},null,{"$f":"T15*$C15","v":0},null,{"$f":"V15*$C15","v":0},null,{"$f":"X15*$C15","v":0},null,{"$f":"Z15*$C15","v":0},null,{"$f":"+D15+F15+H15+J15+L15+N15+P15+R15+T15+V15+X15+Z15","v":1},{"$f":"+E15+G15+I15+K15+M15+O15+Q15+S15+U15+W15+Y15+AA15","v":1085.48},{"$f":"IF(C15=AD15,\"ok!\",\"incompleto\")","v":"ok!"}]
["2.4","INSTALAÇÃO PROVISÓRIA DE ENERGIA, AÉREA, BIFÁSICA, COM CAIXA DE EMBUTIR C/ POSTE H=9,00M",{"$f":"PO!L22","v":2979.99},1,2979.99,null,0,null,0,null,0,null,0,null,0,null,0,null,0,null,0,null,0,null,0,null,0,null,1,2979.99,"ok!"]
["2.5","INSTALAÇÃO PROVISÓRIA DE ÁGUA",{"$f":"PO!L23","v":897.15},1,897.15,null,0,null,0,null,0,null,0,null,0,null,0,null,0,null,0,null,0,null,0,null,0,null,1,897.15,"ok!"]
["2.6","PLACA DE OBRA",{"$f":"PO!L24","v":925.52},1,{"$f":"D18*$C18","v":925.52},null,{"$f":"F18*$C18","v":0},null,{"$f":"H18*$C18","v":0},null,{"$f":"J18*$C18","v":0},null,{"$f":"L18*$C18","v":0},null,{"$f":"N18*$C18","v":0},null,{"$f":"P18*$C18","v":0},null,{"$f":"R18*$C18","v":0},null,{"$f":"T18*$C18","v":0},null,{"$f":"V18*$C18","v":0},null,{"$f":"X18*$C18","v":0},null,{"$f":"Z18*$C18","v":0},null,{"$f":"+D18+F18+H18+J18+L18+N18+P18+R18+T18+V18+X18+Z18","v":1},{"$f":"+E18+G18+I18+K18+M18+O18+Q18+S18+U18+W18+Y18+AA18","v":925.52},{"$f":"IF(C18=AD18,\"ok!\",\"incompleto\")","v":"ok!"}]
["2.7","LOCAÇÃO DE OBRA",{"$f":"PO!L25","v":30.38},1,30.38,null,0,null,0,null,0,null,0,null,0,null,0,null,0,null,0,null,0,null,0,null,0,null,1,30.38,"ok!"]
["2.8","NIVELAMENTO",{"$f":"PO!L26","v":50.55},1,{"$f":"D20*$C20","v":50.55},null,{"$f":"F20*$C20","v":0},null,{"$f":"H20*$C20","v":0},null,{"$f":"J20*$C20","v":0},null,{"$f":"L20*$C20","v":0},null,{"$f":"N20*$C20","v":0},null,{"$f":"P20*$C20","v":0},null,{"$f":"R20*$C20","v":0},null,{"$f":"T20*$C20","v":0},null,{"$f":"V20*$C20","v":0},null,{"$f":"X20*$C20","v":0},null,{"$f":"Z20*$C20","v":0},null,{"$f":"+D20+F20+H20+J20+L20+N20+P20+R20+T20+V20+X20+Z20","v":1},{"$f":"+E20+G20+I20+K20+M20+O20+Q20+S20+U20+W20+Y20+AA20","v":50.55},{"$f":"IF(C20=AD20,\"ok!\",\"incompleto\")","v":"ok!"}]
[3,"ADMINISTRAÇÃO LOCAL"]
["3.1","ADMINISTRAÇÃO LOCAL",{"$f":"PO!L29","v":24761.29},1,{"$f":"D22*$C22","v":24761.29},null,{"$f":"F22*$C22","v":0},null,{"$f":"H22*$C22","v":0},null,{"$f":"J22*$C22","v":0},null,{"$f":"L22*$C22","v":0},null,{"$f":"N22*$C22","v":0},null,{"$f":"P22*$C22","v":0},null,{"$f":"R22*$C22","v":0},null,{"$f":"T22*$C22","v":0},null,{"$f":"V22*$C22","v":0},null,{"$f":"X22*$C22","v":0},null,{"$f":"Z22*$C22","v":0},null,{"$f":"+D22+F22+H22+J22+L22+N22+P22+R22+T22+V22+X22+Z22","v":1},{"$f":"+E22+G22+I22+K22+M22+O22+Q22+S22+U22+W22+Y22+AA22","v":24761.29},{"$f":"IF(C22=AD22,\"ok!\",\"incompleto\")","v":"ok!"}]
[4,"MOVIMENTO DE TERRA"]
["4.1","MODELAGEM (MOVIMENTO DE TERRA ATÉ 15CM)",{"$f":"PO!L32","v":497.07},1,{"$f":"D24*$C24","v":497.07},null,{"$f":"F24*$C24","v":0},null,{"$f":"H24*$C24","v":0},null,{"$f":"J24*$C24","v":0},null,{"$f":"L24*$C24","v":0},null,{"$f":"N24*$C24","v":0},null,{"$f":"P24*$C24","v":0},null,{"$f":"R24*$C24","v":0},null,{"$f":"T24*$C24","v":0},null,{"$f":"V24*$C24","v":0},null,{"$f":"X24*$C24","v":0},null,{"$f":"Z24*$C24","v":0},null,{"$f":"+D24+F24+H24+J24+L24+N24+P24+R24+T24+V24+X24+Z24","v":1},497.07,{"$f":"IF(C24=AD24,\"ok!\",\"incompleto\")","v":"ok!"}]
["4.2","ATERRO MANUAL C/MATERIAL IMPORTADO C/COMPACTAÇÃO MANUAL",{"$f":"PO!L33","v":1180.2},1,1180.2,null,0,null,0,null,0,null,0,null,0,null,0,null,0,null,0,null,0,null,0,null,0,null,1,1180.2,"ok!"]
[5,"PAVIMENTAÇÃO"]
["5.1","EXECUÇÃO DE PASSEIO (CALÇADA) OU PISO DE CONCRETO COM CONCRETO MOLDADO IN LOCO, FEITO EM OBRA, ACABAMENTO CONVENCIONAL, ESPESSURA 8 CM, ARMADO",{"$f":"PO!L36","v":315.60000000000002},1,315.60000000000002,null,0,null,0,null,0,null,0,null,0,null,0,null,0,null,0,null,0,null,0,null,0,null,{"$f":"+D27+F27+H27+J27+L27+N27+P27+R27+T27+V27+X27+Z27","v":1},{"$f":"+E27+G27+I27+K27+M27+O27+Q27+S27+U27+W27+Y27+AA27","v":315.60000000000002},{"$f":"IF(C27=AD27,\"ok!\",\"incompleto\")","v":"ok!"}]
["5.2","PISO CONCRETO ARMADO E= 10 cm - ACADEMIA AO AR LIVRE",{"$f":"PO!L37","v":13723.96},1,13723.96,null,0,null,0,null,0,null,0,null,0,null,0,null,0,null,0,null,0,null,0,null,0,null,1,13723.96,"ok!"]
["5.3","PISO PODOTÁTIL 25x25 cm - E=2,5CM",{"$f":"PO!L38","v":101.37},1,101.37,null,0,null,0,null,0,null,0,null,0,null,0,null,0,null,0,null,0,null,0,null,0,null,1,101.37,"ok!"]
[6,"MOBILIÁRIO URBANO"]
["6.1","BANCO B (C/ ENCOSTO) - L=2,00 m - PADRÃO SMAM",{"$f":"PO!L41","v":3364.32},1,{"$f":"D31*$C31","v":3364.32},null,{"$f":"F31*$C31","v":0},null,{"$f":"H31*$C31","v":0},null,{"$f":"J31*$C31","v":0},null,{"$f":"L31*$C31","v":0},null,{"$f":"N31*$C31","v":0},null,{"$f":"P31*$C31","v":0},null,{"$f":"R31*$C31","v":0},null,{"$f":"T31*$C31","v":0},null,{"$f":"V31*$C31","v":0},null,{"$f":"X31*$C31","v":0},null,{"$f":"Z31*$C31","v":0},null,{"$f":"+D31+F31+H31+J31+L31+N31+P31+R31+T31+V31+X31+Z31","v":1},{"$f":"+E31+G31+I31+K31+M31+O31+Q31+S31+U31+W31+Y31+AA31","v":3364.32},{"$f":"IF(C31=AD31,\"ok!\",\"incompleto\")","v":"ok!"}]
["6.2","LIXEIRA METÁLICA - V=30 LITROS INSTALADA",{"$f":"PO!L42","v":1251.74},1,{"$f":"D32*$C32","v":1251.74},null,{"$f":"F32*$C32","v":0},null,{"$f":"H32*$C32","v":0},null,{"$f":"J32*$C32","v":0},null,{"$f":"L32*$C32","v":0},null,{"$f":"N32*$C32","v":0},null,{"$f":"P32*$C32","v":0},null,{"$f":"R32*$C32","v":0},null,{"$f":"T32*$C32","v":0},null,{"$f":"V32*$C32","v":0},null,{"$f":"X32*$C32","v":0},null,{"$f":"Z32*$C32","v":0},null,{"$f":"+D32+F32+H32+J32+L32+N32+P32+R32+T32+V32+X32+Z32","v":1},1251.74,{"$f":"IF(C32=AD32,\"ok!\",\"incompleto\")","v":"ok!"}]
[7,"ACADEMIA AO AR LIVRE"]
["7.1","PLACA ORIENTATIVA - GALVANIZADA",{"$f":"PO!L45","v":8910.19},1,{"$f":"D34*$C34","v":8910.19},null,{"$f":"F34*$C34","v":0},null,{"$f":"H34*$C34","v":0},null,{"$f":"J34*$C34","v":0},null,{"$f":"L34*$C34","v":0},null,{"$f":"N34*$C34","v":0},null,{"$f":"P34*$C34","v":0},null,{"$f":"R34*$C34","v":0},null,{"$f":"T34*$C34","v":0},null,{"$f":"V34*$C34","v":0},null,{"$f":"X34*$C34","v":0},null,{"$f":"Z34*$C34","v":0},null,{"$f":"+D34+F34+H34+J34+L34+N34+P34+R34+T34+V34+X34+Z34","v":1},8910.19,{"$f":"IF(C34=AD34,\"ok!\",\"incompleto\")","v":"ok!"}]
["7.2","ESPALDAR PADRÃO SMAMS",{"$f":"PO!L46","v":2735.72},1,2735.72,null,0,null,0,null,0,null,0,null,0,null,0,null,0,null,0,null,0,null,0,null,0,null,1,2735.72,"ok!"]
["7.3","ABDOMINAL PADRÃO SMAMS",{"$f":"PO!L47","v":1777.22},1,1777.22,null,0,null,0,null,0,null,0,null,0,null,0,null,0,null,0,null,0,null,0,null,0,null,1,1777.22,"ok!"]
["7.4","SIMULADOR DE CAMINHADA TRIPLO CONJUGADO - GALVANIZADO",{"$f":"PO!L48","v":15065.84},1,{"$f":"D37*$C37","v":15065.84},null,{"$f":"F37*$C37","v":0},null,{"$f":"H37*$C37","v":0},null,{"$f":"J37*$C37","v":0},null,{"$f":"L37*$C37","v":0},null,{"$f":"N37*$C37","v":0},null,{"$f":"P37*$C37","v":0},null,{"$f":"R37*$C37","v":0},null,{"$f":"T37*$C37","v":0},null,{"$f":"V37*$C37","v":0},null,{"$f":"X37*$C37","v":0},null,{"$f":"Z37*$C37","v":0},null,{"$f":"+D37+F37+H37+J37+L37+N37+P37+R37+T37+V37+X37+Z37","v":1},{"$f":"+E37+G37+I37+K37+M37+O37+Q37+S37+U37+W37+Y37+AA37","v":15065.84},{"$f":"IF(C37=AD37,\"ok!\",\"incompleto\")","v":"ok!"}]
["7.5","ESQUI TRIPLO CONJUGADO - GALVANIZADO",{"$f":"PO!L49","v":18380.59},1,18380.59,null,0,null,0,null,0,null,0,null,0,null,0,null,0,null,0,null,0,null,0,null,0,null,1,18380.59,"ok!"]
["7.6","ADUÇÃO E ABDUÇÃO DE PERNAS DUPLO - GALVANIZADO",{"$f":"PO!L50","v":10491.68},1,{"$f":"D39*$C39","v":10491.68},null,{"$f":"F39*$C39","v":0},null,{"$f":"H39*$C39","v":0},null,{"$f":"J39*$C39","v":0},null,{"$f":"L39*$C39","v":0},null,{"$f":"N39*$C39","v":0},null,{"$f":"P39*$C39","v":0},null,{"$f":"R39*$C39","v":0},null,{"$f":"T39*$C39","v":0},null,{"$f":"V39*$C39","v":0},null,{"$f":"X39*$C39","v":0},null,{"$f":"Z39*$C39","v":0},null,{"$f":"+D39+F39+H39+J39+L39+N39+P39+R39+T39+V39+X39+Z39","v":1},{"$f":"+E39+G39+I39+K39+M39+O39+Q39+S39+U39+W39+Y39+AA39","v":10491.68},{"$f":"IF(C39=AD39,\"ok!\",\"incompleto\")","v":"ok!"}]
["7.7","PRESSÃO DE PERNAS TRIPLO CONJUGADO - GALVANIZADO",{"$f":"PO!L51","v":10857.79},1,10857.79,null,0,null,0,null,0,null,0,null,0,null,0,null,0,null,0,null,0,null,0,null,0,null,1,10857.79,"ok!"]
["7.8","SIMULADOR DE REMO - GALVANIZADO",{"$f":"PO!L52","v":6442.09},1,6442.09,null,0,null,0,null,0,null,0,null,0,null,0,null,0,null,0,null,0,null,0,null,0,null,1,6442.09,"ok!"]
["7.9","REMADA ESPECIAL PPNE - GALVANIZADA",{"$f":"PO!L53","v":6776.86},1,6776.86,null,0,null,0,null,0,null,0,null,0,null,0,null,0,null,0,null,0,null,0,null,0,null,1,6776.86,"ok!"]
["7.10","VOADOR PEITORAL E VOADOR DORSAL - GALVANIZADO",{"$f":"PO!L54","v":7137.53},1,7137.53,null,0,null,0,null,0,null,0,null,0,null,0,null,0,null,0,null,0,null,0,null,0,null,1,7137.53,"ok!"]
[8,"PLANTIO"]
["8.1","GRAMA CATARINA",{"$f":"PO!L57","v":1685.97},1,{"$f":"D45*$C45","v":1685.97},null,{"$f":"F45*$C45","v":0},null,{"$f":"H45*$C45","v":0},null,{"$f":"J45*$C45","v":0},null,{"$f":"L45*$C45","v":0},null,{"$f":"N45*$C45","v":0},null,{"$f":"P45*$C45","v":0},null,{"$f":"R45*$C45","v":0},null,{"$f":"T45*$C45","v":0},null,{"$f":"V45*$C45","v":0},null,{"$f":"X45*$C45","v":0},null,{"$f":"Z45*$C45","v":0},null,{"$f":"+D45+F45+H45+J45+L45+N45+P45+R45+T45+V45+X45+Z45","v":1},1685.97,{"$f":"IF(C45=AD45,\"ok!\",\"incompleto\")","v":"ok!"}]
[null,"PRAÇA IRENE ELISALDE STRICHER"]
[9,"SERVIÇOS PRELIMINARES"]
["9.1","DEMOLIÇÃO CHURRASQUEIRA C/REMOÇÃO DE ENTULHOS",{"$f":"PO!L64","v":173.58},null,{"$f":"D48*$C48","v":0},1,{"$f":"F48*$C48","v":173.58},null,{"$f":"H48*$C48","v":0},null,{"$f":"J48*$C48","v":0},null,{"$f":"L48*$C48","v":0},null,{"$f":"N48*$C48","v":0},null,{"$f":"P48*$C48","v":0},null,{"$f":"R48*$C48","v":0},null,{"$f":"T48*$C48","v":0},null,{"$f":"V48*$C48","v":0},null,{"$f":"X48*$C48","v":0},null,{"$f":"Z48*$C48","v":0},null,{"$f":"+D48+F48+H48+J48+L48+N48+P48+R48+T48+V48+X48+Z48","v":1},{"$f":"+E48+G48+I48+K48+M48+O48+Q48+S48+U48+W48+Y48+AA48","v":173.58},{"$f":"IF(C48=AD48,\"ok!\",\"incompleto\")","v":"ok!"}]
["9.2","DEMOLIÇÃO MESA E BANCOS DE CONCRETO C/REMOÇÃO DE ENTULHOS",{"$f":"PO!L65","v":205.18},null,{"$f":"D49*$C49","v":0},1,{"$f":"F49*$C49","v":205.18},null,{"$f":"H49*$C49","v":0},null,{"$f":"J49*$C49","v":0},null,{"$f":"L49*$C49","v":0},null,{"$f":"N49*$C49","v":0},null,{"$f":"P49*$C49","v":0},null,{"$f":"R49*$C49","v":0},null,{"$f":"T49*$C49","v":0},null,{"$f":"V49*$C49","v":0},null,{"$f":"X49*$C49","v":0},null,{"$f":"Z49*$C49","v":0},null,{"$f":"+D49+F49+H49+J49+L49+N49+P49+R49+T49+V49+X49+Z49","v":1},{"$f":"+E49+G49+I49+K49+M49+O49+Q49+S49+U49+W49+Y49+AA49","v":205.18},{"$f":"IF(C49=AD49,\"ok!\",\"incompleto\")","v":"ok!"}]
[10,"INSTALAÇÕES PROVISÓRIAS"]
["10.1","TAPUME EM CHAPA DE COMPENSADO RESINADO (L=7,70m; C=11,00m e H=2,20M)",{"$f":"PO!L68","v":6790.56},null,{"$f":"D51*$C51","v":0},1,{"$f":"F51*$C51","v":6790.56},null,{"$f":"H51*$C51","v":0},null,{"$f":"J51*$C51","v":0},null,{"$f":"L51*$C51","v":0},null,{"$f":"N51*$C51","v":0},null,{"$f":"P51*$C51","v":0},null,{"$f":"R51*$C51","v":0},null,{"$f":"T51*$C51","v":0},null,{"$f":"V51*$C51","v":0},null,{"$f":"X51*$C51","v":0},null,{"$f":"Z51*$C51","v":0},null,{"$f":"+D51+F51+H51+J51+L51+N51+P51+R51+T51+V51+X51+Z51","v":1},{"$f":"+E51+G51+I51+K51+M51+O51+Q51+S51+U51+W51+Y51+AA51","v":6790.56},{"$f":"IF(C51=AD51,\"ok!\",\"incompleto\")","v":"ok!"}]
["10.2","LOCAÇÃO DE BANHEIRO QUÍMICO",{"$f":"PO!L69","v":830.62},null,0,1,830.62,null,0,null,0,null,0,null,0,null,0,null,0,null,0,null,0,null,0,null,0,null,1,830.62,"ok!"]
["10.3","FRETE P/ BANHEIRO QUÍMICO LOCADO (IDA E VOLTA)",{"$f":"PO!L70","v":1085.48},null,0,1,1085.48,null,0,null,0,null,0,null,0,null,0,null,0,null,0,null,0,null,0,null,0,null,1,1085.48,"ok!"]
["10.4","INSTALAÇÃO PROVISÓRIA DE ENERGIA, AÉREA, BIFÁSICA, COM CAIXA DE EMBUTIR C/ POSTE H=9,00M",{"$f":"PO!L71","v":2979.99},null,0,1,2979.99,null,0,null,0,null,0,null,0,null,0,null,0,null,0,null,0,null,0,null,0,null,1,2979.99,"ok!"]
["10.5","INSTALAÇÃO PROVISÓRIA DE ÁGUA",{"$f":"PO!L72","v":897.15},null,0,1,897.15,null,0,null,0,null,0,null,0,null,0,null,0,null,0,null,0,null,0,null,0,null,1,897.15,"ok!"]
["10.6","PLACA DE OBRA",{"$f":"PO!L73","v":925.52},null,0,1,925.52,null,0,null,0,null,0,null,0,null,0,null,0,null,0,null,0,null,0,null,0,null,1,925.52,"ok!"]
["10.7","SINALIZAÇÃO COM TELA PLÁSTICA LARANJA FIXADA EM CONE PLÁSTICO",{"$f":"PO!L74","v":1985.34},null,0,1,1985.34,null,0,null,0,null,0,null,0,null,0,null,0,null,0,null,0,null,0,null,0,null,1,1985.34,"ok!"]
["10.8","LOCAÇÃO DE OBRA",{"$f":"PO!L75","v":32.24},null,0,1,32.24,null,0,null,0,null,0,null,0,null,0,null,0,null,0,null,0,null,0,null,0,null,1,32.24,"ok!"]
["10.9","NIVELAMENTO",{"$f":"PO!L76","v":46.2},null,0,1,46.2,null,0,null,0,null,0,null,0,null,0,null,0,null,0,null,0,null,0,null,0,null,1,46.2,"ok!"]
[11,"ADMINISTRAÇÃO LOCAL"]
["11.1","ADMINISTRAÇÃO LOCAL",{"$f":"PO!L79","v":24761.29},null,{"$f":"D61*$C61","v":0},1,{"$f":"F61*$C61","v":24761.29},null,{"$f":"H61*$C61","v":0},null,{"$f":"J61*$C61","v":0},null,{"$f":"L61*$C61","v":0},null,{"$f":"N61*$C61","v":0},null,{"$f":"P61*$C61","v":0},null,{"$f":"R61*$C61","v":0},null,{"$f":"T61*$C61","v":0},null,{"$f":"V61*$C61","v":0},null,{"$f":"X61*$C61","v":0},null,{"$f":"Z61*$C61","v":0},null,{"$f":"+D61+F61+H61+J61+L61+N61+P61+R61+T61+V61+X61+Z61","v":1},{"$f":"+E61+G61+I61+K61+M61+O61+Q61+S61+U61+W61+Y61+AA61","v":24761.29},{"$f":"IF(C61=AD61,\"ok!\",\"incompleto\")","v":"ok!"}]
[12,"MOVIMENTO DE TERRA"]
["12.1","MODELAGEM (MOVIMENTO DE TERRA ATÉ 15CM)",{"$f":"PO!L82","v":454.3},null,{"$f":"D63*$C63","v":0},1,{"$f":"F63*$C63","v":454.3},null,{"$f":"H63*$C63","v":0},null,{"$f":"J63*$C63","v":0},null,{"$f":"L63*$C63","v":0},null,{"$f":"N63*$C63","v":0},null,{"$f":"P63*$C63","v":0},null,{"$f":"R63*$C63","v":0},null,{"$f":"T63*$C63","v":0},null,{"$f":"V63*$C63","v":0},null,{"$f":"X63*$C63","v":0},null,{"$f":"Z63*$C63","v":0},null,{"$f":"+D63+F63+H63+J63+L63+N63+P63+R63+T63+V63+X63+Z63","v":1},{"$f":"+E63+G63+I63+K63+M63+O63+Q63+S63+U63+W63+Y63+AA63","v":454.3},{"$f":"IF(C63=AD63,\"ok!\",\"incompleto\")","v":"ok!"}]
["12.2","ATERRO MANUAL C/MATERIAL IMPORTADO C/COMPACTAÇÃO MANUAL",{"$f":"PO!L83","v":245.87},null,0,1,245.87,null,0,null,0,null,0,null,0,null,0,null,0,null,0,null,0,null,0,null,0,null,1,245.87,"ok!"]
[13,"PAVIMENTAÇÃO"]
["13.1","EXECUÇÃO DE PASSEIO (CALÇADA) OU PISO DE CONCRETO COM CONCRETO MOLDADO IN LOCO, FEITO EM OBRA, ACABAMENTO CONVENCIONAL, ESPESSURA 8 CM, ARMADO",{"$f":"PO!L86","v":140.27000000000001},null,{"$f":"D66*$C66","v":0},1,{"$f":"F66*$C66","v":140.27000000000001},null,{"$f":"H66*$C66","v":0},null,{"$f":"J66*$C66","v":0},null,{"$f":"L66*$C66","v":0},null,{"$f":"N66*$C66","v":0},null,{"$f":"P66*$C66","v":0},null,{"$f":"R66*$C66","v":0},null,{"$f":"T66*$C66","v":0},null,{"$f":"V66*$C66","v":0},null,{"$f":"X66*$C66","v":0},null,{"$f":"Z66*$C66","v":0},null,{"$f":"+D66+F66+H66+J66+L66+N66+P66+R66+T66+V66+X66+Z66","v":1},{"$f":"+E66+G66+I66+K66+M66+O66+Q66+S66+U66+W66+Y66+AA66","v":140.27000000000001},{"$f":"IF(C66=AD66,\"ok!\",\"incompleto\")","v":"ok!"}]
["13.2","PISO CONCRETO ARMADO E= 10 cm - ACADEMIA AO AR LIVRE",{"$f":"PO!L87","v":11831},null,0,1,11831,null,0,null,0,null,0,null,0,null,0,null,0,null,0,null,0,null,0,null,0,null,1,11831,"ok!"]
["13.3","PISO PODOTÁTIL 25x25 cm - E=2,5CM",{"$f":"PO!L88","v":135.16},null,0,1,135.16,null,0,null,0,null,0,null,0,null,0,null,0,null,0,null,0,null,0,null,0,null,1,135.16,"ok!"]
[14,"MOBILIÁRIO URBANO"]
["14.1","BANCO B (C/ ENCOSTO) - L=2,00 m - PADRÃO SMAM",{"$f":"PO!L91","v":3364.32},null,{"$f":"D70*$C70","v":0},1,{"$f":"F70*$C70","v":3364.32},null,{"$f":"H70*$C70","v":0},null,{"$f":"J70*$C70","v":0},null,{"$f":"L70*$C70","v":0},null,{"$f":"N70*$C70","v":0},null,{"$f":"P70*$C70","v":0},null,{"$f":"R70*$C70","v":0},null,{"$f":"T70*$C70","v":0},null,{"$f":"V70*$C70","v":0},null,{"$f":"X70*$C70","v":0},null,{"$f":"Z70*$C70","v":0},null,{"$f":"+D70+F70+H70+J70+L70+N70+P70+R70+T70+V70+X70+Z70","v":1},{"$f":"+E70+G70+I70+K70+M70+O70+Q70+S70+U70+W70+Y70+AA70","v":3364.32},{"$f":"IF(C70=AD70,\"ok!\",\"incompleto\")","v":"ok!"}]
["14.2","LIXEIRA METÁLICA - V=30 LITROS INSTALADA",{"$f":"PO!L92","v":1251.74},null,{"$f":"D71*$C71","v":0},1,{"$f":"F71*$C71","v":1251.74},null,{"$f":"H71*$C71","v":0},null,{"$f":"J71*$C71","v":0},null,{"$f":"L71*$C71","v":0},null,{"$f":"N71*$C71","v":0},null,{"$f":"P71*$C71","v":0},null,{"$f":"R71*$C71","v":0},null,{"$f":"T71*$C71","v":0},null,{"$f":"V71*$C71","v":0},null,{"$f":"X71*$C71","v":0},null,{"$f":"Z71*$C71","v":0},null,1,1251.74,{"$f":"IF(C71=AD71,\"ok!\",\"incompleto\")","v":"ok!"}]
[15,"ACADEMIA AO AR LIVRE"]
["15.1","PLACA ORIENTATIVA - GALVANIZADA",{"$f":"PO!L95","v":8910.19},null,{"$f":"D73*$C73","v":0},1,{"$f":"F73*$C73","v":8910.19},null,{"$f":"H73*$C73","v":0},null,{"$f":"J73*$C73","v":0},null,{"$f":"L73*$C73","v":0},null,{"$f":"N73*$C73","v":0},null,{"$f":"P73*$C73","v":0},null,{"$f":"R73*$C73","v":0},null,{"$f":"T73*$C73","v":0},null,{"$f":"V73*$C73","v":0},null,{"$f":"X73*$C73","v":0},null,{"$f":"Z73*$C73","v":0},null,{"$f":"+D73+F73+H73+J73+L73+N73+P73+R73+T73+V73+X73+Z73","v":1},{"$f":"+E73+G73+I73+K73+M73+O73+Q73+S73+U73+W73+Y73+AA73","v":8910.19},{"$f":"IF(C73=AD73,\"ok!\",\"incompleto\")","v":"ok!"}]
["15.2","SIMULADOR DE CAMINHADA TRIPLO CONJUGADO - GALVANIZADO",{"$f":"PO!L96","v":15065.84},null,0,1,15065.84,null,0,null,0,null,0,null,0,null,0,null,0,null,0,null,0,null,0,null,0,null,1,15065.84,"ok!"]
["15.3","ESQUI TRIPLO CONJUGADO - GALVANIZADO",{"$f":"PO!L97","v":18380.59},null,0,1,18380.59,null,0,null,0,null,0,null,0,null,0,null,0,null,0,null,0,null,0,null,0,null,1,18380.59,"ok!"]
["15.4","ADUÇÃO E ABDUÇÃO DE PERNAS DUPLO - GALVANIZADO",{"$f":"PO!L98","v":10491.68},null,0,1,10491.68,null,0,null,0,null,0,null,0,null,0,null,0,null,0,null,0,null,0,null,0,null,1,10491.68,"ok!"]
["15.5","MULTIEXERCITADOR CONJUGADO 6 FUNÇÕES - GALVANIZADO",{"$f":"PO!L99","v":18444.18},null,0,1,18444.18,null,0,null,0,null,0,null,0,null,0,null,0,null,0,null,0,null,0,null,0,null,1,18444.18,"ok!"]
["15.6","SIMULADOR DE REMO - GALVANIZADO",{"$f":"PO!L100","v":6442.09},null,0,1,6442.09,null,0,null,0,null,0,null,0,null,0,null,0,null,0,null,0,null,0,null,0,null,1,6442.09,"ok!"]
["15.7","REMADA ESPECIAL PPNE - GALVANIZADA",{"$f":"PO!L101","v":6776.86},null,0,1,6776.86,null,0,null,0,null,0,null,0,null,0,null,0,null,0,null,0,null,0,null,0,null,1,6776.86,"ok!"]
["15.8","VOADOR PEITORAL E VOADOR DORSAL - GALVANIZADO",{"$f":"PO!L102","v":7137.53},null,0,1,7137.53,null,0,null,0,null,0,null,0,null,0,null,0,null,0,null,0,null,0,null,0,null,1,7137.53,"ok!"]
[16,"PLANTIO"]
["16.1","GRAMA CATARINA",{"$f":"PO!L105","v":1771.12},null,{"$f":"D82*$C82","v":0},1,{"$f":"F82*$C82","v":1771.12},null,{"$f":"H82*$C82","v":0},null,{"$f":"J82*$C82","v":0},null,{"$f":"L82*$C82","v":0},null,{"$f":"N82*$C82","v":0},null,{"$f":"P82*$C82","v":0},null,{"$f":"R82*$C82","v":0},null,{"$f":"T82*$C82","v":0},null,{"$f":"V82*$C82","v":0},null,{"$f":"X82*$C82","v":0},null,{"$f":"Z82*$C82","v":0},null,{"$f":"+D82+F82+H82+J82+L82+N82+P82+R82+T82+V82+X82+Z82","v":1},{"$f":"+E82+G82+I82+K82+M82+O82+Q82+S82+U82+W82+Y82+AA82","v":1771.12},{"$f":"IF(C82=AD82,\"ok!\",\"incompleto\")","v":"ok!"}]
[null,"PRAÇA JOSÉ MARIANO DE FREITAS BECK"]
[17,"SERVIÇOS PRELIMINARES"]
["17.1","REMOÇÃO DE PASSEIOS - SEM REMOÇÃO DE ENTULHOS",{"$f":"PO!L112","v":69.3},null,{"$f":"D85*$C85","v":0},null,{"$f":"F85*$C85","v":0},1,{"$f":"H85*$C85","v":69.3},null,{"$f":"J85*$C85","v":0},null,{"$f":"L85*$C85","v":0},null,{"$f":"N85*$C85","v":0},null,{"$f":"P85*$C85","v":0},null,{"$f":"R85*$C85","v":0},null,{"$f":"T85*$C85","v":0},null,{"$f":"V85*$C85","v":0},null,{"$f":"X85*$C85","v":0},null,{"$f":"Z85*$C85","v":0},null,{"$f":"+D85+F85+H85+J85+L85+N85+P85+R85+T85+V85+X85+Z85","v":1},{"$f":"+E85+G85+I85+K85+M85+O85+Q85+S85+U85+W85+Y85+AA85","v":69.3},{"$f":"IF(C85=AD85,\"ok!\",\"incompleto\")","v":"ok!"}]
["17.2","REMOÇÃO DE ENTULHOS COM CAÇAMBA 4M³",{"$f":"PO!L113","v":103.5},null,0,null,{"$f":"F86*$C86","v":0},1,103.5,null,{"$f":"J86*$C86","v":0},null,{"$f":"L86*$C86","v":0},null,{"$f":"N86*$C86","v":0},null,{"$f":"P86*$C86","v":0},null,{"$f":"R86*$C86","v":0},null,{"$f":"T86*$C86","v":0},null,{"$f":"V86*$C86","v":0},null,{"$f":"X86*$C86","v":0},null,{"$f":"Z86*$C86","v":0},null,1,103.5,{"$f":"IF(C86=AD86,\"ok!\",\"incompleto\")","v":"ok!"}]
[18,"INSTALAÇÕES PROVISÓRIAS"]
["18.1","TAPUME EM CHAPA DE COMPENSADO RESINADO (L=7,70m; C=11,00m e H=2,20M)",{"$f":"PO!L116","v":6790.56},null,{"$f":"D88*$C88","v":0},null,{"$f":"F88*$C88","v":0},1,{"$f":"H88*$C88","v":6790.56},null,{"$f":"J88*$C88","v":0},null,{"$f":"L88*$C88","v":0},null,{"$f":"N88*$C88","v":0},null,{"$f":"P88*$C88","v":0},null,{"$f":"R88*$C88","v":0},null,{"$f":"T88*$C88","v":0},null,{"$f":"V88*$C88","v":0},null,{"$f":"X88*$C88","v":0},null,{"$f":"Z88*$C88","v":0},null,{"$f":"+D88+F88+H88+J88+L88+N88+P88+R88+T88+V88+X88+Z88","v":1},{"$f":"+E88+G88+I88+K88+M88+O88+Q88+S88+U88+W88+Y88+AA88","v":6790.56},{"$f":"IF(C88=AD88,\"ok!\",\"incompleto\")","v":"ok!"}]
["18.2","LOCAÇÃO DE BANHEIRO QUÍMICO",{"$f":"PO!L117","v":830.62},null,{"$f":"D89*$C89","v":0},null,{"$f":"F89*$C89","v":0},1,{"$f":"H89*$C89","v":830.62},null,0,null,0,null,0,null,0,null,0,null,0,null,0,null,0,null,0,null,1,830.62,"ok!"]
["18.3","FRETE P/ BANHEIRO QUÍMICO LOCADO (IDA E VOLTA)",{"$f":"PO!L118","v":1085.48},null,0,null,0,1,1085.48,null,0,null,0,null,0,null,0,null,0,null,0,null,0,null,0,null,0,null,1,1085.48,"ok!"]
["18.4","INSTALAÇÃO PROVISÓRIA DE ENERGIA, AÉREA, BIFÁSICA, COM CAIXA DE EMBUTIR C/ POSTE H=9,00M",{"$f":"PO!L119","v":2979.99},null,0,null,0,1,2979.99,null,0,null,0,null,0,null,0,null,0,null,0,null,0,null,0,null,0,null,1,2979.99,"ok!"]
["18.5","INSTALAÇÃO PROVISÓRIA DE ÁGUA",{"$f":"PO!L120","v":897.15},null,0,null,0,1,897.15,null,0,null,0,null,0,null,0,null,0,null,0,null,0,null,0,null,0,null,1,897.15,"ok!"]
["18.6","PLACA DE OBRA",{"$f":"PO!L121","v":925.52},null,0,null,0,1,925.52,null,0,null,0,null,0,null,0,null,0,null,0,null,0,null,0,null,0,null,1,925.52,"ok!"]
["18.7","SINALIZAÇÃO COM TELA PLÁSTICA LARANJA FIXADA EM CONE PLÁSTICO",{"$f":"PO!L122","v":1882.65},null,0,null,0,1,1882.65,null,0,null,0,null,0,null,0,null,0,null,0,null,0,null,0,null,0,null,1,1882.65,"ok!"]
["18.8","LOCAÇÃO DE OBRA",{"$f":"PO!L123","v":31.62},null,0,null,0,1,31.62,null,0,null,0,null,0,null,0,null,0,null,0,null,0,null,0,null,0,null,1,31.62,"ok!"]
["18.9","NIVELAMENTO",{"$f":"PO!L124","v":55.01},null,0,null,0,1,55.01,null,0,null,0,null,0,null,0,null,0,null,0,null,0,null,0,null,0,null,1,55.01,"ok!"]
[19,"ADMINISTRAÇÃO LOCAL"]
["19.1","ADMINISTRAÇÃO LOCAL",{"$f":"PO!L127","v":24761.29},null,{"$f":"D98*$C98","v":0},null,{"$f":"F98*$C98","v":0},1,{"$f":"H98*$C98","v":24761.29},null,{"$f":"J98*$C98","v":0},null,{"$f":"L98*$C98","v":0},null,{"$f":"N98*$C98","v":0},null,{"$f":"P98*$C98","v":0},null,{"$f":"R98*$C98","v":0},null,{"$f":"T98*$C98","v":0},null,{"$f":"V98*$C98","v":0},null,{"$f":"X98*$C98","v":0},null,{"$f":"Z98*$C98","v":0},null,{"$f":"+D98+F98+H98+J98+L98+N98+P98+R98+T98+V98+X98+Z98","v":1},{"$f":"+E98+G98+I98+K98+M98+O98+Q98+S98+U98+W98+Y98+AA98","v":24761.29},{"$f":"IF(C98=AD98,\"ok!\",\"incompleto\")","v":"ok!"}]
[20,"MOVIMENTO DE TERRA"]
["20.1","MODELAGEM (MOVIMENTO DE TERRA ATÉ 15CM)",{"$f":"PO!L130","v":540.97},null,{"$f":"D100*$C100","v":0},null,{"$f":"F100*$C100","v":0},1,{"$f":"H100*$C100","v":540.97},null,{"$f":"J100*$C100","v":0},null,{"$f":"L100*$C100","v":0},null,{"$f":"N100*$C100","v":0},null,{"$f":"P100*$C100","v":0},null,{"$f":"R100*$C100","v":0},null,{"$f":"T100*$C100","v":0},null,{"$f":"V100*$C100","v":0},null,{"$f":"X100*$C100","v":0},null,{"$f":"Z100*$C100","v":0},null,{"$f":"+D100+F100+H100+J100+L100+N100+P100+R100+T100+V100+X100+Z100","v":1},{"$f":"+E100+G100+I100+K100+M100+O100+Q100+S100+U100+W100+Y100+AA100","v":540.97},{"$f":"IF(C100=AD100,\"ok!\",\"incompleto\")","v":"ok!"}]
["20.2","ATERRO MANUAL C/MATERIAL IMPORTADO C/COMPACTAÇÃO MANUAL",{"$f":"PO!L131","v":1283.46},null,0,null,0,1,1283.46,null,0,null,0,null,0,null,0,null,0,null,0,null,0,null,0,null,0,null,1,1283.46,"ok!"]
[21,"PAVIMENTAÇÃO"]
["21.1","EXECUÇÃO DE PASSEIO (CALÇADA) OU PISO DE CONCRETO COM CONCRETO MOLDADO IN LOCO, FEITO EM OBRA, ACABAMENTO CONVENCIONAL, ESPESSURA 8 CM, ARMADO",{"$f":"PO!L134","v":420.81},null,{"$f":"D103*$C103","v":0},null,{"$f":"F103*$C103","v":0},1,{"$f":"H103*$C103","v":420.81},null,{"$f":"J103*$C103","v":0},null,{"$f":"L103*$C103","v":0},null,{"$f":"N103*$C103","v":0},null,{"$f":"P103*$C103","v":0},null,{"$f":"R103*$C103","v":0},null,{"$f":"T103*$C103","v":0},null,{"$f":"V103*$C103","v":0},null,{"$f":"X103*$C103","v":0},null,{"$f":"Z103*$C103","v":0},null,{"$f":"+D103+F103+H103+J103+L103+N103+P103+R103+T103+V103+X103+Z103","v":1},{"$f":"+E103+G103+I103+K103+M103+O103+Q103+S103+U103+W103+Y103+AA103","v":420.81},{"$f":"IF(C103=AD103,\"ok!\",\"incompleto\")","v":"ok!"}]
["21.2","PISO CONCRETO ARMADO E= 10 cm - ACADEMIA AO AR LIVRE",{"$f":"PO!L135","v":15439.45},null,0,null,0,1,15439.45,null,0,null,0,null,0,null,0,null,0,null,0,null,0,null,0,null,0,null,1,15439.45,"ok!"]
["21.3","LAJE DE GRÊS ASSENTADA NA AREIA",{"$f":"PO!L136","v":270.95999999999998},null,{"$f":"D105*$C105","v":0},null,{"$f":"F105*$C105","v":0},1,{"$f":"H105*$C105","v":270.95999999999998},null,{"$f":"J105*$C105","v":0},null,{"$f":"L105*$C105","v":0},null,{"$f":"N105*$C105","v":0},null,{"$f":"P105*$C105","v":0},null,{"$f":"R105*$C105","v":0},null,{"$f":"T105*$C105","v":0},null,{"$f":"V105*$C105","v":0},null,{"$f":"X105*$C105","v":0},null,{"$f":"Z105*$C105","v":0},null,{"$f":"+D105+F105+H105+J105+L105+N105+P105+R105+T105+V105+X105+Z105","v":1},{"$f":"+E105+G105+I105+K105+M105+O105+Q105+S105+U105+W105+Y105+AA105","v":270.95999999999998},{"$f":"IF(C105=AD105,\"ok!\",\"incompleto\")","v":"ok!"}]
["21.4","PISO PODOTÁTIL 25x25 cm - E=2,5CM",{"$f":"PO!L137","v":50.68},null,0,null,0,1,50.68,null,0,null,0,null,0,null,0,null,0,null,0,null,0,null,0,null,0,null,1,50.68,"ok!"]
[22,"ACESSIBILIDADE"]
["22.1","RAMPA PPNE'S TIPO 1 - 1,80 m (ABA 1,50 m)",{"$f":"PO!L140","v":1119.3399999999999},null,{"$f":"D108*$C108","v":0},null,{"$f":"F108*$C108","v":0},1,{"$f":"H108*$C108","v":1119.3399999999999},null,{"$f":"J108*$C108","v":0},null,{"$f":"L108*$C108","v":0},null,{"$f":"N108*$C108","v":0},null,{"$f":"P108*$C108","v":0},null,{"$f":"R108*$C108","v":0},null,{"$f":"T108*$C108","v":0},null,{"$f":"V108*$C108","v":0},null,{"$f":"X108*$C108","v":0},null,{"$f":"Z108*$C108","v":0},null,{"$f":"+D108+F108+H108+J108+L108+N108+P108+R108+T108+V108+X108+Z108","v":1},{"$f":"+E108+G108+I108+K108+M108+O108+Q108+S108+U108+W108+Y108+AA108","v":1119.3399999999999},{"$f":"IF(C108=AD108,\"ok!\",\"incompleto\")","v":"ok!"}]
[23,"MOBILIÁRIO URBANO"]
["23.1","BANCO B (C/ ENCOSTO) - L=2,00 m - PADRÃO SMAM",{"$f":"PO!L143","v":3364.32},null,{"$f":"D110*$C110","v":0},null,{"$f":"F110*$C110","v":0},1,{"$f":"H110*$C110","v":3364.32},null,{"$f":"J110*$C110","v":0},null,{"$f":"L110*$C110","v":0},null,{"$f":"N110*$C110","v":0},null,{"$f":"P110*$C110","v":0},null,{"$f":"R110*$C110","v":0},null,{"$f":"T110*$C110","v":0},null,{"$f":"V110*$C110","v":0},null,{"$f":"X110*$C110","v":0},null,{"$f":"Z110*$C110","v":0},null,{"$f":"+D110+F110+H110+J110+L110+N110+P110+R110+T110+V110+X110+Z110","v":1},{"$f":"+E110+G110+I110+K110+M110+O110+Q110+S110+U110+W110+Y110+AA110","v":3364.32},{"$f":"IF(C110=AD110,\"ok!\",\"incompleto\")","v":"ok!"}]
["23.2","LIXEIRA METÁLICA - V=30 LITROS INSTALADA",{"$f":"PO!L144","v":1251.74},null,{"$f":"D111*$C111","v":0},null,{"$f":"F111*$C111","v":0},1,{"$f":"H111*$C111","v":1251.74},null,{"$f":"J111*$C111","v":0},null,{"$f":"L111*$C111","v":0},null,{"$f":"N111*$C111","v":0},null,{"$f":"P111*$C111","v":0},null,{"$f":"R111*$C111","v":0},null,{"$f":"T111*$C111","v":0},null,{"$f":"V111*$C111","v":0},null,{"$f":"X111*$C111","v":0},null,{"$f":"Z111*$C111","v":0},null,1,1251.74,{"$f":"IF(C111=AD111,\"ok!\",\"incompleto\")","v":"ok!"}]
[24,"ACADEMIA AO AR LIVRE"]
["24.1","PLACA ORIENTATIVA - GALVANIZADA",{"$f":"PO!L147","v":8910.19},null,{"$f":"D113*$C113","v":0},null,{"$f":"F113*$C113","v":0},1,{"$f":"H113*$C113","v":8910.19},null,{"$f":"J113*$C113","v":0},null,{"$f":"L113*$C113","v":0},null,{"$f":"N113*$C113","v":0},null,{"$f":"P113*$C113","v":0},null,{"$f":"R113*$C113","v":0},null,{"$f":"T113*$C113","v":0},null,{"$f":"V113*$C113","v":0},null,{"$f":"X113*$C113","v":0},null,{"$f":"Z113*$C113","v":0},null,{"$f":"+D113+F113+H113+J113+L113+N113+P113+R113+T113+V113+X113+Z113","v":1},{"$f":"+E113+G113+I113+K113+M113+O113+Q113+S113+U113+W113+Y113+AA113","v":8910.19},{"$f":"IF(C113=AD113,\"ok!\",\"incompleto\")","v":"ok!"}]
["24.2","JOGO DE BARRAS - GALVANIZADO",{"$f":"PO!L148","v":10945.66},null,0,null,0,1,10945.66,null,0,null,0,null,0,null,0,null,0,null,0,null,0,null,0,null,0,null,1,10945.66,"ok!"]
["24.3","SIMULADOR DE CAMINHADA TRIPLO CONJUGADO - GALVANIZADO",{"$f":"PO!L149","v":15065.84},null,0,null,0,1,15065.84,null,0,null,0,null,0,null,0,null,0,null,0,null,0,null,0,null,0,null,1,15065.84,"ok!"]
["24.4","ADUÇÃO E ABDUÇÃO DE PERNAS DUPLO - GALVANIZADO",{"$f":"PO!L150","v":10491.68},null,0,null,0,1,10491.68,null,0,null,0,null,0,null,0,null,0,null,0,null,0,null,0,null,0,null,1,10491.68,"ok!"]
["24.5","PRESSÃO DE PERNAS TRIPLO CONJUGADO - GALVANIZADO",{"$f":"PO!L151","v":10857.79},null,0,null,0,1,10857.79,null,0,null,0,null,0,null,0,null,0,null,0,null,0,null,0,null,0,null,1,10857.79,"ok!"]
["24.6","SIMULADOR DE REMO - GALVANIZADO",{"$f":"PO!L152","v":6442.09},null,0,null,0,1,6442.09,null,0,null,0,null,0,null,0,null,0,null,0,null,0,null,0,null,0,null,1,6442.09,"ok!"]
["24.7","ABDOMINAL SIMPLES - GALVANIZADO",{"$f":"PO!L153","v":5701.11},null,{"$f":"D119*$C119","v":0},null,{"$f":"F119*$C119","v":0},1,{"$f":"H119*$C119","v":5701.11},null,{"$f":"J119*$C119","v":0},null,{"$f":"L119*$C119","v":0},null,{"$f":"N119*$C119","v":0},null,{"$f":"P119*$C119","v":0},null,{"$f":"R119*$C119","v":0},null,{"$f":"T119*$C119","v":0},null,{"$f":"V119*$C119","v":0},null,{"$f":"X119*$C119","v":0},null,{"$f":"Z119*$C119","v":0},null,{"$f":"+D119+F119+H119+J119+L119+N119+P119+R119+T119+V119+X119+Z119","v":1},{"$f":"+E119+G119+I119+K119+M119+O119+Q119+S119+U119+W119+Y119+AA119","v":5701.11},{"$f":"IF(C119=AD119,\"ok!\",\"incompleto\")","v":"ok!"}]
["24.8","REMADA ESPECIAL PPNE - GALVANIZADA",{"$f":"PO!L154","v":6776.86},null,0,null,0,1,6776.86,null,0,null,0,null,0,null,0,null,0,null,0,null,0,null,0,null,0,null,1,6776.86,"ok!"]
["24.9","VOADOR PEITORAL E VOADOR DORSAL - GALVANIZADO",{"$f":"PO!L155","v":7137.53},null,0,null,0,1,7137.53,null,0,null,0,null,0,null,0,null,0,null,0,null,0,null,0,null,0,null,1,7137.53,"ok!"]
[25,"PLANTIO"]
["25.1","GRAMA CATARINA",{"$f":"PO!L158","v":1685.97},null,{"$f":"D123*$C123","v":0},null,{"$f":"F123*$C123","v":0},1,{"$f":"H123*$C123","v":1685.97},null,{"$f":"J123*$C123","v":0},null,{"$f":"L123*$C123","v":0},null,{"$f":"N123*$C123","v":0},null,{"$f":"P123*$C123","v":0},null,{"$f":"R123*$C123","v":0},null,{"$f":"T123*$C123","v":0},null,{"$f":"V123*$C123","v":0},null,{"$f":"X123*$C123","v":0},null,{"$f":"Z123*$C123","v":0},null,{"$f":"+D123+F123+H123+J123+L123+N123+P123+R123+T123+V123+X123+Z123","v":1},{"$f":"+E123+G123+I123+K123+M123+O123+Q123+S123+U123+W123+Y123+AA123","v":1685.97},{"$f":"IF(C123=AD123,\"ok!\",\"incompleto\")","v":"ok!"}]
[]
["TOTAL PARCIAL",null,{"$f":"SUM(C11:C123)","v":451445.02999999997},{"$f":"E125/C125","v":0.33607635463391849},{"$f":"SUM(E11:E123)","v":151719.99999999997},{"$f":"G125/C125","v":0.33571283307737371},{"$f":"SUM(G11:G123)","v":151555.88999999996},{"$f":"I125/C125","v":0.32821081228870763},{"$f":"SUM(I11:I123)","v":148169.13999999998},{"$f":"K125/#REF!","v":{"$error":"#REF!"}},{"$f":"SUM(K86:K123)","v":0},{"$f":"M125/#REF!","v":{"$error":"#REF!"}},{"$f":"SUM(M86:M123)","v":0},{"$f":"O125/#REF!","v":{"$error":"#REF!"}},{"$f":"SUM(O86:O123)","v":0},{"$f":"Q125/#REF!","v":{"$error":"#REF!"}},{"$f":"SUM(Q86:Q123)","v":0},{"$f":"S125/#REF!","v":{"$error":"#REF!"}},{"$f":"SUM(S86:S123)","v":0},{"$f":"U125/#REF!","v":{"$error":"#REF!"}},{"$f":"SUM(U86:U123)","v":0},{"$f":"W125/#REF!","v":{"$error":"#REF!"}},{"$f":"SUM(W86:W123)","v":0},{"$f":"Y125/#REF!","v":{"$error":"#REF!"}},{"$f":"SUM(Y86:Y123)","v":0},{"$f":"AA125/#REF!","v":{"$error":"#REF!"}},{"$f":"SUM(AA86:AA123)","v":0},null,{"$f":"D125+F125+H125","v":0.99999999999999989},{"$f":"SUM(AD11:AD123)","v":451445.02999999997},{"$f":"IF(C125=AD125,\"ok!\",\"incompleto\")","v":"ok!"}]
["TOTAL ACUMULADO",null,null,{"$f":"E126/C125","v":0.33607635463391849},{"$f":"E125","v":151719.99999999997},{"$f":"G126/C125","v":0.67178918771129215},{"$f":"G125+E126","v":303275.8899999999},{"$f":"H125+F126","v":0.99999999999999978},{"$f":"I125+G126","v":451445.02999999991},{"$f":"K126/#REF!","v":{"$error":"#REF!"}},{"$f":"K125+I126","v":451445.02999999991},{"$f":"M126/#REF!","v":{"$error":"#REF!"}},{"$f":"M125+K126","v":451445.02999999991},{"$f":"O126/#REF!","v":{"$error":"#REF!"}},{"$f":"O125+M126","v":451445.02999999991},{"$f":"Q126/#REF!","v":{"$error":"#REF!"}},{"$f":"Q125+O126","v":451445.02999999991},{"$f":"S126/#REF!","v":{"$error":"#REF!"}},{"$f":"S125+Q126","v":451445.02999999991},{"$f":"U126/#REF!","v":{"$error":"#REF!"}},{"$f":"U125+S126","v":451445.02999999991},{"$f":"W126/#REF!","v":{"$error":"#REF!"}},{"$f":"W125+U126","v":451445.02999999991},{"$f":"Y126/#REF!","v":{"$error":"#REF!"}},{"$f":"Y125+W126","v":451445.02999999991},{"$f":"AA126/#REF!","v":{"$error":"#REF!"}},{"$f":"AA125+Y126","v":451445.02999999991}]

{"sheet":"Composições","index":2,"n_rows":2128,"n_cols":8,"rows_kept":2128,"cut":false,"hidden":false,"merged":[[326,0,326,1],[426,0,426,1],[252,3,252,5],[255,0,255,1],[426,2,426,5],[462,2,462,5],[406,0,406,1],[355,2,355,5],[359,0,359,1],[456,2,456,5],[439,3,439,5],[309,3,309,5],[312,0,312,1],[312,2,312,5],[315,0,315,1],[315,2,315,5],[349,3,349,5],[337,0,337,1],[339,0,339,1],[324,3,324,5],[1119,0,1119,1],[1224,2,1224,5],[492,2,492,5],[553,0,553,1],[1133,0,1133,1],[1170,2,1170,5],[1102,2,1102,5],[1065,0,1065,1],[1085,0,1085,1],[526,2,526,5],[666,3,666,5],[680,2,680,5],[685,2,685,5],[605,0,605,1],[521,0,521,1],[685,0,685,1],[680,0,680,1],[526,0,526,1],[559,0,559,1],[492,0,492,1],[598,3,598,5],[499,2,499,5],[583,2,583,5],[568,3,568,5],[833,2,833,5],[804,0,804,1],[785,0,785,1],[355,0,355,1],[369,3,369,5],[702,0,702,1],[783,2,783,5],[697,0,697,1],[402,3,402,5],[456,0,456,1],[472,3,472,5],[470,0,470,5],[462,0,462,1],[559,2,559,5],[508,3,508,5],[602,0,602,1],[553,2,553,5],[535,3,535,5],[602,2,602,5],[702,2,702,5],[737,0,737,1],[734,0,734,1],[783,0,783,1],[697,2,697,5],[2086,2,2086,5],[390,0,390,1],[390,2,390,5],[429,0,429,1],[429,2,429,5],[437,0,437,5],[337,2,337,5],[335,3,335,5],[326,2,326,5],[409,2,409,5],[384,0,384,1],[409,0,409,1],[359,2,359,5],[2083,3,2083,5],[2074,0,2074,1],[2074,2,2074,5],[788,0,788,1],[2068,3,2068,5],[2071,0,2071,1],[2071,2,2071,5],[817,2,817,5],[1224,0,1224,1],[1167,2,1167,5],[1187,0,1187,1],[3,9,3,11],[111,2,111,5],[109,3,109,5],[4,2,4,4],[5,2,5,4],[55,3,55,5],[13,2,13,5],[23,3,23,5],[65,2,65,5],[25,2,25,5],[6,2,6,4],[7,2,7,4],[62,2,62,5],[95,2,95,5],[100,2,100,5],[0,0,0,5],[43,0,43,1],[46,0,46,1],[2,0,2,5],[46,2,46,5],[43,2,43,5],[36,3,36,5],[3,0,3,5],[1,0,1,5],[10,3,10,5],[27,2,27,5],[25,0,25,1],[27,0,27,1],[13,0,13,1],[62,0,62,1],[65,0,65,1],[406,2,406,5],[1179,3,1179,5],[1170,0,1170,1],[1221,2,1221,5],[1162,3,1162,5],[1184,2,1184,5],[1213,3,1213,5],[1201,2,1201,5],[1187,2,1187,5],[1221,0,1221,1],[1204,2,1204,5],[820,0,820,1],[1048,2,1048,5],[1136,0,1136,1],[1204,0,1204,1],[1201,0,1201,1],[1184,0,1184,1],[1150,0,1150,1],[1136,2,1136,5],[1167,0,1167,1],[1128,3,1128,5],[1082,2,1082,5],[2104,2,2104,5],[1761,2,1761,5],[1764,0,1764,1],[2098,3,2098,5],[1773,3,1773,5],[1749,0,1749,1],[1779,2,1779,5],[1281,0,1281,1],[1301,0,1301,1],[1746,0,1746,1],[1304,2,1304,5],[1387,2,1387,5],[1396,3,1396,5],[1400,0,1400,1],[1400,2,1400,5],[1402,0,1402,1],[1402,2,1402,5],[2101,0,2101,1],[1698,3,1698,5],[1333,3,1333,5],[1321,2,1321,5],[1352,2,1352,5],[1449,2,1449,5],[1648,0,1648,1],[1417,0,1417,1],[1417,2,1417,5],[1387,0,1387,1],[1465,2,1465,5],[1196,3,1196,5],[1119,2,1119,5],[1233,3,1233,5],[1648,2,1648,5],[2104,0,2104,1],[1776,0,1776,1],[1779,0,1779,1],[1731,0,1731,1],[2086,0,2086,1],[1734,0,1734,1],[1241,0,1241,1],[1261,2,1261,5],[1241,2,1241,5],[1419,0,1419,1],[1431,0,1431,1],[1433,0,1433,1],[1449,0,1449,1],[1458,3,1458,5],[1462,0,1462,1],[1462,2,1462,5],[1411,3,1411,5],[1244,0,1244,1],[1244,2,1244,5],[1284,2,1284,5],[1293,3,1293,5],[1273,3,1273,5],[1261,0,1261,1],[1354,0,1354,1],[1301,2,1301,5],[1281,2,1281,5],[1284,0,1284,1],[1253,3,1253,5],[1304,0,1304,1],[1313,3,1313,5],[1324,0,1324,1],[1264,0,1264,1],[1321,0,1321,1],[1264,2,1264,5],[1481,0,1481,1],[1481,2,1481,5],[1490,3,1490,5],[1494,0,1494,1],[1494,2,1494,5],[1497,0,1497,1],[1497,2,1497,5],[2101,2,2101,5],[1713,3,1713,5],[1749,2,1749,5],[1629,2,1629,5],[1746,2,1746,5],[1764,2,1764,5],[1719,2,1719,5],[2096,0,2096,5],[1719,0,1719,1],[1651,0,1651,1],[2089,0,2089,1],[2089,2,2089,5],[1728,3,1728,5],[1743,3,1743,5],[1701,0,1701,1],[1734,2,1734,5],[1651,2,1651,5],[1474,3,1474,5],[1478,0,1478,1],[1478,2,1478,5],[1324,2,1324,5],[1343,2,1343,5],[1366,3,1366,5],[1419,2,1419,5],[1431,2,1431,5],[1433,2,1433,5],[1442,3,1442,5],[1354,2,1354,5],[1357,0,1357,1],[1357,2,1357,5],[1340,0,1340,1],[1340,2,1340,5],[1343,0,1343,1],[1465,0,1465,1],[1370,0,1370,1],[1370,2,1370,5],[1372,0,1372,1],[1372,2,1372,5],[1381,3,1381,5],[1385,0,1385,1],[1385,2,1385,5],[1099,0,1099,1],[1034,2,1034,5],[1068,0,1068,1],[1082,0,1082,1],[1102,0,1102,1],[1116,2,1116,5],[1099,2,1099,5],[1085,2,1085,5],[1060,3,1060,5],[1068,2,1068,5],[1111,3,1111,5],[1094,3,1094,5],[1065,2,1065,5],[1133,2,1133,5],[1150,2,1150,5],[1153,2,1153,5],[1116,0,1116,1],[1153,0,1153,1],[1145,3,1145,5],[1077,3,1077,5],[887,0,887,1],[1034,0,1034,1],[1048,0,1048,1],[1051,0,1051,1],[986,3,986,5],[1017,0,1017,1],[1043,3,1043,5],[1014,0,1014,1],[890,0,890,1],[903,0,903,1],[974,0,974,1],[1031,2,1031,5],[977,2,977,5],[1026,3,1026,5],[974,2,974,5],[1051,2,1051,5],[977,0,977,1],[887,2,887,5],[908,0,908,1],[1017,2,1017,5],[994,0,994,1],[994,2,994,5],[926,0,926,1],[940,0,940,1],[1006,3,1006,5],[997,0,997,1],[1014,2,1014,5],[905,0,905,1],[905,2,905,5],[903,2,903,5],[926,2,926,5],[890,2,890,5],[957,0,957,1],[957,2,957,5],[960,0,960,1],[923,0,923,1],[960,2,960,5],[923,2,923,5],[943,2,943,5],[916,0,916,5],[908,2,908,5],[940,2,940,5],[943,0,943,1],[997,2,997,5],[1031,0,1031,1],[833,0,833,1],[801,2,801,5],[734,2,734,5],[699,2,699,5],[716,0,716,1],[716,2,716,5],[718,0,718,1],[718,2,718,5],[749,0,749,1],[765,0,765,1],[699,0,699,1],[820,2,820,5],[770,0,770,1],[804,2,804,5],[785,2,785,5],[749,2,749,5],[737,2,737,5],[721,0,721,1],[721,2,721,5],[752,0,752,1],[770,2,770,5],[788,2,788,5],[695,7,699,11],[605,2,605,5],[765,2,765,5],[752,2,752,5],[521,2,521,5],[499,0,499,1],[589,0,589,1],[693,7,694,11],[692,0,692,5],[615,3,615,5],[624,0,624,1],[624,2,624,5],[628,0,628,1],[628,2,628,5],[637,3,637,5],[651,0,651,1],[651,2,651,5],[656,0,656,1],[656,2,656,5],[2113,3,2113,5],[2118,0,2118,1],[2118,2,2118,5],[2121,0,2121,1],[2121,2,2121,5],[1609,0,1609,1],[1609,2,1609,5],[111,0,111,1],[384,2,384,5],[339,2,339,5],[420,3,420,5],[258,2,258,5],[267,3,267,5],[583,0,583,1],[589,2,589,5],[1446,0,1446,1],[1446,2,1446,5],[857,2,857,5],[875,2,875,5],[767,2,767,5],[838,0,838,1],[801,0,801,1],[767,0,767,1],[817,0,817,1],[872,0,872,1],[875,0,875,1],[872,2,872,5],[835,2,835,5],[854,0,854,1],[852,2,852,5],[838,2,838,5],[857,0,857,1],[870,2,870,5],[870,0,870,1],[854,2,854,5],[835,0,835,1],[852,0,852,1],[1506,3,1506,5],[1510,0,1510,1],[1510,2,1510,5],[1513,0,1513,1],[1513,2,1513,5],[1679,3,1679,5],[1686,0,1686,1],[1686,2,1686,5],[1632,0,1632,1],[1641,3,1641,5],[1622,3,1622,5],[1629,0,1629,1],[1788,2,1788,5],[1791,0,1791,1],[1791,2,1791,5],[1794,0,1794,1],[1794,2,1794,5],[1522,3,1522,5],[1526,0,1526,1],[1526,2,1526,5],[1529,0,1529,1],[1529,2,1529,5],[1538,3,1538,5],[1542,0,1542,1],[1542,2,1542,5],[1545,0,1545,1],[1545,2,1545,5],[1554,3,1554,5],[1558,0,1558,1],[1558,2,1558,5],[1561,0,1561,1],[1561,2,1561,5],[1716,2,1716,5],[1632,2,1632,5],[1731,2,1731,5],[1704,2,1704,5],[1776,2,1776,5],[1570,3,1570,5],[1576,0,1576,1],[1576,2,1576,5],[1579,0,1579,1],[1579,2,1579,5],[1588,3,1588,5],[1594,0,1594,1],[1594,2,1594,5],[1597,0,1597,1],[1597,2,1597,5],[1660,3,1660,5],[1667,0,1667,1],[1667,2,1667,5],[1670,0,1670,1],[1670,2,1670,5],[1704,0,1704,1],[1758,3,1758,5],[1761,0,1761,1],[1620,0,1620,5],[1689,0,1689,1],[1689,2,1689,5],[1701,2,1701,5],[1716,0,1716,1],[1884,2,1884,5],[1886,0,1886,1],[1886,2,1886,5],[1895,2,1895,5],[1898,0,1898,1],[1898,2,1898,5],[1907,2,1907,5],[1910,0,1910,1],[1803,2,1803,5],[1806,0,1806,1],[1806,2,1806,5],[1809,0,1809,1],[1809,2,1809,5],[1818,2,1818,5],[1821,0,1821,1],[1821,2,1821,5],[1824,0,1824,1],[1824,2,1824,5],[1910,2,1910,5],[1875,2,1875,5],[1955,0,1955,1],[1955,2,1955,5],[1964,3,1964,5],[1967,0,1967,1],[1967,2,1967,5],[1970,0,1970,1],[1970,2,1970,5],[1940,0,1940,1],[1940,2,1940,5],[1922,2,1922,5],[1925,0,1925,1],[1925,2,1925,5],[1934,3,1934,5],[1937,0,1937,1],[1937,2,1937,5],[1949,3,1949,5],[1952,0,1952,1],[1952,2,1952,5],[122,3,122,5],[76,2,76,5],[74,3,74,5],[195,0,195,1],[195,2,195,5],[76,0,76,1],[187,3,187,5],[86,3,86,5],[95,0,95,1],[124,0,124,1],[124,2,124,5],[155,0,155,1],[155,2,155,5],[158,0,158,1],[158,2,158,5],[169,3,169,5],[177,0,177,1],[177,2,177,5],[133,3,133,5],[100,0,100,1],[2059,0,2059,1],[2059,2,2059,5],[1979,3,1979,5],[1983,0,1983,1],[1983,2,1983,5],[1986,0,1986,1],[1986,2,1986,5],[1995,3,1995,5],[1999,0,1999,1],[1999,2,1999,5],[2002,0,2002,1],[2002,2,2002,5],[2011,3,2011,5],[2024,0,2024,1],[2024,2,2024,5],[2028,0,2028,1],[2028,2,2028,5],[2044,0,2044,1],[2044,2,2044,5],[2053,3,2053,5],[2056,0,2056,1],[2056,2,2056,5],[1913,0,1913,1],[2037,3,2037,5],[2041,0,2041,1],[2041,2,2041,5],[284,3,284,5],[286,0,286,1],[286,2,286,5],[296,3,296,5],[299,0,299,1],[299,2,299,5],[1913,2,1913,5],[1833,2,1833,5],[1836,0,1836,1],[1836,2,1836,5],[1839,0,1839,1],[1839,2,1839,5],[1848,2,1848,5],[1851,0,1851,1],[1851,2,1851,5],[1860,2,1860,5],[1863,0,1863,1],[1863,2,1863,5],[1872,2,1872,5],[1875,0,1875,1],[210,3,210,5],[213,0,213,1],[213,2,213,5],[216,0,216,1],[216,2,216,5],[200,0,200,1],[200,2,200,5],[275,0,275,1],[275,2,275,5],[243,2,243,5],[225,3,225,5],[227,0,227,1],[255,2,255,5],[265,0,265,5],[227,2,227,5],[236,3,236,5],[239,0,239,1],[258,0,258,1],[239,2,239,5],[243,0,243,1]]}
["PLANILHA COMPOSIÇÕES SMAMUS"]
[]
["Data Base SINAPI: JUNHO / 2021 - Data da Cotaçãoes: Julho / 2021"]
[]
["OBJETO:",{"$f":"+PO!$B$9","v":"Obras de Aquisição e Instalação de Academias de Ginástica ao ar livre na Praça Professor Emílio Mabilde Rípole (155/02), Praça Irene Elisalde Stricher (145/10) e Praça José Mariano de Freitas Beck (164/09)."},"Leis Sociais Horistas (SINAPI):",null,null,{"$f":"+'Planilha_M.O.'!$D$7","v":1.111}]
["DATA:",{"$f":"IF(PO!$B$10=\"\",\"\",PO!$B$10)","v":"2021-08-10"},"Leis Sociais Mensalistas (SINAPI):",null,null,{"$f":"+'Planilha_M.O.'!$D$8","v":0.69159999999999999}]
["ART nº:",{"$f":"IF(PO!$B$11=\"\",\"\",PO!$B$11)","v":""},"BDI:",null,null,{"$f":"+'Planilha_M.O.'!$F$7","v":"22,15%"}]
[null,null,"BDI diferenciado Academia ar livre:",null,null,{"$f":"IF($F$7=\"28,21%\",19.35%,13.7%)","v":0.13699999999999998}]
[]
["CÓDIGO","DISCRIMINAÇÃO","UN","QUANT.","UNITÁRIO","TOTAL"]
[25,"REMOÇÃO DE PASSEIOS - SEM REMOÇÃO DE ENTULHOS","m²"]
["SINAPI C 88260","CALCETEIRO C/ENCARGOS COMPLEMENTARES","h",0.32140000000000002,{"$f":"'Planilha_M.O.'!E27","v":19.37},{"$f":"TRUNC(D12*E12,2)","v":6.22}]
["SINAPI C 88316","SERVENTE C/ ENCARGOS COMPLEMENTARES","h",0.11070000000000001,{"$f":"'Planilha_M.O.'!E18","v":17.11},{"$f":"TRUNC(D13*E13,2)","v":1.89}]
["SUB-TOTAL - MÃO-DE-OBRA:",null,{"$f":"SUM(F12:F13)","v":8.11}]
[]
[null,"CUSTO TOTAL:",null,null,null,{"$f":"+C14","v":8.11}]
[]
[null,"BDI:","%",{"$f":"+$F$7","v":"22,15%"},null,{"$f":"TRUNC(F16*D18,2)","v":1.79}]
[]
[null,"PREÇO:",null,null,null,{"$f":"+F16+F18","v":9.8999999999999986}]
[]
[]
["CÓDIGO","DISCRIMINAÇÃO","UN","COEFIC.","UNITÁRIO","TOTAL"]
[390,"REMOÇÃO DE ENTULHO C/CAÇAMBA","m³"]
["COTAÇÃO 113","CAÇAMBA V=4,0M³","m³",0.25,{"$f":"Insumos!G66","v":443.33},{"$f":"TRUNC(D25*E25,2)","v":110.83}]
["SUB-TOTAL - MATERIAL / EQUIPAMENTOS:",null,{"$f":"SUM(F25:F25)","v":110.83}]
["SINAPI C 88316","SERVENTE C/ENCARGOS COMPLEMENTARES","h",0.7,{"$f":"'Planilha_M.O.'!E18","v":17.11},{"$f":"TRUNC(D27*E27,2)","v":11.97}]
["SUB-TOTAL - MÃO-DE-OBRA:",null,{"$f":"SUM(F27:F27)","v":11.97}]
[]
[null,"CUSTO TOTAL:",null,null,null,{"$f":"+C26+C28","v":122.8}]
[]
[null,"BDI:","%",{"$f":"+$F$7","v":"22,15%"},null,{"$f":"TRUNC(F30*D32,2)","v":27.2}]
[]
[null,"PREÇO:",null,null,null,{"$f":"+F30+F32","v":150}]
[]
["CÓDIGO","DISCRIMINAÇÃO","UN","COEFIC.","UNITÁRIO","TOTAL"]
[120,"DEMOLIÇÃO CHURRASQUEIRA C/REMOÇÃO DE ENTULHOS","un"]
[{"$f":"CONCATENATE(\"COTAÇÃO \",Insumos!$B$66)","v":"COTAÇÃO 113"},"CAÇAMBA 4,00 m³","un",0.1613,{"$f":"+Insumos!$G$66","v":443.33},{"$f":"TRUNC(D38*E38,2)","v":71.5}]
[{"$f":"CONCATENATE(\"SINAPI C \",'Composições Aux. SINAPI'!$A$59,)","v":"SINAPI C 5795"},"MARTELETE OU ROMPEDOR PNEUMÁTICO MANUAL, 28 KG, COM SILENCIADOR (chp)","chp",2.52E-2,{"$f":"+'Composições Aux. SINAPI'!$E$59:$F$59","v":26.44},{"$f":"TRUNC(D39*E39,2)","v":0.66}]
[{"$f":"CONCATENATE(\"SINAPI C \",'Composições Aux. SINAPI'!$A$60,)","v":"SINAPI C 5952"},"MARTELETE OU ROMPEDOR PNEUMÁTICO MANUAL, 28 KG, COM SILENCIADOR (chi)","chi",2.52E-2,{"$f":"+'Composições Aux. SINAPI'!$E$60:$F$60","v":24.44},0.61]
[{"$f":"CONCATENATE(\"SINAPI C \",'Composições Aux. SINAPI'!$A$34,)","v":"SINAPI C 5953"},"COMPRESSOR DE AR REBOCÁVEL, VAZÃO 189 PCM, MOTOR DIESEL, POTÊNCIA 63 CV (chp)","chp",2.52E-2,{"$f":"+'Composições Aux. SINAPI'!$E$34:$F$34","v":41.39},1.04]
[{"$f":"CONCATENATE(\"SINAPI C \",'Composições Aux. SINAPI'!$A$35,)","v":"SINAPI C 5954"},"COMPRESSOR DE AR REBOCÁVEL, VAZÃO 189 PCM, MOTOR DIESEL, POTÊNCIA 63 CV (chi)","chi",2.52E-2,{"$f":"+'Composições Aux. SINAPI'!$E$35:$F$35","v":3.73},0.09]
[{"$f":"CONCATENATE(\"SINAPI I \",Insumos!$B$35)","v":"SINAPI I 6081"},"ARGILA OU BARRO PARA ATERRO OU REATERRO","m³",8.5500000000000007E-2,{"$f":"+Insumos!$G$35","v":31.59},{"$f":"TRUNC(D43*E43,2)","v":2.7}]
["SUB-TOTAL - MATERIAL / EQUIPAMENTOS:",null,{"$f":"SUM(F38:F43)","v":76.600000000000009}]
["SINAPI C 88309","PEDREIRO C/ENCARGOS COMPLEMENTARES","h",0.27839999999999998,{"$f":"'Planilha_M.O.'!E24","v":20.71},{"$f":"TRUNC(D45*E45,2)","v":5.76}]
["SINAPI C 88316","SERVENTE C/ ENCARGOS COMPLEMENTARES","h",3.4923000000000002,{"$f":"'Planilha_M.O.'!E18","v":17.11},{"$f":"TRUNC(D46*E46,2)","v":59.75}]
["SUB-TOTAL - MÃO-DE-OBRA:",null,{"$f":"SUM(F45:F46)","v":65.510000000000005}]
[]
[null,"CUSTO TOTAL:",null,null,null,{"$f":"+C44+C47","v":142.11000000000001}]
[]
[null,"BDI:","%",{"$f":"+$F$7","v":"22,15%"},null,{"$f":"TRUNC(F49*D51,2)","v":31.47}]
[]
[null,"PREÇO:",null,null,null,{"$f":"+F49+F51","v":173.58}]
[]
["CÓDIGO","DISCRIMINAÇÃO","UN","COEFIC.","UNITÁRIO","TOTAL"]
[122,"DEMOLIÇÃO DE MESA DE CONCRETO C/REMOÇÃO DE ENTULHOS","un"]
[{"$f":"CONCATENATE(\"SINAPI C \",'Composições Aux. SINAPI'!$A$59,)","v":"SINAPI C 5795"},"MARTELETE OU ROMPEDOR PNEUMÁTICO MANUAL, 28 KG, COM SILENCIADOR (chp)","chp",0.72019999999999995,{"$f":"+'Composições Aux. SINAPI'!$E$59:$F$59","v":26.44},{"$f":"TRUNC(D57*E57,2)","v":19.04}]
[{"$f":"CONCATENATE(\"SINAPI C \",'Composições Aux. SINAPI'!$A$60,)","v":"SINAPI C 5952"},"MARTELETE OU ROMPEDOR PNEUMÁTICO MANUAL, 28 KG, COM SILENCIADOR (chi)","chi",0.2041,{"$f":"+'Composições Aux. SINAPI'!$E$60:$F$60","v":24.44},4.9800000000000004]
[{"$f":"CONCATENATE(\"SINAPI C \",'Composições Aux. SINAPI'!$A$34,)","v":"SINAPI C 5953"},"COMPRESSOR DE AR REBOCÁVEL, VAZÃO 189 PCM, MOTOR DIESEL, POTÊNCIA 63 CV (chp)","chp",0.72019999999999995,{"$f":"+'Composições Aux. SINAPI'!$E$34:$F$34","v":41.39},29.8]
[{"$f":"CONCATENATE(\"SINAPI C \",'Composições Aux. SINAPI'!$A$35,)","v":"SINAPI C 5954"},"COMPRESSOR DE AR REBOCÁVEL, VAZÃO 189 PCM, MOTOR DIESEL, POTÊNCIA 63 CV (chi)","chi",0.2041,{"$f":"+'Composições Aux. SINAPI'!$E$35:$F$35","v":3.73},0.76]
[{"$f":"CONCATENATE(\"COTAÇÃO \",Insumos!$B$66)","v":"COTAÇÃO 113"},"CAÇAMBA 4,00 m³","un",0.15040000000000001,{"$f":"+Insumos!$G$66","v":443.33},66.67]
[{"$f":"CONCATENATE(\"SINAPI I \",Insumos!$B$35)","v":"SINAPI I 6081"},"ARGILA OU BARRO PARA ATERRO OU REATERRO","m³",0.29249999999999998,{"$f":"+Insumos!$G$35","v":31.59},9.24]
["SUB-TOTAL - MATERIAL / EQUIPAMENTOS:",null,{"$f":"SUM(F57:F62)","v":130.49}]
["SINAPI C 88309","PEDREIRO C/ENCARGOS COMPLEMENTARES","h",0.14119999999999999,{"$f":"'Planilha_M.O.'!E24","v":20.71},{"$f":"TRUNC(D64*E64,2)","v":2.92}]
["SINAPI C 88316","SERVENTE C/ ENCARGOS COMPLEMENTARES","h",2.0205000000000002,{"$f":"'Planilha_M.O.'!E18","v":17.11},{"$f":"TRUNC(D65*E65,2)","v":34.57}]
["SUB-TOTAL - MÃO-DE-OBRA:",null,{"$f":"SUM(F64:F65)","v":37.49}]
[]
[null,"CUSTO TOTAL:",null,null,null,{"$f":"+C63+C66","v":167.98000000000002}]
[]
[null,"BDI:","%",{"$f":"+$F$7","v":"22,15%"},null,{"$f":"TRUNC(F68*D70,2)","v":37.200000000000003}]
[]
[null,"PREÇO:",null,null,null,{"$f":"+F68+F70","v":205.18}]
[]
["CÓDIGO","DISCRIMINAÇÃO","UN","COEFIC.","UNITÁRIO","TOTAL"]
[450,"ART - ANOTAÇÃO DE RESPONSABILIDADE TÉCNICA PELA EXECUÇÃO","un"]
[{"$f":"CONCATENATE(\"COTAÇÃO \",Insumos!$B$38)","v":"COTAÇÃO 128"},"ART","un",1,{"$f":"+Insumos!$G$38","v":226},{"$f":"TRUNC(D76*E76,2)","v":226}]
["SUB-TOTAL - MATERIAL / EQUIPAMENTOS:",null,{"$f":"SUM(F76)","v":226}]
[]
[null,"CUSTO TOTAL:",null,null,null,{"$f":"+C77","v":226}]
[]
[null,"BDI:","%",{"$f":"+$F$7","v":"22,15%"},null,{"$f":"TRUNC(F79*D81,2)","v":50.05}]
[]
[null,"PREÇO:",null,null,null,{"$f":"+F79+F81","v":276.05}]
[]
[]
["CÓDIGO","DISCRIMINAÇÃO","UN","COEFIC.","UNITÁRIO","TOTAL"]
[500,"TAPUME EM CHAPA DE COMPENSADO RESINADO","m²"]
["SINAPI I 002745","PONTALETE ROLIÇO S/TRATAMENTO EUCALIPTO D=8 A 11 cm","m",0.26219999999999999,{"$f":"Insumos!G159","v":3.39},{"$f":"TRUNC(D88*E88,2)","v":0.88}]
["SINAPI I 004460","SARRAFO DE MADEIRA NÃO APARELHADA 2,5 x 10 cm","m",0.70799999999999996,{"$f":"Insumos!G179","v":7.48},5.29]
["SINAPI I 001355","CHAPA DE MADEIRA COMPENSADA RESINADA 14 mm","m²",0.52500000000000002,{"$f":"Insumos!G78","v":28.72},15.07]
["SINAPI C 91692","SERRA CIRCULAR DE BANCADA C/COIFA PARA DISCO 10\" (chp)","chp",4.4000000000000003E-3,{"$f":"'Composições Aux. SINAPI'!E72:F72","v":26.83},0.11]
["SINAPI C 91693","SERRA CIRCULAR DE BANCADA C/COIFA PARA DISCO 10\" (chi)","chi",1.9099999999999999E-2,{"$f":"'Composições Aux. SINAPI'!E73:F73","v":23.89},0.45]
["SINAPI I 5061","PREGO DE AÇO 18 x 27 C/CABEÇA","kg",4.2799999999999998E-2,{"$f":"Insumos!G170","v":20.75},0.88]
["SINAPI I 35693","TINTA LÁTEX ACRÍLICA ECONÔMICA, COR BRANCA","l",0.26979999999999998,{"$f":"Insumos!G206","v":11.78},{"$f":"TRUNC(D94*E94,2)","v":3.17}]
[{"$f":"CONCATENATE(\"SINAPI I \",[2]Insumos!$B$228)","v":"SINAPI I 3767"},"LIXA P/MADEIRA","un",0.8,{"$f":"Insumos!G120","v":0.79},{"$f":"TRUNC(D95*E95,2)","v":0.63}]
["SUB-TOTAL - MATERIAL / EQUIPAMENTOS:",null,{"$f":"SUM(F88:F95)","v":26.48}]
["SINAPI C 88262","CARPINTEIRO C/ENCARGOS COMPLEMENTARES","h",0.61270000000000002,{"$f":"'Planilha_M.O.'!E26","v":20.5},{"$f":"TRUNC(D97*E97,2)","v":12.56}]
["SINAPI C 88239","AJUDANTE DE CARPINTEIRO C/ENCARGOS COMPLEMENTARES","h",0.20419999999999999,{"$f":"'Planilha_M.O.'!E20","v":17.059999999999999},{"$f":"TRUNC(D98*E98,2)","v":3.48}]
["SINAPI C 88310","PINTOR C/ENCARGOS COMPLEMENTARES","h",0.8,{"$f":"'Planilha_M.O.'!E25","v":21.7},{"$f":"TRUNC(D99*E99,2)","v":17.36}]
["SINAPI C 88316","SERVENTE C/ ENCARGOS COMPLEMENTARES","h",0.45,{"$f":"'Planilha_M.O.'!E18","v":17.11},{"$f":"TRUNC(D100*E100,2)","v":7.69}]
["SUB-TOTAL - MÃO-DE-OBRA:",null,{"$f":"SUM(F97:F100)","v":41.089999999999996}]
[]
[null,"CUSTO TOTAL:",null,null,null,{"$f":"+C96+C101","v":67.569999999999993}]
[]
[null,"BDI:","%",{"$f":"+$F$7","v":"22,15%"},null,{"$f":"TRUNC(F103*D105,2)","v":14.96}]
[]
[null,"PREÇO:",null,null,null,{"$f":"+F103+F105","v":82.53}]
[]
["CÓDIGO","DISCRIMINAÇÃO","UN","COEFIC.","UNITÁRIO","TOTAL"]
[510,"LOCAÇÃO DE BANHEIRO QUÍMICO","%"]
["SUDECAP 89.50.09","LOCAÇÃO SANITÁRIO QUÍMICO","ms",0.01,{"$f":"+Insumos!G121","v":680},{"$f":"TRUNC(D111*E111,4)","v":6.8}]
["SUB-TOTAL - MATERIAL / EQUIPAMENTOS:",null,{"$f":"SUM(F111)","v":6.8}]
[]
[null,"CUSTO TOTAL:",null,null,null,{"$f":"+C112","v":6.8}]
[]
[null,"BDI:","%",{"$f":"+$F$7","v":"22,15%"},null,{"$f":"TRUNC(F114*D116,4)","v":1.5062}]
[]
[null,"PREÇO:",null,null,null,{"$f":"+F114+F116","v":8.3062000000000005}]
[null,"CÁLCULO: LOCAÇÃO BANHEIRO: NÚMERO DE MESES: 1,0 MÊS"]
[null,"NECESSÁRIO 1% DO VALOR TOTAL DA OBRA, DESSA FORMA , COEFICIENTE =1,0 MÊS /100%"]
[]
["CÓDIGO","DISCRIMINAÇÃO","UN","COEFIC.","UNITÁRIO","TOTAL"]
[520,"FRETE P/ SANITÁRIO QUÍMICO","cj"]
["SINAPI C 93402","GUINDAUTO HIDRÁULICO, CAP. 3300 KG, INCLUSIVE CAMINHÃO TOCO","chp",5,{"$f":"'Composições Aux. SINAPI'!E51:F51","v":177.73},{"$f":"TRUNC(D124*E124,2)","v":888.65}]
["SUB-TOTAL - MATERIAL / EQUIPAMENTOS:",null,{"$f":"SUM(F124)","v":888.65}]
[]
[null,"CUSTO TOTAL:",null,null,null,{"$f":"+C125","v":888.65}]
[null,"Auxiliar para composições 510"]
[null,"BDI:","%",{"$f":"+$F$7","v":"22,15%"},null,{"$f":"TRUNC(F127*D129,2)","v":196.83}]
[]
[null,"PREÇO:",null,null,null,{"$f":"+F127+F129","v":1085.48}]
[]
["CÓDIGO","DISCRIMINAÇÃO","UN","COEFIC.","UNITÁRIO","TOTAL"]
[530,"INSTALAÇÃO PROVISÓRIA DE ENERGIA, AÉREA, TRIFASICA, COM CAIXA DE EMBUTIR C/ POSTE H=9,00M","pt"]
["SINAPI C 91872","ELETRODUTO RÍGIDO ROSCÁVEL, PVC, DN 32 mm (1\"), PARA CIRCUITOS TERMINAIS","m",6.05,{"$f":"'Composições Aux. SINAPI'!E49:F49","v":14.97},{"$f":"TRUNC(D135*E135,2)","v":90.56}]
["SINAPI C 91885","LUVA PARA ELETRODUTO, PVC, ROSCÁVEL, DN 32 mm (1\")","un",1,{"$f":"'Composições Aux. SINAPI'!E58:F58","v":8.8800000000000008},8.8800000000000008]
["SINAPI C 91917","CURVA 90° PARA ELETRODUTO, PVC, ROSCÁVEL, DN 32 mm (1\")","un",1,{"$f":"'Composições Aux. SINAPI'!E44:F44","v":14.99},14.99]
["SINAPI C 91919","CURVA 180° P/ELETRODUTO, PVC, ROSCÁVEL, DN 32 mm (1\"\u0094)","un",1,{"$f":"'Composições Aux. SINAPI'!E45:F45","v":16.98},16.98]
["SINAPI C 91933","CABO DE COBRE FLEXÍVEL ISOLADO, 10 mm², ANTI-CHAMA 0,6/1,0 kV","m",22.2,{"$f":"'Composições Aux. SINAPI'!E27:F27","v":16.22},360.08]
["SINAPI C 93673","DISJUNTOR TRIPOLAR TIPO DIN, CORRENTE NOMINAL DE 50 A","un",1,{"$f":"'Composições Aux. SINAPI'!E48:F48","v":94.12},94.12]
["SINAPI C 96977","CORDOALHA DE COBRE NU 50 mm², ENTERRADA, SEM ISOLADOR","m",1.95,{"$f":"'Composições Aux. SINAPI'!E43:F43","v":50.13},97.75]
["SINAPI C 96986","HASTE DE ATERRAMENTO 3/4\" PARA SPDA","un",1,{"$f":"'Composições Aux. SINAPI'!E52:F52","v":102.57},102.57]
["SINAPI C 100578","ASSENTAMENTO DE POSTE DE CONCRETO COM COMPRIMENTO NOMINAL DE 9 m","un",1,{"$f":"'Composições Aux. SINAPI'!E24:F24","v":412.48},412.48]
["SINAPI I 001094","ARMAÇÃO VERTICAL C/HASTE E CONTRA-PINO, EM CHAPA DE FG 3/16\", C/1 ESTRIBO","un",1,{"$f":"Insumos!G36","v":13.98},13.98]
["SINAPI I 003398","ISOLADOR DE PORCELANA, TIPO ROLDANA, DIMENSÕES DE 72 x 72 mm","un",1,{"$f":"Insumos!G114","v":4.7699999999999996},4.7699999999999996]
["SINAPI I 004346","PARAFUSO FERRO POLIDO, SEXTAVADO, D=5/8\", C/PORCA E ARRUELA DE PRESSÃO MÉDIA","un",3,{"$f":"Insumos!G140","v":6.93},20.79]
["SINAPI I 011267","ARRUELA LISA, DE LATÃO POLIDO, DIÂMETRO NOMINAL 5/8\", DIÂMETRO DO FURO = 17 mm","un",2,{"$f":"Insumos!G37","v":0.8},1.6]
["SINAPI I 011864","CONECTOR METÁLICO TIPO PARAFUSO FENDIDO (SPLIT BOLT), PARA CABOS ATÉ 95 mm2","un",1,{"$f":"Insumos!G87","v":29.18},29.18]
["SINAPI I 011950","BUCHA NYLON S/ABA S6, C/PARAFUSO DE 4,2 x 40 mm EM AÇO ZINCADO C/ROSCA SOBERBA","un",4,{"$f":"Insumos!G64","v":0.37},1.48]
["SINAPI I 014153","FITA METÁLICA PERFURADA, L = 18 mm, ROLO DE 30 m, CARGA RECOMENDADA = 30 kgf","un",0.06,{"$f":"Insumos!G103","v":52.81},3.16]
["SINAPI I 034643","CAIXA INSPEÇÃO EM POLIETILENO PARA ATERRAMENTO E PÁRA RAIOS DIÂMETRO = 300 mm","un",1,{"$f":"Insumos!G69","v":20.079999999999998},20.079999999999998]
["SINAPI I 039809","CAIXA P/MEDIDOR POLIFÁSICO, EM POLICARBONATO/TERMOPLÁSTICO, P/1 DISJUNTOR","un",1,{"$f":"Insumos!G70","v":138.18},138.18]
["SINAPI I 039996","VERGALHÃO ZINCADO ROSCA TOTAL, 1/4 \" (6,3 mm)","m",0.16639999999999999,{"$f":"Insumos!G226","v":5.38},0.89]
["SINAPI I 039997","PORCA ZINCADA, SEXTAVADA, DIÂMETRO 1/4\"","un",2,{"$f":"Insumos!G163","v":0.2},0.4]
["SINAPI I 005044","POSTE DE CONCRETO CIRCULAR, 200 kg, H = 9 m","un",1,{"$f":"Insumos!G172","v":920.7},920.7]
["SUB-TOTAL - MATERIAL / EQUIPAMENTOS:",null,{"$f":"SUM(F135:F155)","v":2353.6200000000003}]
[{"$f":"CONCATENATE(\"SINAPI C \",[3]Insumos!$B$23)","v":"SINAPI C 88264"},"ELETRICISTA C/ENCARGOS COMPLEMENTARES","h",3.5078,{"$f":"'Planilha_M.O.'!E41","v":22.61},{"$f":"TRUNC(D157*E157,2)","v":79.31}]
[{"$f":"CONCATENATE(\"SINAPI C \",[3]Insumos!$B$16)","v":"SINAPI C 88247"},"AUXILIAR DE ELETRICISTA C/ENCARGOS COMPLEMENTARES","h",0.38969999999999999,{"$f":"'Planilha_M.O.'!E42","v":17.170000000000002},{"$f":"TRUNC(D158*E158,2)","v":6.69}]
["SUB-TOTAL - MÃO-DE-OBRA:",null,{"$f":"SUM(F157:F158)","v":86}]
[]
[null,"CUSTO TOTAL:",null,null,null,{"$f":"+C156+C159","v":2439.6200000000003}]
[]
[null,"BDI:","%",{"$f":"+$F$7","v":"22,15%"},null,{"$f":"TRUNC(F161*D163,2)","v":540.37}]
[]
[]
[null,"PREÇO:",null,null,null,{"$f":"+F161+F163","v":2979.9900000000002}]
[]
[]
["CÓDIGO","DISCRIMINAÇÃO","UN","COEFIC.","UNITÁRIO","TOTAL"]
[535,"INSTALAÇÃO PROVISÓRIA DE ÁGUA","pt"]
[{"$f":"CONCATENATE(\"SINAPI C \",'[3]Composições Aux. SINAPI'!$A$62)","v":"SINAPI C 89971"},"KIT DE REGISTRO DE GAVETA BRUTO DE LATÃO ½\", INCLUSIVE CONEXÕES, ROSCÁVEL","un",1,{"$f":"'Composições Aux. SINAPI'!E54:F54","v":50.53},{"$f":"TRUNC(D171*E171,2)","v":50.53}]
[{"$f":"CONCATENATE(\"SINAPI C \",'[3]Composições Aux. SINAPI'!$A$50)","v":"SINAPI C 93358"},"ESCAVAÇÃO MANUAL DE VALA COM PROFUNDIDADE MENOR OU IGUAL A 1,30 M","m³",0.16,{"$f":"'Composições Aux. SINAPI'!E50:F50","v":67.680000000000007},10.82]
[{"$f":"CONCATENATE(\"SINAPI C \",'[3]Composições Aux. SINAPI'!$A$91)","v":"SINAPI C 89401"},"TUBO, PVC, SOLDÁVEL, DN 20MM - FORNECIMENTO E INSTALAÇÃO","m",8,{"$f":"'Composições Aux. SINAPI'!E76:F76","v":7.63},61.04]
[{"$f":"CONCATENATE(\"SINAPI C \",'[3]Composições Aux. SINAPI'!$A$61)","v":"SINAPI C 89358"},"JOELHO 90 GRAUS, PVC, SOLDÁVEL, DN 20MM - FORNECIMENTO E INSTALAÇÃO","un",4,{"$f":"'Composições Aux. SINAPI'!E53:F53","v":6.38},25.52]
[{"$f":"CONCATENATE(\"SINAPI C \",'[3]Composições Aux. SINAPI'!$A$25)","v":"SINAPI C 95676"},"CAIXA EM CONCRETO PRÉ-MOLDADO PARA ABRIGO DE HIDRÔMETRO COM DN 20 (½\u0094)","un",1,{"$f":"'Composições Aux. SINAPI'!E28:F28","v":93.49},93.49]
[{"$f":"CONCATENATE(\"SINAPI C \",'[3]Composições Aux. SINAPI'!$A$83)","v":"SINAPI C 86913"},"TORNEIRA CROMADA 1/2\" OU 3/4\" PARA TANQUE, PADRÃO POPULAR","un",1,{"$f":"'Composições Aux. SINAPI'!E74:F74","v":27.71},27.71]
[{"$f":"CONCATENATE(\"COTAÇÃO \",[3]Insumos!$B$339)","v":"COTAÇÃO 116"},"TAXA INSTALAÇÃO ÁGUA DMAE","cj",1,{"$f":"Cotações!M134","v":465.36},465.36]
["SUB-TOTAL - MATERIAL / EQUIPAMENTOS:",null,{"$f":"SUM(F171:F177)","v":734.47}]
[]
[null,"CUSTO TOTAL:",null,null,null,{"$f":"+C178","v":734.47}]
[]
[null,"BDI:","%",{"$f":"+$F$7","v":"22,15%"},null,{"$f":"TRUNC(F180*D182,2)","v":162.68}]
[]
[null,"PREÇO:",null,null,null,{"$f":"+F180+F182","v":897.15000000000009}]
[]
[]
["CÓDIGO","DISCRIMINAÇÃO","UN","COEFIC.","UNITÁRIO","TOTAL"]
[542,"PLACA DE OBRA EM CHAPA GALVANIZADA","m²"]
["COTAÇÃO 16","CAIBRO CEDRINHO 5 x 7 cm","m",0.57110000000000005,{"$f":"Cotações!M11","v":22.2},{"$f":"TRUNC(D189*E189,2)","v":12.67}]
["SINAPI I 44481","VIGA DE MADEIRA NÃO APARELHADA 8 x 16 cm","m",0.57110000000000005,{"$f":"Insumos!G227","v":43.33},24.74]
["SINAPI I 5075","PREGO DE AÇO 18 x 30 C/CABEÇA","kg",9.8699999999999996E-2,{"$f":"Insumos!G166","v":21.11},2.08]
["COTAÇÃO 113","CAÇAMBA 4,00 m³","un",8.0000000000000002E-3,{"$f":"Insumos!G66","v":443.33},3.54]
["SINAPI C 94962","CONCRETO MAGRO PARA LASTRO,PREPARO COM BETONEIRA","m³",2.9899999999999999E-2,{"$f":"'Composições Aux. SINAPI'!E36:F36","v":294.52999999999997},8.8000000000000007]
["SINAPI C 92873","LANÇAMENTO, ADENSAMENTO E ACABAMENTO CONCRETO","m³",2.9899999999999999E-2,{"$f":"+'[2]Composições Aux. SINAPI'!$E$53:$F$53","v":154.36000000000001},4.6100000000000003]
["SINAPI I 4813","PLACA DE OBRA (PARA CONSTRUCAO CIVIL) EM CHAPA GALVANIZADA *N. 22*, ADESIVADA, DE *2,0 X 1,125* M","m²",1,{"$f":"Insumos!G157","v":225},225]
["SUB-TOTAL - MATERIAL / EQUIPAMENTOS:",null,{"$f":"SUM(F189:F195)","v":281.44}]
["SINAPI C 88262","CARPINTEIRO C/ENCARGOS COMPLEMENTARES","h",0.51800000000000002,{"$f":"'Planilha_M.O.'!E26","v":20.5},{"$f":"TRUNC(D197*E197,2)","v":10.61}]
["SINAPI C 88239","AJUDANTE DE CARPINTEIRO C/ENCARGOS COMPLEMENTARES","h",0.40010000000000001,{"$f":"'Planilha_M.O.'!E20","v":17.059999999999999},{"$f":"TRUNC(D198*E198,2)","v":6.82}]
["SINAPI C 88309","PEDREIRO C/ENCARGOS COMPLEMENTARES","h",7.5499999999999998E-2,{"$f":"'Planilha_M.O.'!E24","v":20.71},{"$f":"TRUNC(D199*E199,2)","v":1.56}]
["SINAPI C 88316","SERVENTE C/ ENCARGOS COMPLEMENTARES","h",0.15509999999999999,{"$f":"'Planilha_M.O.'!E18","v":17.11},{"$f":"TRUNC(D200*E200,2)","v":2.65}]
["SUB-TOTAL - MÃO-DE-OBRA:",null,{"$f":"SUM(F197:F200)","v":21.639999999999997}]
[]
[null,"CUSTO TOTAL:",null,null,null,{"$f":"+C196+C201","v":303.08}]
[]
[null,"BDI:","%",{"$f":"+$F$7","v":"22,15%"},null,{"$f":"TRUNC(F203*D205,2)","v":67.13}]
[]
[null,"PREÇO:",null,null,null,{"$f":"+F203+F205","v":370.21}]
[]
[]
["CÓDIGO","DISCRIMINAÇÃO","UN","COEFIC.","UNITÁRIO","TOTAL"]
[552,"SINALIZAÇÃO COM TELA PLÁSTICA LARANJA FIXADA EM CONE PLÁSTICO","m"]
["SINAPI I 34498","CONE DE SINALIZAÇÃO EM PVC FLEXÍVEL, h=70/76 cm","un",0.17499999999999999,{"$f":"Insumos!G86","v":114.77},{"$f":"TRUNC(D212*E212,2)","v":20.079999999999998}]
["SINAPI I 37524","TELA PLÁSTICA LARANJA","m",1.1000000000000001,{"$f":"Insumos!G194","v":2.06},{"$f":"TRUNC(D213*E213,2)","v":2.2599999999999998}]
["SUB-TOTAL - MATERIAL / EQUIPAMENTOS:",null,{"$f":"SUM(F212:F213)","v":22.339999999999996}]
[{"$f":"CONCATENATE(\"SINAPI C \",[2]Insumos!$B$23)","v":"SINAPI C 88262"},"CARPINTEIRO C/ENCARGOS COMPLEMENTARES","h",0.16800000000000001,{"$f":"'Planilha_M.O.'!E26","v":20.5},{"$f":"TRUNC(D215*E215,2)","v":3.44}]
[{"$f":"CONCATENATE(\"SINAPI C \",[2]Insumos!$B$15)","v":"SINAPI C 88239"},"AJUDANTE DE CARPINTEIRO C/ENCARGOS COMPLEMENTARES","h",0.13200000000000001,{"$f":"'Planilha_M.O.'!E20","v":17.059999999999999},{"$f":"TRUNC(D216*E216,2)","v":2.25}]
["SUB-TOTAL - MÃO-DE-OBRA:",null,{"$f":"SUM(F215:F216)","v":5.6899999999999995}]
[]
[null,"CUSTO TOTAL:",null,null,null,{"$f":"+C214+C217","v":28.029999999999994}]
[]
[null,"BDI:","%",{"$f":"+$F$7","v":"22,15%"},null,{"$f":"TRUNC(F219*D221,2)","v":6.2}]
[]
[null,"PREÇO:",null,null,null,{"$f":"+F219+F221","v":34.229999999999997}]
[]
["CÓDIGO","DISCRIMINAÇÃO","UN","COEFIC.","UNITÁRIO","TOTAL"]
[99064,"LOCAÇÃO DE OBRA","m"]
["SINAPI C 99058","LOCAÇÃO DE PONTO PARA REFERÊNCIA TOPOGRÁFICA","un",0.05,{"$f":"'Composições Aux. SINAPI'!E57:F57","v":10.33},{"$f":"TRUNC(D227*E227,2)","v":0.51}]
["SUB-TOTAL - MATERIAL / EQUIPAMENTOS:",null,{"$f":"SUM(F227:F227)","v":0.51}]
[]
[null,"CUSTO TOTAL:",null,null,null,{"$f":"+C228","v":0.51}]
[]
[null,"BDI:","%",{"$f":"+$F$7","v":"22,15%"},null,{"$f":"TRUNC(F230*D232,2)","v":0.11}]
[]
[null,"PREÇO:",null,null,null,{"$f":"+F230+F232","v":0.62}]
[]
["CÓDIGO","DISCRIMINAÇÃO","UN","COEFIC.","UNITÁRIO","TOTAL"]
[565,"NIVELAMENTO","m²"]
["SINAPI I 4460","SARRAFO NÃO APARELHADO 2,5 X 10 cm","m",2.8999999999999998E-3,{"$f":"Insumos!G179","v":7.48},{"$f":"TRUNC(D238*E238,2)","v":0.02}]
["SINAPI I 7252","LOCACAO DE NIVEL OPTICO, COM PRECISAO DE 0,7 MM, AUMENTO DE 32X","h",2.5000000000000001E-3,{"$f":"Insumos!G130","v":2.0299999999999998},{"$f":"ROUND(D239*E239,2)","v":0.01}]
["SUB-TOTAL - MATERIAL / EQUIPAMENTOS:",null,{"$f":"SUM(F238:F239)","v":0.03}]
["SINAPI C 88253","AUXILIAR DE TOPÓGRAFO C/ENCARGOS COMPLEMENTARES","h",2.5000000000000001E-3,{"$f":"'Planilha_M.O.'!E21","v":13.69},{"$f":"TRUNC(D241*E241,2)","v":0.03}]
["SINAPI C 90781","TOPÓGRAFO C/ ENCARGOS COMPLEMENTARES","h",2.5000000000000001E-3,{"$f":"'Planilha_M.O.'!E39","v":31.8},{"$f":"TRUNC(D242*E242,2)","v":7.0000000000000007E-2}]
["SINAPI C 88316","SERVENTE C/ ENCARGOS COMPLEMENTARES","h",7.4999999999999997E-3,{"$f":"'Planilha_M.O.'!E18","v":17.11},{"$f":"TRUNC(D243*E243,2)","v":0.12}]
["SUB-TOTAL - MÃO-DE-OBRA:",null,{"$f":"SUM(F241:F243)","v":0.22}]
[]
[null,"CUSTO TOTAL:",null,null,null,{"$f":"+C240+C244","v":0.25}]
[]
[null,"BDI:","%",{"$f":"+$F$7","v":"22,15%"},null,{"$f":"TRUNC(F246*D248,2)","v":0.05}]
[]
[null,"PREÇO:",null,null,null,{"$f":"+F246+F248","v":0.3}]
[]
["CÓDIGO","DISCRIMINAÇÃO","UN","COEFIC.","UNITÁRIO","TOTAL"]
[97053,"SINALIZAÇÃO COM FITA ZEBRADA FIXADA EM CONE PLÁSTICO","m"]
["SINAPI I 34498","CONE DE SINALIZAÇÃO EM PVC FLEXÍVEL, h=70/76 cm","un",2.1899999999999999E-2,{"$f":"+Insumos!$G$86","v":114.77},{"$f":"TRUNC(D254*E254,2)","v":2.5099999999999998}]
["SINAPI I 42015","FITA ZEBRADA","m",1.1000000000000001,{"$f":"+Insumos!$G$105","v":1.1200000000000001},{"$f":"TRUNC(D255*E255,2)","v":1.23}]
["SUB-TOTAL - MATERIAL / EQUIPAMENTOS:",null,{"$f":"SUM(F254:F255)","v":3.7399999999999998}]
["SINAPI C 88262","CARPINTEIRO C/ENCARGOS COMPLEMENTARES","h",0.1384,{"$f":"'Planilha_M.O.'!E26","v":20.5},{"$f":"TRUNC(D257*E257,2)","v":2.83}]
["SINAPI C 88239","AJUDANTE DE CARPINTEIRO C/ENCARGOS COMPLEMENTARES","h",0.10879999999999999,{"$f":"'Planilha_M.O.'!E20","v":17.059999999999999},{"$f":"TRUNC(D258*E258,2)","v":1.85}]
["SUB-TOTAL - MÃO-DE-OBRA:",null,{"$f":"SUM(F257:F258)","v":4.68}]
[]
[null,"CUSTO TOTAL:",null,null,null,{"$f":"+C256+C259","v":8.42}]
[]
[null,"BDI:","%",{"$f":"+$F$7","v":"22,15%"},null,{"$f":"TRUNC(F261*D263,2)","v":1.86}]
[]
[null,"PREÇO:",null,null,null,{"$f":"+F261+F263","v":10.28}]
[]
["CÓDIGO","DISCRIMINAÇÃO","UN","COEFIC.","UNITÁRIO","TOTAL"]
[700,"ADMINISTRAÇÃO LOCAL","%"]
["SINAPI C 90778","ENGENHEIRO CIVIL DE OBRA C/ENCARGOS COMPLEMENTARES","h",0.44,{"$f":"'Planilha_M.O.'!E38","v":107.35},{"$f":"TRUNC(D269*E269,4)","v":47.234000000000002}]
["SINAPI C 93572","ENCARREGADO DE OBRAS","mês",0.01,{"$f":"'Planilha_M.O.'!E37","v":7828.88},{"$f":"TRUNC(D270*E270,4)","v":78.288799999999995}]
["SINAPI C 88326","VIGIA NOTURNO COM ENCARGOS COMPLEMENTARES","h",{"$f":"(30*10)/100","v":3},{"$f":"'Planilha_M.O.'!E40","v":22.41},{"$f":"TRUNC(D271*E271,4)","v":67.23}]
["SINAPI I 10886","EXTINTOR DE INCENDIO PORTATIL COM CARGA DE AGUA PRESSURIZADA DE 10 L, CLASSE A","un",0.01,{"$f":"Insumos!G98","v":183.75},{"$f":"TRUNC(D272*E272,4)","v":1.8374999999999999}]
["SINAPI I 10891","EXTINTOR DE INCENDIO PORTATIL COM CARGA DE PO QUIMICO SECO (PQS) DE 4 KG, CLASSE BC","un",0.01,{"$f":"Insumos!G99","v":177.69},{"$f":"TRUNC(D273*E273,4)","v":1.7768999999999999}]
["SMAMS 750","CONSUMO DE ENERGIA ELÉTRICA","kWh",3,{"$f":"F289","v":0.91},{"$f":"TRUNC(D274*E274,4)","v":2.73}]
["SMAMS 753","CONSUMO DE AGUA TRATADA","m³",0.5,{"$f":"C300","v":7.2299999999999995},3.6150000000000002]
["SUB-TOTAL - MÃO-DE-OBRA:",null,{"$f":"SUM(F269:F275)","v":202.7122}]
[]
[null,"CUSTO TOTAL:",null,null,null,{"$f":"C276","v":202.7122}]
[]
[null,"BDI:","%",{"$f":"+$F$7","v":"22,15%"},null,{"$f":"TRUNC(F278*D280,4)","v":44.900700000000001}]
[]
[null,"PREÇO:",null,null,null,{"$f":"+F278+F280","v":247.6129}]
[]
["ITEM","DISCRIMINAÇÃO","UN","COEFIC.","UNITÁRIO","TOTAL"]
[750,"CONSUMO DE ENERGIA ELÉTRICA","kWh"]
["SINAPI I 2705","ENERGIA ELÉTRICA","kWh",1,{"$f":"Insumos!G95","v":0.91},{"$f":"TRUNC(D286*E286,2)","v":0.91}]
["SUB-TOTAL - MATERIAL / EQUIPAMENTOS:",null,{"$f":"SUM(F286)","v":0.91}]
[]
[null,"CUSTO TOTAL:",null,null,null,{"$f":"C287","v":0.91}]
[]
[null,"BDI:","%",{"$f":"+$F$7","v":"22,15%"},null,{"$f":"TRUNC(F289*D291,2)","v":0.2}]
[]
[null,"PREÇO:",null,null,null,{"$f":"+F289+F291","v":1.1100000000000001}]
[]
[]
["ITEM","DISCRIMINAÇÃO","UN","COEFIC.","UNITÁRIO","TOTAL"]
[753,"CONSUMO DE ÁGUA TRATADA","m³"]
[{"$f":"CONCATENATE(\"COTAÇÃO \",[3]Insumos!$B$77)","v":"COTAÇÃO 118"},"ÁGUA TRATADA","m³",1,{"$f":"Cotações!D136","v":4.0199999999999996},{"$f":"TRUNC(D298*E298,2)","v":4.0199999999999996}]
[{"$f":"CONCATENATE(\"COTAÇÃO \",[3]Insumos!$B$190)","v":"COTAÇÃO 119"},"ESGOTO CLOCAL","m³",1,{"$f":"Cotações!D137","v":3.2159999999999997},{"$f":"TRUNC(D299*E299,2)","v":3.21}]
["SUB-TOTAL - MATERIAL / EQUIPAMENTOS:",null,{"$f":"SUM(F298:F299)","v":7.2299999999999995}]
[]
[null,"CUSTO TOTAL:",null,null,null,{"$f":"C300","v":7.2299999999999995}]
[]
[null,"BDI:","%",{"$f":"+$F$7","v":"22,15%"},null,{"$f":"TRUNC(F302*D304,2)","v":1.6}]
[]
[null,"PREÇO:",null,null,null,{"$f":"+F302+F304","v":8.83}]
[]
[]
["CÓDIGO","DISCRIMINAÇÃO","UN","COEFIC.","UNITÁRIO","TOTAL"]
[1002,"MODELAGEM (MOVIMENTO DE TERRA ATÉ 15CM)","m²"]
["SINAPI C 91533","COMPACTADOR DE SOLOS DE PERCUSSÃO C/MOTOR A GASOLINA, POTÊNCIA 4 cv (chp)","chp",1.6000000000000001E-3,{"$f":"'Composições Aux. SINAPI'!E32:F32","v":32.03},{"$f":"TRUNC(D311*E311,2)","v":0.05}]
["SINAPI C 91534","COMPACTADOR DE SOLOS DE PERCUSSÃO C/MOTOR A GASOLINA, POTÊNCIA 4 cv (chi)","chi",1.6000000000000001E-3,{"$f":"'Composições Aux. SINAPI'!E33:F33","v":24.83},{"$f":"TRUNC(D312*E312,2)","v":0.03}]
["SUB-TOTAL - MATERIAL / EQUIPAMENTOS:",null,{"$f":"SUM(F311:F312)","v":0.08}]
["SINAPI C 88309","PEDREIRO C/ENCARGOS COMPLEMENTARES","h",5.0700000000000002E-2,{"$f":"'Planilha_M.O.'!E24","v":20.71},{"$f":"TRUNC(D314*E314,2)","v":1.04}]
["SINAPI C 88316","SERVENTE C/ ENCARGOS COMPLEMENTARES","h",7.5999999999999998E-2,{"$f":"'Planilha_M.O.'!E18","v":17.11},{"$f":"TRUNC(D315*E315,2)","v":1.3}]
["SUB-TOTAL - MÃO-DE-OBRA:",null,{"$f":"SUM(F314:F315)","v":2.34}]
[]
[null,"CUSTO TOTAL:",null,null,null,{"$f":"+C313+C316","v":2.42}]
[]
[null,"BDI:","%",{"$f":"+$F$7","v":"22,15%"},null,{"$f":"TRUNC(F318*D320,2)","v":0.53}]
[]
[null,"PREÇO:",null,null,null,{"$f":"+F318+F320","v":2.95}]
[]
["CÓDIGO","DISCRIMINAÇÃO","UN","COEFIC.","UNITÁRIO","TOTAL"]
[1003,"TERRAPLENAGEM (RETROESCAVADEIRA SOBRE RODAS)","d"]
[{"$f":"CONCATENATE(\"SINAPI C \",'Composições Aux. SINAPI'!$A$66)","v":"SINAPI C 5678"},"RETROESCAVADEIRA SOBRE RODAS, TRAÇÃO 4x4, POTÊNCIA 88 hp (chp)","chp",8,{"$f":"+'Composições Aux. SINAPI'!$E$66:$F$66","v":110.93},{"$f":"TRUNC(D326*E326,2)","v":887.44}]
["SUB-TOTAL - MATERIAL / EQUIPAMENTOS:",null,{"$f":"SUM(F326)","v":887.44}]
[]
[null,"CUSTO TOTAL:",null,null,null,{"$f":"+C327","v":887.44}]
[]
[null,"BDI:","%",{"$f":"+$F$7","v":"22,15%"},null,{"$f":"TRUNC(F329*D331,2)","v":196.56}]
[]
[null,"PREÇO:",null,null,null,{"$f":"+F329+F331","v":1084}]
[]
["CÓDIGO","DISCRIMINAÇÃO","UN","COEFIC.","UNITÁRIO","TOTAL"]
[1010,"ATERRO MANUAL C/MATERIAL IMPORTADO C/COMPACTAÇÃO MANUAL","m³"]
[{"$f":"CONCATENATE(\"SINAPI I \",Insumos!$B$35)","v":"SINAPI I 6081"},"ARGILA OU BARRO PARA ATERRO OU REATERRO","m³",1.25,{"$f":"+Insumos!$G$35","v":31.59},{"$f":"TRUNC(D337*E337,2)","v":39.479999999999997}]
["SUB-TOTAL - MATERIAL / EQUIPAMENTOS:",null,{"$f":"SUM(F337:F337)","v":39.479999999999997}]
["SINAPI C 88316","SERVENTE C/ ENCARGOS COMPLEMENTARES","h",2.3986000000000001,{"$f":"'Planilha_M.O.'!E18","v":17.11},{"$f":"TRUNC(D339*E339,2)","v":41.04}]
["SUB-TOTAL - MÃO-DE-OBRA:",null,{"$f":"SUM(F339)","v":41.04}]
[]
[null,"CUSTO TOTAL:",null,null,null,{"$f":"+C338+C340","v":80.52}]
[]
[null,"BDI:","%",{"$f":"+$F$7","v":"22,15%"},null,{"$f":"TRUNC(F342*D344,2)","v":17.829999999999998}]
[]
[null,"PREÇO:",null,null,null,{"$f":"+F342+F344","v":98.35}]
[]
[]
["CÓDIGO","DISCRIMINAÇÃO","UN","COEFIC.","UNITÁRIO","TOTAL"]
["SINAPI C 94994","EXECUÇÃO DE PASSEIO (CALÇADA) OU PISO DE CONCRETO COM CONCRETO MOLDADO IN LOCO, FEITO EM OBRA, ACABAMENTO CONVENCIONAL, ESPESSURA 8 CM, ARMADO.","m²"]
["SINAPI C 94964","CONCRETO FCK = 20MPA, TRAÇO 1:2,7:3 (CIMENTO/ AREIA MÉDIA/ BRITA 1) - PREPARO MECÂNICO COM BETONEIRA 400 L. AF_07/2016","m³",9.7000000000000003E-2,{"$f":"'Composições Aux. SINAPI'!E38:F38","v":368.57},{"$f":"TRUNC(D351*E351,2)","v":35.75}]
["SINAPI I 3777","LONA PLASTICA PESADA PRETA, E = 150 MICRA","m²",1.1279999999999999,{"$f":"Insumos!G122","v":1.47},{"$f":"TRUNC(D352*E352,2)","v":1.65}]
["SINAPI I 7156","TELA DE ACO SOLDADA NERVURADA, CA-60, Q-196, (3,11 KG/M2), DIAMETRO DO FIO = 5,0 MM, LARGURA = 2,45 M, ESPACAMENTO DA MALHA = 10 X 10 CM","m²",1.1224000000000001,{"$f":"Insumos!G198","v":51.7},58.02]
[{"$f":"CONCATENATE(\"SINAPI I \",Insumos!$B$181)","v":"SINAPI I 4517"},"SARRAFO PINUS 2,5 x 7,5 cm","m",0.2,{"$f":"+Insumos!$G$181","v":1.53},0.3]
["SINAPI I 4460","SARRAFO NÃO APARELHADO 2,5 X 10 cm","m",0.25,{"$f":"+Insumos!$G$179","v":7.48},1.87]
["SUB-TOTAL - MATERIAL / EQUIPAMENTOS:",null,{"$f":"SUM(F351:F355)","v":97.59}]
["SINAPI C 88262","CARPINTEIRO C/ENCARGOS COMPLEMENTARES","h",0.18049999999999999,{"$f":"'Planilha_M.O.'!E26","v":20.5},{"$f":"TRUNC(D357*E357,2)","v":3.7}]
["SINAPI C 88309","PEDREIRO C/ENCARGOS COMPLEMENTARES","h",0.2767,{"$f":"'Planilha_M.O.'!E24","v":20.71},{"$f":"TRUNC(D358*E358,2)","v":5.73}]
["SINAPI C 88316","SERVENTE C/ ENCARGOS COMPLEMENTARES","h",0.4572,{"$f":"'Planilha_M.O.'!E18","v":17.11},{"$f":"TRUNC(D359*E359,2)","v":7.82}]
["SUB-TOTAL - MÃO-DE-OBRA:",null,{"$f":"SUM(F357:F359)","v":17.25}]
[]
[null,"CUSTO TOTAL:",null,null,null,{"$f":"+C356+C360","v":114.84}]
[]
[null,"BDI:","%",{"$f":"+$F$7","v":"22,15%"},null,{"$f":"TRUNC(F362*D364,2)","v":25.43}]
[]
[null,"PREÇO:",null,null,null,{"$f":"+F362+F364","v":140.27000000000001}]
[]
[]
["CÓDIGO","DISCRIMINAÇÃO","UN","COEFIC.","UNITÁRIO","TOTAL"]
[2023,"PISO CONCRETO ARMADO E= 10 CM - ACADEMIA AO AR LIVRE - INCLUI JUNTA DILATAÇÃO","m²"]
[{"$f":"CONCATENATE(\"SINAPI C \",'Composições Aux. SINAPI'!$A$46)","v":"SINAPI C 95282"},"DESEMPENADEIRA DE CONCRETO, PESO DE 75KG, 4 PÁS, MOTOR A GASOLINA - CHP DIURNO","chp",3.3300000000000003E-2,{"$f":"+'Composições Aux. SINAPI'!$E$46:$F$46","v":9.33},{"$f":"TRUNC(D371*E371,2)","v":0.31}]
[{"$f":"CONCATENATE(\"SINAPI C \",'Composições Aux. SINAPI'!$A$47)","v":"SINAPI C 95283"},"DESEMPENADEIRA DE CONCRETO, PESO DE 75KG, 4 PÁS, MOTOR A GASOLINA - CHI DIURNO","chi",3.3300000000000003E-2,{"$f":"+'Composições Aux. SINAPI'!$E$47:$F$47","v":0.49},{"$f":"TRUNC(D372*E372,2)","v":0.01}]
[{"$f":"CONCATENATE(\"SINAPI C \",'Composições Aux. SINAPI'!$A$39)","v":"SINAPI C 91283"},"CORTADORA DE PISO, POTÊNCIA 13 hp, C/DISCO DE CORTE DIAMANTADO 350 mm","chp",3.7000000000000002E-3,{"$f":"+'Composições Aux. SINAPI'!$E$39:$F$39","v":21.82},{"$f":"TRUNC(D373*E373,2)","v":0.08}]
["SINAPI I 1527","CONCRETO USINADO BOMBEÁVEL, fck=25 MPa, INCLUI SERVIÇO DE BOMBEAMENTO","m³",0.105,{"$f":"+Insumos!$G$85","v":384.28},40.340000000000003]
[{"$f":"CONCATENATE(\"SINAPI C \",'Composições Aux. SINAPI'!$A$77)","v":"SINAPI C 90586"},"VIBRADOR DE IMERSÃO, DIÂMETRO DE PONTEIRA 45 mm (chp)","chp",6.7499999999999999E-3,{"$f":"+'Composições Aux. SINAPI'!$E$77:$F$77","v":1.79},0.01]
[{"$f":"CONCATENATE(\"SINAPI C \",'Composições Aux. SINAPI'!$A$78)","v":"SINAPI C 90587"},"VIBRADOR DE IMERSÃO, DIÂMETRO DE PONTEIRA 45 mm (chi)","chi",1.3129999999999999E-2,{"$f":"+'Composições Aux. SINAPI'!$E$78:$F$78","v":0.39},0.01]
["SINAPI I 21141","TELA DE AÇO SOLDADA CA-60 4,2mm 15 x 15 cm","m²",1.1200000000000001,{"$f":"+Insumos!$G$197","v":24.18},{"$f":"TRUNC(D377*E377,2)","v":27.08}]
["SINAPI I 5068","PREGO DE AÇO 17 x 21 C/CABEÇA","kg",3.5000000000000001E-3,{"$f":"+Insumos!$G$167","v":21.11},7.0000000000000007E-2]
[{"$f":"CONCATENATE(\"SINAPI I \",Insumos!$B$181)","v":"SINAPI I 4517"},"SARRAFO PINUS 2,5 x 7,5 cm","m",0.2,{"$f":"+Insumos!$G$181","v":1.53},0.3]
["SINAPI I 4460","SARRAFO NÃO APARELHADO 2,5 X 10 cm","m",0.25,{"$f":"+Insumos!$G$179","v":7.48},1.87]
[{"$f":"CONCATENATE(\"SINAPI I \",Insumos!$B$29)","v":"SINAPI I 43132"},"ARAME RECOZIDO 18 BWG","kg",2.4899999999999999E-2,{"$f":"+Insumos!$G$29","v":25.83},0.64]
[{"$f":"CONCATENATE(\"COTAÇÃO \",Insumos!$B$126)","v":"COTAÇÃO 106"},"MICROFIBRA DE POLIPROPILENO","sc",0.1,{"$f":"+Insumos!$G$126","v":23.2},2.3199999999999998]
["SINAPI I 3777","LONA PLÁSTICA PRETA","m²",1.1200000000000001,{"$f":"+Insumos!$G$122","v":1.47},1.64]
["SINAPI I 004011","GEOTEXTIL NAO TECIDO AGULHADO DE FILAMENTOS CONTINUOS 100% POLIESTER, RESITENCIA A TRACAO = 10 KN/M","m²",1.05,{"$f":"Insumos!G110","v":6.75},7.08]
["SUB-TOTAL - MATERIAL / EQUIPAMENTOS:",null,{"$f":"SUM(F371:F384)","v":81.759999999999991}]
["SINAPI C 88253","AUXILIAR DE TOPÓGRAFO C/ENCARGOS COMPLEMENTARES","h",2.5000000000000001E-3,{"$f":"'Planilha_M.O.'!E21","v":13.69},{"$f":"TRUNC(D386*E386,2)","v":0.03}]
["SINAPI C 88262","CARPINTEIRO C/ENCARGOS COMPLEMENTARES","h",1.5900000000000001E-2,{"$f":"'Planilha_M.O.'!E26","v":20.5},{"$f":"TRUNC(D387*E387,2)","v":0.32}]
["SINAPI C 88297","OPERADOR DE MÁQUINAS E EQUIPAMENTOS C/ENCARGOS COMPLEMENTARES","h",2.2800000000000001E-2,{"$f":"'Planilha_M.O.'!E35","v":23.8},{"$f":"TRUNC(D388*E388,2)","v":0.54}]
["SINAPI C 88309","PEDREIRO C/ENCARGOS COMPLEMENTARES","h",0.2082,{"$f":"'Planilha_M.O.'!E24","v":20.71},4.3099999999999996]
["SINAPI C 88316","SERVENTE C/ ENCARGOS COMPLEMENTARES","h",0.57899999999999996,{"$f":"'Planilha_M.O.'!E18","v":17.11},9.9]
["SUB-TOTAL - MÃO-DE-OBRA:",null,{"$f":"SUM(F386:F390)","v":15.1}]
[]
[null,"CUSTO TOTAL:",null,null,null,{"$f":"+C385+C391","v":96.859999999999985}]
[]
[null,"BDI:","%",{"$f":"+$F$7","v":"22,15%"},null,{"$f":"TRUNC(F393*D395,2)","v":21.45}]
[]
[null,"PREÇO:",null,null,null,{"$f":"+F393+F395","v":118.30999999999999}]
[]
[]
[]
[]
["CÓDIGO","DISCRIMINAÇÃO","UN","COEFIC.","UNITÁRIO","TOTAL"]
[2040,"LAJE DE GRÊS ASSENTADA NA AREIA","m²"]
["SINAPI I 370","AREIA MÉDIA","m³",8.6400000000000005E-2,{"$f":"+Insumos!$G$32","v":63.5},{"$f":"TRUNC(D404*E404,2)","v":5.48}]
[{"$f":"CONCATENATE(\"COTAÇÃO \",Insumos!$B$116)","v":"COTAÇÃO 122"},"LAJE DE GRÊS 90 X 45 cm","un",2.31,{"$f":"+Insumos!$G$116","v":9.6300000000000008},{"$f":"TRUNC(D405*E405,2)","v":22.24}]
["SINAPI I 1379","CIMENTO PORTLAND CP-II 32","kg",1.1361000000000001,{"$f":"+Insumos!$G$84","v":0.65},{"$f":"TRUNC(D406*E406,2)","v":0.73}]
["SUB-TOTAL - MATERIAL / EQUIPAMENTOS:",null,{"$f":"SUM(F404:F406)","v":28.45}]
["SINAPI C 88309","PEDREIRO C/ENCARGOS COMPLEMENTARES","h",0.8,{"$f":"'Planilha_M.O.'!E24","v":20.71},{"$f":"TRUNC(D408*E408,2)","v":16.559999999999999}]
["SINAPI C 88316","SERVENTE C/ ENCARGOS COMPLEMENTARES","h",0.61129999999999995,{"$f":"'Planilha_M.O.'!E18","v":17.11},{"$f":"TRUNC(D409*E409,2)","v":10.45}]
["SUB-TOTAL - MÃO-DE-OBRA:",null,{"$f":"SUM(F408:F409)","v":27.009999999999998}]
[]
[null,"CUSTO TOTAL:",null,null,null,{"$f":"+C407+C410","v":55.459999999999994}]
[]
[null,"BDI:","%",{"$f":"+$F$7","v":"22,15%"},null,{"$f":"TRUNC(F412*D414,2)","v":12.28}]
[]
[null,"PREÇO:",null,null,null,{"$f":"+F412+F414","v":67.739999999999995}]
[]
[]
[]
["CÓDIGO","DISCRIMINAÇÃO","UN","COEFIC.","UNITÁRIO","TOTAL"]
[2070,"PISO PODOTÁTIL 25x25 cm - E=2,0 cm","m"]
["SINAPI I 370","AREIA MÉDIA","m³",1.8499999999999999E-2,{"$f":"+Insumos!$G$32","v":63.5},{"$f":"TRUNC(D422*E422,2)","v":1.17}]
["SINAPI I 366","AREIA FINA","m³",6.9999999999999999E-4,{"$f":"+Insumos!$G$30","v":65},{"$f":"TRUNC(D423*E423,2)","v":0.04}]
[{"$f":"CONCATENATE(\"COTAÇÃO \",Insumos!$B$155)","v":"COTAÇÃO 100"},"PISO PODOTÁTIL 25x25 cm - E=2CM","un",4.12,{"$f":"+Insumos!$G$155","v":3.5},{"$f":"TRUNC(D424*E424,2)","v":14.42}]
["SINAPI I 34353","CIMENTO COLA AC-2","kg",0.28129999999999999,{"$f":"+Insumos!$G$83","v":0.98},{"$f":"TRUNC(D425*E425,2)","v":0.27}]
["SINAPI I 1379","CIMENTO PORTLAND CP-II 32","kg",5.5904999999999996,{"$f":"+Insumos!$G$84","v":0.65},{"$f":"TRUNC(D426*E426,2)","v":3.63}]
["SUB-TOTAL - MATERIAL / EQUIPAMENTOS:",null,{"$f":"SUM(F422:F426)","v":19.529999999999998}]
["SINAPI C 88309","PEDREIRO C/ENCARGOS COMPLEMENTARES","h",0.2,{"$f":"'Planilha_M.O.'!E24","v":20.71},{"$f":"TRUNC(D428*E428,2)","v":4.1399999999999997}]
["SINAPI C 88316","SERVENTE C/ ENCARGOS COMPLEMENTARES","h",0.23400000000000001,{"$f":"'Planilha_M.O.'!E18","v":17.11},{"$f":"TRUNC(D429*E429,2)","v":4}]
["SUB-TOTAL - MÃO-DE-OBRA:",null,{"$f":"SUM(F428:F429)","v":8.14}]
[]
[null,"CUSTO TOTAL:",null,null,null,{"$f":"+C427+C430","v":27.669999999999998}]
[]
[null,"BDI:","%",{"$f":"+$F$7","v":"22,15%"},null,{"$f":"TRUNC(F432*D434,2)","v":6.12}]
[]
[null,"PREÇO:",null,null,null,{"$f":"+F432+F434","v":33.79}]
[]
[]
["CÓDIGO","DISCRIMINAÇÃO","UN","COEFIC.","UNITÁRIO","TOTAL"]
[2308,"RAMPA PPNE's TIPO 1 - 1,80 m (aba 1,50 m)","un"]
[{"$f":"CONCATENATE(\"COTAÇÃO \",[4]Insumos!$B$132)","v":"COTAÇÃO 113"},"CAÇAMBA 4,00 m³","un",0.33789999999999998,{"$f":"+Insumos!$G$66","v":443.33},{"$f":"TRUNC(D441*E441,2)","v":149.80000000000001}]
["SINAPI I 1379","CIMENTO PORTLAND CP-II 32","kg",16.7715,{"$f":"Insumos!G84","v":0.65},10.9]
["SINAPI I 34353","CIMENTO COLA AC-2","kg",0.84389999999999998,{"$f":"Insumos!G83","v":0.98},0.82]
["SINAPI I 370","AREIA MÉDIA","m³",8.6999999999999994E-2,{"$f":"Insumos!G32","v":63.5},5.52]
["SINAPI I 366","AREIA FINA","m³",2.0999999999999999E-3,{"$f":"Insumos!G30","v":65},0.13]
[{"$f":"CONCATENATE(\"SINAPI C \",'[4]Composições Aux. SINAPI'!$A$18)","v":"SINAPI C 88629"},"ARGAMASSA TRAÇO 1:3","m³",8.9999999999999993E-3,{"$f":"'Composições Aux. SINAPI'!E21:F21","v":528.49},4.75]
["SINAPI I 2692","DESMOLDANTE P/ FORMAS DE MADEIRA","l",1.0500000000000001E-2,{"$f":"Insumos!G91","v":4.46},0.04]
[{"$f":"CONCATENATE(\"SINAPI C \",'[4]Composições Aux. SINAPI'!$A$33)","v":"SINAPI C 94963"},"CONCRETO fck = 15MPa, TRAÇO 1:3,4:3,5 (CIMENTO/ AREIA MÉDIA/ BRITA 1) - PREPARO MECÂNICO COM BETONEIRA 400 l","m³",0.3906,{"$f":"'Composições Aux. SINAPI'!E37:F37","v":332.32},129.80000000000001]
["SINAPI I 3777","LONA PLÁSTICA PRETA","m²",5.94,{"$f":"Insumos!G122","v":1.47},8.73]
["SINAPI I 004011","GEOTEXTIL NAO TECIDO AGULHADO DE FILAMENTOS CONTINUOS 100% POLIESTER, RESITENCIA A TRACAO = 10 KN/M","m²",5.67,{"$f":"Insumos!G110","v":6.75},38.270000000000003]
["SINAPI I 21141","TELA DE AÇO SOLDADA CA-60 4,2mm 15 x 15 cm","m²",5.5620000000000003,{"$f":"Insumos!G197","v":24.18},134.47999999999999]
[{"$f":"CONCATENATE(\"SINAPI I \",[4]Insumos!$B$83)","v":"SINAPI I 43132"},"ARAME RECOZIDO 18 BWG","kg",8.1000000000000003E-2,{"$f":"Insumos!G29","v":25.83},2.09]
["SINAPI I 5068","PREGO DE AÇO 17 x 21 C/CABEÇA","kg",2.41E-2,{"$f":"Insumos!G167","v":21.11},0.5]
[{"$f":"CONCATENATE(\"SINAPI I \",[4]Insumos!$B$279)","v":"SINAPI I 4491"},"PONTALETE EM PINUS 7,5 x 7,5 cm","m",2.1333000000000002,{"$f":"Insumos!G160","v":4.07},8.68]
["SINAPI I 4460","SARRAFO NÃO APARELHADO 2,5 X 10 cm","m",2.06,{"$f":"Insumos!G179","v":7.48},15.4]
[{"$f":"CONCATENATE(\"COTAÇÃO \",[4]Insumos!$B$274)","v":"COTAÇÃO 100"},"PISO PODOTÁTIL 25x25 cm","un",12.36,{"$f":"Insumos!G155","v":3.5},43.26]
["SUB-TOTAL - MATERIAL / EQUIPAMENTOS:",null,{"$f":"SUM(F441:F456)","v":553.16999999999996}]
["SINAPI C 88262","CARPINTEIRO C/ENCARGOS COMPLEMENTARES","h",2.1433,{"$f":"'Planilha_M.O.'!E26","v":20.5},{"$f":"TRUNC(D458*E458,2)","v":43.93}]
["SINAPI C 88239","AJUDANTE DE CARPINTEIRO C/ENCARGOS COMPLEMENTARES","h",0.89239999999999997,{"$f":"'Planilha_M.O.'!E20","v":17.059999999999999},{"$f":"TRUNC(D459*E459,2)","v":15.22}]
["SINAPI C 88245","ARMADOR C/ENCARGOS COMPLEMENTARES","h",0.16200000000000001,{"$f":"'Planilha_M.O.'!E29","v":20.6},{"$f":"TRUNC(D460*E460,2)","v":3.33}]
["SINAPI C 88309","PEDREIRO C/ENCARGOS COMPLEMENTARES","h",3.4030999999999998,{"$f":"'Planilha_M.O.'!E24","v":20.71},{"$f":"TRUNC(D461*E461,2)","v":70.47}]
["SINAPI C 88316","SERVENTE C/ ENCARGOS COMPLEMENTARES","h",13.457599999999999,{"$f":"'Planilha_M.O.'!E18","v":17.11},{"$f":"TRUNC(D462*E462,2)","v":230.25}]
["SUB-TOTAL - MÃO-DE-OBRA:",null,{"$f":"SUM(F458:F462)","v":363.2}]
[]
[null,"CUSTO TOTAL:",null,null,null,{"$f":"+C457+C463","v":916.36999999999989}]
[]
[null,"BDI:","%",{"$f":"+$F$7","v":"22,15%"},null,{"$f":"TRUNC(F465*D467,2)","v":202.97}]
[]
[null,"PREÇO:",null,null,null,{"$f":"+F465+F467","v":1119.3399999999999}]
[]
[]
["CÓDIGO","DISCRIMINAÇÃO","UN","COEFIC.","UNITÁRIO","TOTAL"]
[2601,"BANCO B - L=2,00 m","un"]
[{"$f":"CONCATENATE(\"COTAÇÃO \",Insumos!$B$66)","v":"COTAÇÃO 113"},"CAÇAMBA 4,00 m³","un",3.5999999999999997E-2,{"$f":"+Insumos!$G$66","v":443.33},{"$f":"TRUNC(D474*E474,2)","v":15.95}]
[{"$f":"CONCATENATE(\"SINAPI C \",'Composições Aux. SINAPI'!$A$37)","v":"SINAPI C 94963"},"CONCRETO fck = 15MPa, TRAÇO 1:3,4:3,5 (CIMENTO/ AREIA MÉDIA/ BRITA 1) - PREPARO MECÂNICO COM BETONEIRA 400 l","m³",0.72,{"$f":"'Composições Aux. SINAPI'!E37:F37","v":332.32},{"$f":"TRUNC(D475*E475,2)","v":239.27}]
["SINAPI I 43061","AÇO CA-60 4,2 mm - 0,109 kg/m","kg",1.0571999999999999,{"$f":"+Insumos!$G$19","v":11.89},12.57]
["SINAPI I 34449","AÇO CA-50 1/4\" - 0,248 kg/m","kg",0.29759999999999998,{"$f":"+Insumos!$G$14","v":14.07},4.18]
[{"$f":"CONCATENATE(\"SINAPI I \",Insumos!$B$29)","v":"SINAPI I 43132"},"ARAME RECOZIDO 18 BWG","kg",3.1699999999999999E-2,{"$f":"+Insumos!$G$29","v":25.83},0.81]
["SINAPI I 20247","PREGO DE AÇO 15 x 15 C/CABEÇA","kg",0.11940000000000001,{"$f":"+Insumos!$G$164","v":22.47},2.68]
[{"$f":"CONCATENATE(\"COTAÇÃO \",Insumos!$B$177)","v":"COTAÇÃO 28"},"SARRAFO CEDRINHO 2,5 X 5,0 cm","m",2.8039999999999998,{"$f":"+Insumos!$G$177","v":7.5},21.03]
["SINAPI I 1347","CHAPA COMPENSADO PLASTIFICADO 12 mm","m²",0.19900000000000001,{"$f":"+Insumos!$G$79","v":27.6},5.49]
["SINAPI I 563","BARRA FERRO CHATO 1 1/2\" x 3/8\"","m",6.72,{"$f":"+Insumos!$G$53","v":28.31},190.24]
[{"$f":"CONCATENATE(\"COTAÇÃO \",Insumos!$B$135)","v":"COTAÇÃO 50"},"PARAFUSO FRANCÊS ZINCADO 5/16\" x 2 1/2\" C/PORCA","un",12,{"$f":"+Insumos!$G$135","v":1.06},12.72]
[{"$f":"CONCATENATE(\"COTAÇÃO \",Insumos!#REF!)","v":{"$error":"#REF!"}},"TÁBUA ITAÚBA LIXADA E APLAINADA 3,5 x 19 x 2,00","un",3,{"$f":"Cotações!N35","v":145},435]
[{"$f":"CONCATENATE(\"COTAÇÃO \",Insumos!$B$145)","v":"COTAÇÃO 58"},"PARAFUSO SEXTAVADO ZINCADO C/PORCA 1/4\" x 2\"","un",4,{"$f":"+Insumos!$G$145","v":0.59},2.36]
[{"$f":"CONCATENATE(\"SINAPI I \",Insumos!$B$182)","v":"SINAPI I 5318"},"SOLVENTE DILUENTE A BASE DE AGUARRÁS","l",0.1226,{"$f":"+Insumos!$G$182","v":17.98},2.2000000000000002]
["SINAPI I 3767","LIXA P/MADEIRA","fl",2.7399,{"$f":"+Insumos!$G$120","v":0.79},2.16]
["SINAPI I 3768","LIXA P/FERRO","fl",0.70320000000000005,{"$f":"+Insumos!$G$119","v":3.37},2.36]
["SINAPI I 7307","FUNDO ANTICORROSIVO TIPO ZARCÃO","l",7.8399999999999997E-2,{"$f":"+Insumos!$G$107","v":29.63},2.3199999999999998]
["SINAPI I 6086","FUNDO SINTÉTICO NIVELADOR BRANCO FOSCO","l",0.54800000000000004,{"$f":"+Insumos!$G$109","v":90.88},49.8]
[{"$f":"CONCATENATE(\"SINAPI I \",Insumos!$B$204)","v":"SINAPI I 7292"},"TINTA ESMALTE SINTÉTICO BRILHANTE","l",0.56440000000000001,{"$f":"+Insumos!$G$204","v":27.61},15.58]
["SINAPI I 7293","TINTA GRAFITE","l",0.16880000000000001,{"$f":"+Insumos!$G$205","v":30.39},5.12]
["SUB-TOTAL - MATERIAL / EQUIPAMENTOS:",null,{"$f":"SUM(F474:F492)","v":1021.8400000000001}]
["SINAPI C 88262","CARPINTEIRO C/ENCARGOS COMPLEMENTARES","h",4.5,{"$f":"'Planilha_M.O.'!E26","v":20.5},{"$f":"TRUNC(D494*E494,2)","v":92.25}]
["SINAPI C 88245","ARMADOR C/ENCARGOS COMPLEMENTARES","h",3.5,{"$f":"'Planilha_M.O.'!E29","v":20.6},72.099999999999994]
["SINAPI C 88238","AJUDANTE DE ARMADOR C/ENCARGOS COMPLEMENTARES","h",3.5,{"$f":"'Planilha_M.O.'!E19","v":15.67},54.84]
["SINAPI C 88310","PINTOR C/ENCARGOS COMPLEMENTARES","h",2.5,{"$f":"'Planilha_M.O.'!E25","v":21.7},54.25]
["SINAPI C 88309","PEDREIRO C/ENCARGOS COMPLEMENTARES","h",0.64759999999999995,{"$f":"'Planilha_M.O.'!E24","v":20.71},13.41]
["SINAPI C 88316","SERVENTE C/ ENCARGOS COMPLEMENTARES","h",4,{"$f":"'Planilha_M.O.'!E18","v":17.11},68.44]
["SUB-TOTAL - MÃO-DE-OBRA:",null,{"$f":"SUM(F494:F499)","v":355.29}]
[]
[null,"CUSTO TOTAL:",null,null,null,{"$f":"+C493+C500","v":1377.13}]
[]
[null,"BDI:","%",{"$f":"+$F$7","v":"22,15%"},null,{"$f":"TRUNC(F502*D504,2)","v":305.02999999999997}]
[]
[null,"PREÇO:",null,null,null,{"$f":"+F502+F504","v":1682.16}]
[]
["CÓDIGO","DISCRIMINAÇÃO","UN","COEFIC.","UNITÁRIO","TOTAL"]
[2602,"BANCO A - L=1,80 m","un"]
[{"$f":"CONCATENATE(\"COTAÇÃO \",Insumos!$B$66)","v":"COTAÇÃO 113"},"CAÇAMBA 4,00 m³","un",1.7999999999999999E-2,{"$f":"+Insumos!$G$66","v":443.33},{"$f":"TRUNC(D510*E510,2)","v":7.97}]
[{"$f":"CONCATENATE(\"SINAPI C \",'Composições Aux. SINAPI'!$A$37)","v":"SINAPI C 94963"},"CONCRETO fck = 15MPa, TRAÇO 1:3,4:3,5 (CIMENTO/ AREIA MÉDIA/ BRITA 1) - PREPARO MECÂNICO COM BETONEIRA 400 l","m³",0.82,{"$f":"'Composições Aux. SINAPI'!E37:F37","v":332.32},{"$f":"TRUNC(D511*E511,2)","v":272.5}]
[{"$f":"CONCATENATE(\"COTAÇÃO \",Insumos!$B$136)","v":"COTAÇÃO 51"},"PARAFUSO FRANCÊS ZINCADO 5/16\" x 4\" C/PORCA","un",8,{"$f":"+Insumos!$G$136","v":1.47},11.76]
[{"$f":"CONCATENATE(\"COTAÇÃO \",Insumos!#REF!)","v":{"$error":"#REF!"}},"TÁBUA ITAÚBA LIXADA E APLAINADA 3,5 x 19 x 1,80","un",2,{"$f":"Cotações!N34","v":140.80000000000001},281.60000000000002]
[{"$f":"CONCATENATE(\"SINAPI I \",Insumos!$B$210)","v":"SINAPI I 21012"},"TUBO AÇO GALVANIZADO C/COSTURA 1 1/2\", 3,00 mm","m",4.6719999999999997,{"$f":"+Insumos!$G$210","v":77.03},359.88]
["SINAPI I 1165","TAMPÃO DE FERRO GALVANIZADO DE 1 1/2\"","un",4,{"$f":"+Insumos!$G$188","v":14.92},59.68]
[{"$f":"CONCATENATE(\"SINAPI I \",Insumos!$B$182)","v":"SINAPI I 5318"},"SOLVENTE DILUENTE A BASE DE AGUARRÁS","l",0.19400000000000001,{"$f":"+Insumos!$G$182","v":17.98},3.48]
["SINAPI I 3767","LIXA P/MADEIRA","fl",1.6466000000000001,{"$f":"+Insumos!$G$120","v":0.79},1.3]
[{"$f":"CONCATENATE(\"COTAÇÃO \",Insumos!$B$108)","v":"COTAÇÃO 108"},"FUNDO P/GALVANIZADO","l",8.9200000000000002E-2,{"$f":"+Insumos!$G$108","v":34.81},3.1]
["SINAPI 6086","FUNDO SINTÉTICO NIVELADOR BRANCO FOSCO","l",0.32929999999999998,{"$f":"+Insumos!$G$109","v":90.88},29.92]
[{"$f":"CONCATENATE(\"SINAPI I \",Insumos!$B$204)","v":"SINAPI I 7292"},"TINTA ESMALTE SINTÉTICO BRILHANTE","l",0.3392,{"$f":"+Insumos!$G$204","v":27.61},9.36]
["SINAPI I 7293","TINTA GRAFITE","l",0.71479999999999999,{"$f":"+Insumos!$G$205","v":30.39},21.72]
["SUB-TOTAL - MATERIAL / EQUIPAMENTOS:",null,{"$f":"SUM(F510:F521)","v":1062.27}]
["SINAPI C 88262","CARPINTEIRO C/ENCARGOS COMPLEMENTARES","h",2.2999999999999998,{"$f":"'Planilha_M.O.'!E26","v":20.5},{"$f":"TRUNC(D523*E523,2)","v":47.15}]
["SINAPI C 88310","PINTOR C/ENCARGOS COMPLEMENTARES","h",2.5,{"$f":"'Planilha_M.O.'!E25","v":21.7},{"$f":"TRUNC(D524*E524,2)","v":54.25}]
["SINAPI C 88309","PEDREIRO C/ENCARGOS COMPLEMENTARES","h",2.5,{"$f":"'Planilha_M.O.'!E24","v":20.71},{"$f":"TRUNC(D525*E525,2)","v":51.77}]
["SINAPI C 88316","SERVENTE C/ ENCARGOS COMPLEMENTARES","h",3.5,{"$f":"'Planilha_M.O.'!E18","v":17.11},{"$f":"TRUNC(D526*E526,2)","v":59.88}]
["SUB-TOTAL - MÃO-DE-OBRA:",null,{"$f":"SUM(F523:F526)","v":213.05}]
[]
[null,"CUSTO TOTAL:",null,null,null,{"$f":"+C522+C527","v":1275.32}]
[]
[null,"BDI:","%",{"$f":"+$F$7","v":"22,15%"},null,{"$f":"TRUNC(F529*D531,2)","v":282.48}]
[]
[null,"PREÇO:",null,null,null,{"$f":"+F529+F531","v":1557.8}]
[]
["CÓDIGO","DISCRIMINAÇÃO","UN","COEFIC.","UNITÁRIO","TOTAL"]
[2630,"CHURRASQUEIRA C/ PISO DE CONCRETO","un"]
[{"$f":"CONCATENATE(\"COTAÇÃO \",Insumos!$B$66)","v":"COTAÇÃO 113"},"CAÇAMBA 4,00 m³","un",0.22689999999999999,{"$f":"+Insumos!$G$66","v":443.33},{"$f":"TRUNC(D537*E537,2)","v":100.59}]
[{"$f":"CONCATENATE(\"SINAPI C \",'Composições Aux. SINAPI'!$A$37)","v":"SINAPI C 94963"},"CONCRETO fck = 15MPa, TRAÇO 1:3,4:3,5 (CIMENTO/ AREIA MÉDIA/ BRITA 1) - PREPARO MECÂNICO COM BETONEIRA 400 l","m³",2.4,{"$f":"'Composições Aux. SINAPI'!E37:F37","v":332.32},{"$f":"TRUNC(D538*E538,2)","v":797.56}]
["SINAPI I 20247","PREGO DE AÇO 15 x 15 C/CABEÇA","kg",0.87039999999999995,{"$f":"+Insumos!$G$164","v":22.47},19.55]
["SINAPI I 004491","PONTALETE EM PINUS 7,5 x 7,5 cm","m",7.9333,{"$f":"Insumos!G160","v":4.07},32.28]
[{"$f":"CONCATENATE(\"COTAÇÃO \",Insumos!$B$112)","v":"COTAÇÃO 20"},"GUIA CEDRINHO 2,5 x 10 cm ","m",8.2866,{"$f":"+Insumos!$G$112","v":14.37},119.07]
[{"$f":"CONCATENATE(\"SINAPI I \",Insumos!$B$181)","v":"SINAPI I 4517"},"SARRAFO PINUS 2,5 x 7,5 cm","m",4.5332999999999997,{"$f":"+Insumos!$G$181","v":1.53},6.93]
["SINAPI I 004400","CAIBRO NAO APARELHADO, *6 X 8* CM, EM MACARANDUBA, ANGELIM OU EQUIVALENTE DA REGIAO - BRUTA","m",2.1,{"$f":"Insumos!G67","v":16.87},{"$f":"TRUNC(D543*E543,2)","v":35.42}]
["SINAPI I 34452","AÇO CA-60 4,2 mm - 0,109 kg/m","kg",3.1534,{"$f":"+Insumos!$G$19","v":11.89},37.49]
[{"$f":"CONCATENATE(\"SINAPI I \",Insumos!$B$17)","v":"SINAPI I 43058"},"AÇO CA-50 10 mm DOBRADO E CORTADO","kg",9.2850999999999999,{"$f":"+Insumos!$G$17","v":11.94},110.86]
["SINAPI I 34443","AÇO CA-50 5/8\" - 1,570 kg/m","kg",4.4116999999999997,{"$f":"+Insumos!$G$18","v":11.94},52.67]
[{"$f":"CONCATENATE(\"SINAPI I \",Insumos!$B$29)","v":"SINAPI I 43132"},"ARAME RECOZIDO 18 BWG","kg",0.37319999999999998,{"$f":"+Insumos!$G$29","v":25.83},9.6300000000000008]
["SINAPI I 7155","TELA DE AÇO SOLDADA CA-60 4,2mm 10 x 10 cm","m²",12.232799999999999,{"$f":"+Insumos!$G$195","v":35.270000000000003},431.45]
[{"$f":"CONCATENATE(\"SINAPI C \",'Composições Aux. SINAPI'!$A$64)","v":"SINAPI C 91277"},"PLACA VIBRATÓRIA REVERSÍVEL, POTÊNCIA 5,5 cv","chp",6.1000000000000004E-3,{"$f":"+'Composições Aux. SINAPI'!$E$64","v":9.84},0.06]
[{"$f":"CONCATENATE(\"SINAPI C \",'Composições Aux. SINAPI'!$A$65)","v":"SINAPI C 91278"},"PLACA VIBRATÓRIA REVERSÍVEL, POTÊNCIA 5,5 cv","chi",0.3947,{"$f":"+'Composições Aux. SINAPI'!$E$65","v":0.7},0.27]
[{"$f":"CONCATENATE(\"COTAÇÃO \",Insumos!$B$152)","v":"COTAÇÃO 123"},"PEDRA DE GRÊS 48 x 23 x 12 cm","un",16,{"$f":"+Insumos!$G$152","v":2.09},33.44]
["SINAPI I 1355","CHAPA COMPENSADO RESINADO 14 mm","m²",0.44319999999999998,{"$f":"+Insumos!$G$78","v":28.72},12.72]
["SINAPI I 10617","TIJOLO CERÂMICO REFRATÁRIO 6,3 x 11,4 x  22,9 cm","un",74.459999999999994,{"$f":"+Insumos!$G$200","v":5.05},376.02]
["SUB-TOTAL - MATERIAL / EQUIPAMENTOS:",null,{"$f":"SUM(F537:F553)","v":2176.0100000000002}]
["SINAPI C 88262","CARPINTEIRO C/ENCARGOS COMPLEMENTARES","h",4.8,{"$f":"'Planilha_M.O.'!E26","v":20.5},{"$f":"TRUNC(D555*E555,2)","v":98.4}]
["SINAPI C 88245","ARMADOR C/ENCARGOS COMPLEMENTARES","h",1.7,{"$f":"'Planilha_M.O.'!E29","v":20.6},{"$f":"TRUNC(D556*E556,2)","v":35.020000000000003}]
["SINAPI C 88238","AJUDANTE DE ARMADOR C/ENCARGOS COMPLEMENTARES","h",2,{"$f":"'Planilha_M.O.'!E19","v":15.67},{"$f":"TRUNC(D557*E557,2)","v":31.34}]
["SINAPI C 88309","PEDREIRO C/ENCARGOS COMPLEMENTARES","h",6.5,{"$f":"'Planilha_M.O.'!E24","v":20.71},{"$f":"TRUNC(D558*E558,2)","v":134.61000000000001}]
["SINAPI C 88316","SERVENTE C/ ENCARGOS COMPLEMENTARES","h",23,{"$f":"'Planilha_M.O.'!E18","v":17.11},{"$f":"TRUNC(D559*E559,2)","v":393.53}]
["SUB-TOTAL - MÃO-DE-OBRA:",null,{"$f":"SUM(F555:F559)","v":692.9}]
[]
[null,"CUSTO TOTAL:",null,null,null,{"$f":"+C554+C560","v":2868.9100000000003}]
[]
[null,"BDI:","%",{"$f":"+$F$7","v":"22,15%"},null,{"$f":"TRUNC(F562*D564,2)","v":635.46}]
[]
[null,"PREÇO:",null,null,null,{"$f":"+F562+F564","v":3504.3700000000003}]
[]
["CÓDIGO","DISCRIMINAÇÃO","UN","COEFIC.","UNITÁRIO","TOTAL"]
[2633,"CHURRASQUEIRA","un"]
[{"$f":"CONCATENATE(\"COTAÇÃO \",Insumos!$B$66)","v":"COTAÇÃO 113"},"CAÇAMBA 4,00 m³","un",1.7100000000000001E-2,{"$f":"+Insumos!$G$66","v":443.33},{"$f":"TRUNC(D570*E570,2)","v":7.58}]
[{"$f":"CONCATENATE(\"SINAPI C \",'Composições Aux. SINAPI'!$A$37)","v":"SINAPI C 94963"},"CONCRETO fck = 15MPa, TRAÇO 1:3,4:3,5 (CIMENTO/ AREIA MÉDIA/ BRITA 1) - PREPARO MECÂNICO COM BETONEIRA 400 l","m³",0.27500000000000002,{"$f":"'Composições Aux. SINAPI'!E37:F37","v":332.32},{"$f":"TRUNC(D571*E571,2)","v":91.38}]
["SINAPI I 20247","PREGO DE AÇO 15 x 15 C/CABEÇA","kg",0.57599999999999996,{"$f":"+Insumos!$G$164","v":22.47},12.94]
[{"$f":"CONCATENATE(\"COTAÇÃO \",Insumos!$B$112)","v":"COTAÇÃO 20"},"GUIA CEDRINHO 2,5 x 10 cm ","m",3.38,{"$f":"+Insumos!$G$112","v":14.37},48.57]
["SINAPI I 004400","CAIBRO NAO APARELHADO, *6 X 8* CM, EM MACARANDUBA, ANGELIM OU EQUIVALENTE DA REGIAO - BRUTA","m",2.1,{"$f":"Insumos!G67","v":16.87},35.42]
["SINAPI I 34452","AÇO CA-60 4,2 mm - 0,109 kg/m","kg",3.1534,{"$f":"+Insumos!$G$19","v":11.89},37.49]
[{"$f":"CONCATENATE(\"SINAPI I \",Insumos!$B$17)","v":"SINAPI I 43058"},"AÇO CA-50 10 mm DOBRADO E CORTADO","kg",9.2850999999999999,{"$f":"+Insumos!$G$17","v":11.94},110.86]
["SINAPI I 34443","AÇO CA-50 5/8\" - 1,570 kg/m","kg",4.4116999999999997,{"$f":"+Insumos!$G$18","v":11.94},52.67]
[{"$f":"CONCATENATE(\"SINAPI I \",Insumos!$B$29)","v":"SINAPI I 43132"},"ARAME RECOZIDO 18 BWG","kg",0.37319999999999998,{"$f":"+Insumos!$G$29","v":25.83},9.6300000000000008]
[{"$f":"CONCATENATE(\"SINAPI C \",'Composições Aux. SINAPI'!$A$64)","v":"SINAPI C 91277"},"PLACA VIBRATÓRIA REVERSÍVEL, POTÊNCIA 5,5 cv","chp",0.99,{"$f":"+'Composições Aux. SINAPI'!$E$64","v":9.84},9.74]
[{"$f":"CONCATENATE(\"SINAPI C \",'Composições Aux. SINAPI'!$A$65)","v":"SINAPI C 91278"},"PLACA VIBRATÓRIA REVERSÍVEL, POTÊNCIA 5,5 cv","chi",0.3947,{"$f":"+'Composições Aux. SINAPI'!$E$65","v":0.7},0.27]
[{"$f":"CONCATENATE(\"COTAÇÃO \",Insumos!$B$152)","v":"COTAÇÃO 123"},"PEDRA DE GRÊS 48 x 23 x 12 cm","un",16,{"$f":"+Insumos!$G$152","v":2.09},33.44]
["SINAPI I 1355","CHAPA COMPENSADO RESINADO 14 mm","m²",0.44319999999999998,{"$f":"+Insumos!$G$78","v":28.72},12.72]
["SINAPI I 10617","TIJOLO CERÂMICO REFRATÁRIO 6,3 x 11,4 x 22,9 cm","un",74.459999999999994,{"$f":"+Insumos!$G$200","v":5.05},376.02]
["SUB-TOTAL - MATERIAL / EQUIPAMENTOS:",null,{"$f":"SUM(F570:F583)","v":838.73}]
["SINAPI C 88262","CARPINTEIRO C/ENCARGOS COMPLEMENTARES","h",3.093,{"$f":"'Planilha_M.O.'!E26","v":20.5},{"$f":"TRUNC(D585*E585,2)","v":63.4}]
["SINAPI C 88245","ARMADOR C/ENCARGOS COMPLEMENTARES","h",1.4925999999999999,{"$f":"'Planilha_M.O.'!E29","v":20.6},{"$f":"TRUNC(D586*E586,2)","v":30.74}]
["SINAPI C 88238","AJUDANTE DE ARMADOR C/ENCARGOS COMPLEMENTARES","h",1.4925999999999999,{"$f":"'Planilha_M.O.'!E19","v":15.67},{"$f":"TRUNC(D587*E587,2)","v":23.38}]
["SINAPI C 88309","PEDREIRO C/ENCARGOS COMPLEMENTARES","h",3.2698999999999998,{"$f":"'Planilha_M.O.'!E24","v":20.71},{"$f":"TRUNC(D588*E588,2)","v":67.709999999999994}]
["SINAPI C 88316","SERVENTE C/ ENCARGOS COMPLEMENTARES","h",6.0965999999999996,{"$f":"'Planilha_M.O.'!E18","v":17.11},{"$f":"TRUNC(D589*E589,2)","v":104.31}]
["SUB-TOTAL - MÃO-DE-OBRA:",null,{"$f":"SUM(F585:F589)","v":289.53999999999996}]
[]
[null,"CUSTO TOTAL:",null,null,null,{"$f":"+C584+C590","v":1128.27}]
[]
[null,"BDI:","%",{"$f":"+$F$7","v":"22,15%"},null,{"$f":"TRUNC(F592*D594,2)","v":249.91}]
[]
[null,"PREÇO:",null,null,null,{"$f":"+F592+F594","v":1378.18}]
[]
["CÓDIGO","DISCRIMINAÇÃO","UN","COEFIC.","UNITÁRIO","TOTAL"]
[2671,"LIXEIRA METÁLICA - V=30LITROS","un"]
[{"$f":"CONCATENATE(\"COTAÇÃO \",Insumos!$B$66)","v":"COTAÇÃO 113"},"CAÇAMBA 4,00 m³","un",0.10296,{"$f":"+Insumos!$G$66","v":443.33},{"$f":"TRUNC(D600*E600,2)","v":45.64}]
[{"$f":"CONCATENATE(\"SINAPI C \",'Composições Aux. SINAPI'!$A$37)","v":"SINAPI C 94963"},"CONCRETO fck = 15MPa, TRAÇO 1:3,4:3,5 (CIMENTO/ AREIA MÉDIA/ BRITA 1) - PREPARO MECÂNICO COM BETONEIRA 400 l","m³",7.9200000000000007E-2,{"$f":"'Composições Aux. SINAPI'!E37:F37","v":332.32},{"$f":"TRUNC(D601*E601,2)","v":26.31}]
[{"$f":"CONCATENATE(\"COTAÇÃO \",Insumos!$B$132)","v":"COTAÇÃO 110"},"PAPELEIRA EXTERNA METÁLICA H-30","un",1,{"$f":"+Insumos!$G$132","v":900},900]
["SUB-TOTAL - MATERIAL / EQUIPAMENTOS:",null,{"$f":"SUM(F600:F602)","v":971.95}]
["SINAPI C 88309","PEDREIRO C/ENCARGOS COMPLEMENTARES","h",1.3968,{"$f":"'Planilha_M.O.'!E24","v":20.71},{"$f":"TRUNC(D604*E604,2)","v":28.92}]
["SINAPI C 88316","SERVENTE C/ ENCARGOS COMPLEMENTARES","h",1.3968,{"$f":"'Planilha_M.O.'!E18","v":17.11},{"$f":"TRUNC(D605*E605,2)","v":23.89}]
["SUB-TOTAL - MÃO-DE-OBRA:",null,{"$f":"SUM(F604:F605)","v":52.81}]
[]
[null,"CUSTO TOTAL:",null,null,null,{"$f":"+C603+C606","v":1024.76}]
[]
[null,"BDI:","%",{"$f":"+$F$7","v":"22,15%"},null,{"$f":"TRUNC(F608*D610,2)","v":226.98}]
[]
[null,"PREÇO:",null,null,null,{"$f":"+F608+F610","v":1251.74}]
[]
[]
["CÓDIGO","DISCRIMINAÇÃO","UN","COEFIC.","UNITÁRIO","TOTAL"]
[3025,"ESPALDAR","un"]
[{"$f":"CONCATENATE(\"COTAÇÃO \",[5]Insumos!$B$63)","v":"COTAÇÃO 113"},"CAÇAMBA 4,00 m³","un",0.11700000000000001,{"$f":"Insumos!G66","v":443.33},{"$f":"TRUNC(D617*E617,2)","v":51.86}]
[{"$f":"CONCATENATE(\"SINAPI C \",'[5]Composições Aux. SINAPI'!$A$33)","v":"SINAPI C 94963"},"CONCRETO fck = 15MPa, TRAÇO 1:3,4:3,5 (CIMENTO/ AREIA MÉDIA/ BRITA 1) - PREPARO MECÂNICO COM BETONEIRA 400 l","m³",0.09,{"$f":"'Composições Aux. SINAPI'!E37:F37","v":332.32},{"$f":"TRUNC(D618*E618,2)","v":29.9}]
[{"$f":"CONCATENATE(\"SINAPI I \",[5]Insumos!$B$209)","v":"SINAPI I 7292"},"TINTA ESMALTE SINTÉTICO BRILHANTE","l",2.3260000000000001,{"$f":"Insumos!G204","v":27.61},{"$f":"TRUNC(D619*E619,2)","v":64.22}]
[{"$f":"CONCATENATE(\"SINAPI I \",[5]Insumos!$B$170)","v":"SINAPI I 5318"},"SOLVENTE DILUENTE A BASE DE AGUARRÁS","l",0.41899999999999998,{"$f":"+[5]Insumos!$G$170","v":17.98},7.53]
[{"$f":"CONCATENATE(\"COTAÇÃO \",[5]Insumos!$B$104)","v":"COTAÇÃO 108"},"FUNDO P/GALVANIZADO","l",0.32240000000000002,{"$f":"Cotações!M119","v":34.81},11.22]
[{"$f":"CONCATENATE(\"SINAPI I \",[5]Insumos!$B$215)","v":"SINAPI I 21012"},"TUBO AÇO GALVANIZADO C/COSTURA 1 1/2\", 3,00 mm","m",9,{"$f":"Insumos!G210","v":77.03},693.27]
[{"$f":"CONCATENATE(\"SINAPI I \",[5]Insumos!$B$217)","v":"SINAPI I 21014"},"TUBO AÇO GALVANIZADO C/COSTURA 2 1/2\", 3,35 mm","m",5,{"$f":"Insumos!G212","v":140.66},703.3]
[{"$f":"CONCATENATE(\"SINAPI I \",[5]Insumos!$B$195)","v":"SINAPI I 1169"},"TAMPÃO DE FERRO GALVANIZADO DE 2 1/2\"","un",2,{"$f":"Insumos!G190","v":41.16},{"$f":"TRUNC(D624*E624,2)","v":82.32}]
["SUB-TOTAL - MATERIAL / EQUIPAMENTOS:",null,{"$f":"SUM(F617:F624)","v":1643.62}]
["SINAPI C 88310","PINTOR C/ENCARGOS COMPLEMENTARES","h",7.05,{"$f":"'Planilha_M.O.'!E25","v":21.7},{"$f":"TRUNC(D626*E626,2)","v":152.97999999999999}]
["SINAPI C 88315","PEDREIRO C/ENCARGOS COMPLEMENTARES","h",9,{"$f":"'Planilha_M.O.'!E24","v":20.71},{"$f":"TRUNC(D627*E627,2)","v":186.39}]
["SINAPI C 88309","SERVENTE C/ ENCARGOS COMPLEMENTARES","h",15,{"$f":"'Planilha_M.O.'!E18","v":17.11},{"$f":"TRUNC(D628*E628,2)","v":256.64999999999998}]
["SUB-TOTAL - MÃO-DE-OBRA:",null,{"$f":"SUM(F626:F628)","v":596.02}]
[]
[null,"CUSTO TOTAL:",null,null,null,{"$f":"+C625+C629","v":2239.64}]
[]
[null,"BDI:","%",{"$f":"+$F$7","v":"22,15%"},null,{"$f":"TRUNC(F631*D633,2)","v":496.08}]
[]
[null,"PREÇO:",null,null,null,{"$f":"+F631+F633","v":2735.72}]
[]
["CÓDIGO","DISCRIMINAÇÃO","UN","COEFIC.","UNITÁRIO","TOTAL"]
[3030,"PRANCHA DE ABDOMINAIS PADRÃO SMAMS ","un"]
[{"$f":"CONCATENATE(\"COTAÇÃO \",[5]Insumos!$B$63)","v":"COTAÇÃO 113"},"CAÇAMBA 4,00 m³","un",0.11700000000000001,{"$f":"Insumos!G66","v":443.33},{"$f":"TRUNC(D639*E639,2)","v":51.86}]
[{"$f":"CONCATENATE(\"SINAPI C \",'[5]Composições Aux. SINAPI'!$A$33)","v":"SINAPI C 94963"},"CONCRETO fck = 15MPa, TRAÇO 1:3,4:3,5 (CIMENTO/ AREIA MÉDIA/ BRITA 1) - PREPARO MECÂNICO COM BETONEIRA 400 l","m³",0.09,{"$f":"'Composições Aux. SINAPI'!E37:F37","v":332.32},{"$f":"TRUNC(D640*E640,2)","v":29.9}]
["SINAPI I 1166","TAMPÃO DE FERRO GALVANIZADO DE 2\"","un",2,{"$f":"Insumos!G189","v":21.55},{"$f":"TRUNC(D641*E641,2)","v":43.1}]
["SINAPI I 1165","TAMPÃO DE FERRO GALVANIZADO DE 1 1/2\"","un",4,{"$f":"Insumos!G188","v":14.92},59.68]
[{"$f":"CONCATENATE(\"COTAÇÃO \",[5]Insumos!$B$184)","v":"COTAÇÃO 31"},"TÁBUA ITAÚBA LIXADA APLAINADA 3,5 x 25 x 2,00","un",2,{"$f":"Cotações!M21","v":216.33},432.66]
[{"$f":"CONCATENATE(\"COTAÇÃO \",[5]Insumos!$B$131)","v":"COTAÇÃO 51"},"PARAFUSO FRANCÊS ZINCADO 5/16\" x 4\" C/PORCA","un",8,{"$f":"Cotações!M44","v":1.47},11.76]
["SINAPI I 3767","LIXA P/MADEIRA","fl",2.0870000000000002,{"$f":"Insumos!G120","v":0.79},1.64]
[{"$f":"CONCATENATE(\"SINAPI I \",[5]Insumos!$B$209)","v":"SINAPI I 7292"},"TINTA ESMALTE SINTÉTICO BRILHANTE","l",1.2161,{"$f":"Insumos!G204","v":27.61},33.57]
[{"$f":"CONCATENATE(\"SINAPI I \",[5]Insumos!$B$170)","v":"SINAPI I 5318"},"SOLVENTE DILUENTE A BASE DE AGUARRÁS","l",0.20669999999999999,{"$f":"Insumos!G182","v":17.98},3.71]
[{"$f":"CONCATENATE(\"COTAÇÃO \",[5]Insumos!$B$104)","v":"COTAÇÃO 108"},"FUNDO P/GALVANIZADO","l",0.1305,{"$f":"Cotações!M119","v":34.81},4.54]
["SINAPI I 6086","FUNDO SINTÉTICO NIVELADOR BRANCO FOSCO","l",0.41470000000000001,{"$f":"Insumos!G109","v":90.88},37.68]
[{"$f":"CONCATENATE(\"SINAPI I \",[5]Insumos!$B$215)","v":"SINAPI I 21012"},"TUBO AÇO GALVANIZADO C/COSTURA 1 1/2\", 3,00 mm","m",4.96,{"$f":"Insumos!G210","v":77.03},382.06]
["SINAPI I 21013","TUBO AÇO GALVANIZADO C/COSTURA 2\", 3,00 mm","m",0.5,{"$f":"Insumos!G211","v":87.2},43.6]
["SUB-TOTAL - MATERIAL / EQUIPAMENTOS:",null,{"$f":"SUM(F639:F651)","v":1135.76}]
["SINAPI C 88310","PINTOR C/ENCARGOS COMPLEMENTARES","h",3.9178999999999999,{"$f":"'Planilha_M.O.'!E25","v":21.7},{"$f":"TRUNC(D653*E653,2)","v":85.01}]
["SINAPI C 88262","CARPINTEIRO C/ENCARGOS COMPLEMENTARES","h",2.3182,{"$f":"'Planilha_M.O.'!E26","v":20.5},{"$f":"TRUNC(D654*E654,2)","v":47.52}]
["SINAPI C 88309","PEDREIRO C/ENCARGOS COMPLEMENTARES","h",3.23,{"$f":"'Planilha_M.O.'!E24","v":20.71},{"$f":"TRUNC(D655*E655,2)","v":66.89}]
["SINAPI C 88316","SERVENTE C/ ENCARGOS COMPLEMENTARES","h",7,{"$f":"'Planilha_M.O.'!E18","v":17.11},{"$f":"TRUNC(D656*E656,2)","v":119.77}]
["SUB-TOTAL - MÃO-DE-OBRA:",null,{"$f":"SUM(F653:F656)","v":319.19}]
[]
[null,"CUSTO TOTAL:",null,null,null,{"$f":"+C652+C657","v":1454.95}]
[]
[null,"BDI:","%",{"$f":"+$F$7","v":"22,15%"},null,{"$f":"TRUNC(F659*D661,2)","v":322.27}]
[]
[null,"PREÇO:",null,null,null,{"$f":"+F659+F661","v":1777.22}]
[]
[]
["CÓDIGO","DISCRIMINAÇÃO","UN","COEFIC.","UNITÁRIO","TOTAL"]
[3030,"PRANCHA DE ABDOMINAIS PADRÃO SMAMS ","un"]
[{"$f":"CONCATENATE(\"COTAÇÃO \",Insumos!$B$66)","v":"COTAÇÃO 113"},"CAÇAMBA 4,00 m³","un",0.11700000000000001,{"$f":"Insumos!G66","v":443.33},{"$f":"TRUNC(D668*E668,2)","v":51.86}]
[{"$f":"CONCATENATE(\"SINAPI C \",'Composições Aux. SINAPI'!$A$37)","v":"SINAPI C 94963"},"CONCRETO fck = 15MPa, TRAÇO 1:3,4:3,5 (CIMENTO/ AREIA MÉDIA/ BRITA 1) - PREPARO MECÂNICO COM BETONEIRA 400 l","m³",0.09,{"$f":"'Composições Aux. SINAPI'!E37:F37","v":332.32},{"$f":"TRUNC(D669*E669,2)","v":29.9}]
["SINAPI I 1166","TAMPÃO DE FERRO GALVANIZADO DE 2\"","un",2,{"$f":"+Insumos!$G$189","v":21.55},{"$f":"TRUNC(D670*E670,2)","v":43.1}]
["SINAPI I 1165","TAMPÃO DE FERRO GALVANIZADO DE 1 1/2\"","un",4,{"$f":"+Insumos!$G$188","v":14.92},59.68]
[{"$f":"CONCATENATE(\"COTAÇÃO \",Insumos!#REF!)","v":{"$error":"#REF!"}},"TÁBUA ITAÚBA LIXADA APLAINADA 3,5 x 25 x 2,00","un",2,{"$f":"+Insumos!#REF!","v":{"$error":"#REF!"}},{"$error":"#REF!"}]
[{"$f":"CONCATENATE(\"COTAÇÃO \",Insumos!$B$136)","v":"COTAÇÃO 51"},"PARAFUSO FRANCÊS ZINCADO 5/16\" x 4\" C/PORCA","un",8,{"$f":"+Insumos!$G$136","v":1.47},11.76]
["SINAPI I 3767","LIXA P/MADEIRA","fl",2.0870000000000002,{"$f":"+Insumos!$G$120","v":0.79},1.64]
[{"$f":"CONCATENATE(\"SINAPI I \",Insumos!$B$204)","v":"SINAPI I 7292"},"TINTA ESMALTE SINTÉTICO BRILHANTE","l",1.2161,{"$f":"+Insumos!$G$204","v":27.61},33.57]
[{"$f":"CONCATENATE(\"SINAPI I \",Insumos!$B$182)","v":"SINAPI I 5318"},"SOLVENTE DILUENTE A BASE DE AGUARRÁS","l",0.20669999999999999,{"$f":"+Insumos!$G$182","v":17.98},3.71]
[{"$f":"CONCATENATE(\"COTAÇÃO \",Insumos!$B$108)","v":"COTAÇÃO 108"},"FUNDO P/GALVANIZADO","l",0.1305,{"$f":"+Insumos!$G$108","v":34.81},4.54]
["SINAPI I 6086","FUNDO SINTÉTICO NIVELADOR BRANCO FOSCO","l",0.41470000000000001,{"$f":"+Insumos!$G$109","v":90.88},37.68]
[{"$f":"CONCATENATE(\"SINAPI I \",Insumos!$B$210)","v":"SINAPI I 21012"},"TUBO AÇO GALVANIZADO C/COSTURA 1 1/2\", 3,00 mm","m",4.96,{"$f":"+Insumos!$G$210","v":77.03},382.06]
["SINAPI I 21013","TUBO AÇO GALVANIZADO C/COSTURA 2\", 3,00 mm","m",0.5,{"$f":"+Insumos!$G$211","v":87.2},43.6]
["SUB-TOTAL - MATERIAL / EQUIPAMENTOS:",null,{"$f":"SUM(F668:F680)","v":{"$error":"#REF!"}}]
["SINAPI C 88310","PINTOR C/ENCARGOS COMPLEMENTARES","h",3.9178999999999999,{"$f":"'Planilha_M.O.'!E25","v":21.7},{"$f":"TRUNC(D682*E682,2)","v":85.01}]
["SINAPI C 88262","CARPINTEIRO C/ENCARGOS COMPLEMENTARES","h",2.3182,{"$f":"'Planilha_M.O.'!E26","v":20.5},{"$f":"TRUNC(D683*E683,2)","v":47.52}]
["SINAPI C 88309","PEDREIRO C/ENCARGOS COMPLEMENTARES","h",3.23,{"$f":"'Planilha_M.O.'!E24","v":20.71},{"$f":"TRUNC(D684*E684,2)","v":66.89}]
["SINAPI C 88316","SERVENTE C/ ENCARGOS COMPLEMENTARES","h",7,{"$f":"'Planilha_M.O.'!E18","v":17.11},{"$f":"TRUNC(D685*E685,2)","v":119.77}]
["SUB-TOTAL - MÃO-DE-OBRA:",null,{"$f":"SUM(F682:F685)","v":319.19}]
[]
[null,"CUSTO TOTAL:",null,null,null,{"$f":"+C681+C686","v":{"$error":"#REF!"}}]
[]
[null,"BDI:","%",{"$f":"+$F$7","v":"22,15%"},null,{"$f":"TRUNC(F688*D690,2)","v":{"$error":"#REF!"}}]
[]
[null,"PREÇO:",null,null,null,{"$f":"+F688+F690","v":{"$error":"#REF!"}}]
[]
["CÓDIGO","DISCRIMINAÇÃO","UN","COEFIC.","UNITÁRIO","TOTAL",null,"Atenção!!"]
[3205,"PLACA ORIENTATIVA GALVANIZADA","un"]
[{"$f":"CONCATENATE(\"COTAÇÃO \",Insumos!$B$66)","v":"COTAÇÃO 113"},"CAÇAMBA 4,00 m³","un",4.3999999999999997E-2,{"$f":"+Insumos!$G$66","v":443.33},{"$f":"TRUNC(D696*E696,2)","v":19.5},null,"Se o orçamento for de apenas de 1 academia, manter BDI Diferenciado. Caso contrário, se a academia fizer parte de uma obra maior, ajustar o BDI para que tenha o mesmo percentual do restante do orçamento."]
[{"$f":"CONCATENATE(\"SINAPI C \",'Composições Aux. SINAPI'!$A$37)","v":"SINAPI C 94963"},"CONCRETO fck=15 MPa PREPARO COM BETONEIRA","m³",0.2024,{"$f":"+'Composições Aux. SINAPI'!$E$37:$F$37","v":332.32},{"$f":"TRUNC(D697*E697,2)","v":67.260000000000005}]
["SUB-TOTAL - MATERIAL:",null,{"$f":"SUM(F696:F697)","v":86.76}]
[{"$f":"CONCATENATE(\"COTAÇÃO \",Insumos!$B$45)","v":"COTAÇÃO 88"},"(ATI) PLACA ORIENTATIVA","un",1,{"$f":"Cotações!M91","v":7695.33},{"$f":"TRUNC(D699*E699,2)","v":7695.33}]
["SUB-TOTAL - EQUIPAMENTO:",null,{"$f":"SUM(F699)","v":7695.33}]
["SINAPI C 88309","PEDREIRO C/ENCARGOS COMPLEMENTARES","h",0.91990000000000005,{"$f":"'Planilha_M.O.'!E24","v":20.71},{"$f":"TRUNC(D701*E701,2)","v":19.05}]
["SINAPI C 88316","SERVENTE C/ ENCARGOS COMPLEMENTARES","h",1.5006999999999999,{"$f":"'Planilha_M.O.'!E18","v":17.11},{"$f":"TRUNC(D702*E702,2)","v":25.67},null,"1 - Remover linha \"Sub-total Material\";"]
["SUB-TOTAL - MÃO-DE-OBRA:",null,{"$f":"SUM(F701:F702)","v":44.72},{"$nulls":4},"2 - Editar linha \"Sub-total equipamento\". Trocar para \"Sub-total Material\";"]
[{"$nulls":7},"3 - Ajustar a soma do \"Sub-total material\" de forma que todos os valores de material sejam somados;"]
[null,"CUSTO TOTAL:",null,null,null,{"$f":"+C698+C700+C703","v":7826.81},null,"4 - Remover, na soma do Custo Total, a referência que não existe mais;"]
[{"$nulls":7},"5 - No valor do BDI, substituir a referência inexistente pela referência do \"Sub-total Material\";"]
[null,"BDI:","%",{"$f":"+$F$7","v":"22,15%"},null,{"$f":"TRUNC((C698+C703)*D707,2)","v":29.12},null,"6 - Remover a linha do BDI Diferenciado;"]
[null,"BDI diferenciado:","%",{"$f":"+$F$8","v":0.13699999999999998},null,{"$f":"TRUNC(C700*D708,2)","v":1054.26},null,"7 - No preço final, remover a referência que não existe mais."]
[]
[null,"PREÇO:",null,null,null,{"$f":"+F705+F707+F708","v":8910.19}]
[]
[]
["CÓDIGO","DISCRIMINAÇÃO","UN","COEFIC.","UNITÁRIO","TOTAL"]
[3212,"JOGO DE BARRAS - GALVANIZADO","un"]
[{"$f":"CONCATENATE(\"COTAÇÃO \",[2]Insumos!$B$130)","v":"COTAÇÃO 113"},"CAÇAMBA 4,00 m³","un",8.7999999999999995E-2,{"$f":"Insumos!G66","v":443.33},{"$f":"TRUNC(D715*E715,2)","v":39.01}]
[{"$f":"CONCATENATE(\"SINAPI C \",'[2]Composições Aux. SINAPI'!$A$30)","v":"SINAPI C 94963"},"CONCRETO fck=15 MPa PREPARO COM BETONEIRA","m³",0.40479999999999999,{"$f":"'Composições Aux. SINAPI'!E37:F37","v":332.32},{"$f":"TRUNC(D716*E716,2)","v":134.52000000000001}]
["SUB-TOTAL - MATERIAL:",null,{"$f":"SUM(F715:F716)","v":173.53}]
[{"$f":"CONCATENATE(\"COTAÇÃO \",[2]Insumos!$B$96)","v":"COTAÇÃO 85"},"(ATI) JOGO DE BARRAS","un",1,{"$f":"Cotações!M88","v":9359.33},{"$f":"TRUNC(D718*E718,2)","v":9359.33}]
["SUB-TOTAL - EQUIPAMENTO:",null,{"$f":"SUM(F718)","v":9359.33}]
[{"$f":"CONCATENATE(\"SINAPI C \",[2]Insumos!$B$38)","v":"SINAPI C 88309"},"PEDREIRO C/ENCARGOS COMPLEMENTARES","h",1.5899000000000001,{"$f":"+[2]Insumos!$G$38","v":18.48},{"$f":"TRUNC(D720*E720,2)","v":29.38}]
[{"$f":"CONCATENATE(\"SINAPI C \",[2]Insumos!$B$41)","v":"SINAPI C 88316"},"SERVENTE C/ ENCARGOS COMPLEMENTARES","h",3.0013000000000001,{"$f":"+[2]Insumos!$G$41","v":15.35},{"$f":"TRUNC(D721*E721,2)","v":46.06}]
["SUB-TOTAL - MÃO-DE-OBRA:",null,{"$f":"SUM(F720:F721)","v":75.44}]
[]
[null,"CUSTO TOTAL:",null,null,null,{"$f":"+C717+C719+C722","v":9608.3000000000011}]
[]
[null,"BDI:","%",{"$f":"+$F$7","v":"22,15%"},null,{"$f":"TRUNC((C717+C722)*D726,2)","v":55.14}]
[null,"BDI diferenciado:","%",{"$f":"+$F$8","v":0.13699999999999998},null,{"$f":"TRUNC(C719*D727,2)","v":1282.22}]
[]
[null,"PREÇO:",null,null,null,{"$f":"+F724+F726+F727","v":10945.66}]
[]
[]
["CÓDIGO","DISCRIMINAÇÃO","UN","COEFIC.","UNITÁRIO","TOTAL"]
[3220,"SIMULADOR DE CAMINHADA TRIPLO CONJUGADO - GALVANIZADO","un"]
[{"$f":"CONCATENATE(\"COTAÇÃO \",Insumos!$B$49)","v":"COTAÇÃO 92"},"(ATI) SIMULADOR DE CAMINHADA TRIPLO CONJUGADO","un",1,{"$f":"Cotações!M95","v":13224.66},{"$f":"TRUNC(D734*E734,2)","v":13224.66}]
["SUB-TOTAL - EQUIPAMENTO:",null,{"$f":"SUM(F734)","v":13224.66}]
["SINAPI C 88309","PEDREIRO C/ENCARGOS COMPLEMENTARES","h",0.75,{"$f":"'Planilha_M.O.'!E24","v":20.71},{"$f":"TRUNC(D736*E736,2)","v":15.53}]
["SINAPI C 88316","SERVENTE C/ ENCARGOS COMPLEMENTARES","h",0.5,{"$f":"'Planilha_M.O.'!E18","v":17.11},{"$f":"TRUNC(D737*E737,2)","v":8.5500000000000007}]
["SUB-TOTAL - MÃO-DE-OBRA:",null,{"$f":"SUM(F736:F737)","v":24.08}]
[]
[null,"CUSTO TOTAL:",null,null,null,{"$f":"+C735+C738","v":13248.74}]
[]
[null,"BDI:","%",{"$f":"+$F$7","v":"22,15%"},null,{"$f":"TRUNC(C738*D742,2)","v":5.33}]
[null,"BDI diferenciado:","%",{"$f":"+$F$8","v":0.13699999999999998},null,{"$f":"TRUNC(C735*D743,2)","v":1811.77}]
[]
[null,"PREÇO:",null,null,null,{"$f":"+F740+F742+F743","v":15065.84}]
[]
["CÓDIGO","DISCRIMINAÇÃO","UN","COEFIC.","UNITÁRIO","TOTAL"]
[3230,"ESQUI TRIPLO CONJUGADO - GALVANIZADO","un"]
[{"$f":"CONCATENATE(\"COTAÇÃO \",Insumos!$B$41)","v":"COTAÇÃO 84"},"(ATI) ESQUI TRIPLO CONJUGADO","un",1,{"$f":"Cotações!M87","v":16140},{"$f":"TRUNC(D749*E749,2)","v":16140}]
["SUB-TOTAL - EQUIPAMENTO:",null,{"$f":"SUM(F749)","v":16140}]
["SINAPI C 88309","PEDREIRO C/ENCARGOS COMPLEMENTARES","h",0.75,{"$f":"'Planilha_M.O.'!E24","v":20.71},{"$f":"TRUNC(D751*E751,2)","v":15.53}]
["SINAPI C 88316","SERVENTE C/ ENCARGOS COMPLEMENTARES","h",0.5,{"$f":"'Planilha_M.O.'!E18","v":17.11},{"$f":"TRUNC(D752*E752,2)","v":8.5500000000000007}]
["SUB-TOTAL - MÃO-DE-OBRA:",null,{"$f":"SUM(F751:F752)","v":24.08}]
[]
[null,"CUSTO TOTAL:",null,null,null,{"$f":"+C750+C753","v":16164.08}]
[]
[null,"BDI:","%",{"$f":"+$F$7","v":"22,15%"},null,{"$f":"TRUNC(C753*D757,2)","v":5.33}]
[null,"BDI diferenciado:","%",{"$f":"+$F$8","v":0.13699999999999998},null,{"$f":"TRUNC(C750*D758,2)","v":2211.1799999999998}]
[]
[null,"PREÇO:",null,null,null,{"$f":"+F755+F757+F758","v":18380.59}]
[]
["CÓDIGO","DISCRIMINAÇÃO","UN","COEFIC.","UNITÁRIO","TOTAL"]
[3235,"ADUÇÃO E ABDUÇÃO DE PERNAS DUPLO - GALVANIZADO","un"]
[{"$f":"CONCATENATE(\"COTAÇÃO \",Insumos!$B$66)","v":"COTAÇÃO 113"},"CAÇAMBA 4,00 m³","un",2.1999999999999999E-2,{"$f":"+Insumos!$G$66","v":443.33},{"$f":"TRUNC(D764*E764,2)","v":9.75}]
[{"$f":"CONCATENATE(\"SINAPI C \",'Composições Aux. SINAPI'!$A$37)","v":"SINAPI C 94963"},"CONCRETO fck=15 MPa PREPARO COM BETONEIRA","m³",0.1012,{"$f":"+'Composições Aux. SINAPI'!$E$37:$F$37","v":332.32},{"$f":"TRUNC(D765*E765,2)","v":33.630000000000003}]
["SUB-TOTAL - MATERIAL:",null,{"$f":"SUM(F764:F765)","v":43.38}]
[{"$f":"CONCATENATE(\"COTAÇÃO \",Insumos!$B$40)","v":"COTAÇÃO 83"},"(ATI) ADUÇÃO E ABDUÇÃO DE PERNAS DUPLO","un",1,{"$f":"Cotações!N86","v":9150},{"$f":"TRUNC(D767*E767,2)","v":9150}]
["SUB-TOTAL - EQUIPAMENTO:",null,{"$f":"SUM(F767)","v":9150}]
["SINAPI C 88309","PEDREIRO C/ENCARGOS COMPLEMENTARES","h",0.46,{"$f":"'Planilha_M.O.'!E24","v":20.71},{"$f":"TRUNC(D769*E769,2)","v":9.52}]
["SINAPI C 88316","SERVENTE C/ ENCARGOS COMPLEMENTARES","h",1.1253,{"$f":"'Planilha_M.O.'!E18","v":17.11},{"$f":"TRUNC(D770*E770,2)","v":19.25}]
["SUB-TOTAL - MÃO-DE-OBRA:",null,{"$f":"SUM(F769:F770)","v":28.77}]
[]
[null,"CUSTO TOTAL:",null,null,null,{"$f":"+C766+C768+C771","v":9222.15}]
[]
[null,"BDI:","%",{"$f":"+$F$7","v":"22,15%"},null,{"$f":"TRUNC((C766+C771)*D775,2)","v":15.98}]
[null,"BDI diferenciado:","%",{"$f":"+$F$8","v":0.13699999999999998},null,{"$f":"TRUNC(C768*D776,2)","v":1253.55}]
[]
[null,"PREÇO:",null,null,null,{"$f":"+F773+F775+F776","v":10491.679999999998}]
[]
["CÓDIGO","DISCRIMINAÇÃO","UN","COEFIC.","UNITÁRIO","TOTAL"]
[3240,"PRESSÃO DE PERNAS TRIPLO CONJUGADO - GALVANIZADO","un"]
[{"$f":"CONCATENATE(\"COTAÇÃO \",Insumos!$B$66)","v":"COTAÇÃO 113"},"CAÇAMBA 4,00 m³","un",2.1999999999999999E-2,{"$f":"+Insumos!$G$66","v":443.33},{"$f":"TRUNC(D782*E782,2)","v":9.75}]
[{"$f":"CONCATENATE(\"SINAPI C \",'Composições Aux. SINAPI'!$A$37)","v":"SINAPI C 94963"},"CONCRETO fck=15 MPa PREPARO COM BETONEIRA","m³",0.1012,{"$f":"+'Composições Aux. SINAPI'!$E$37:$F$37","v":332.32},{"$f":"TRUNC(D783*E783,2)","v":33.630000000000003}]
["SUB-TOTAL - MATERIAL:",null,{"$f":"SUM(F782:F783)","v":43.38}]
[{"$f":"CONCATENATE(\"COTAÇÃO \",Insumos!$B$46)","v":"COTAÇÃO 89"},"(ATI) PRESSÃO DE PERNAS TRIPLO CONJUGADO","un",1,{"$f":"Cotações!M92","v":9472},{"$f":"TRUNC(D785*E785,2)","v":9472}]
["SUB-TOTAL - EQUIPAMENTO:",null,{"$f":"SUM(F785)","v":9472}]
["SINAPI C 88309","PEDREIRO C/ENCARGOS COMPLEMENTARES","h",0.46,{"$f":"'Planilha_M.O.'!E24","v":20.71},{"$f":"TRUNC(D787*E787,2)","v":9.52}]
["SINAPI C 88316","SERVENTE C/ ENCARGOS COMPLEMENTARES","h",1.1253,{"$f":"'Planilha_M.O.'!E18","v":17.11},{"$f":"TRUNC(D788*E788,2)","v":19.25}]
["SUB-TOTAL - MÃO-DE-OBRA:",null,{"$f":"SUM(F787:F788)","v":28.77}]
[]
[null,"CUSTO TOTAL:",null,null,null,{"$f":"+C784+C786+C789","v":9544.15}]
[]
[null,"BDI:","%",{"$f":"+$F$7","v":"22,15%"},null,{"$f":"TRUNC((C784+C789)*D793,2)","v":15.98}]
[null,"BDI diferenciado:","%",{"$f":"+$F$8","v":0.13699999999999998},null,{"$f":"TRUNC(C786*D794,2)","v":1297.6600000000001}]
[]
[null,"PREÇO:",null,null,null,{"$f":"+F791+F793+F794","v":10857.789999999999}]
[]
[]
["CÓDIGO","DISCRIMINAÇÃO","UN","COEFIC.","UNITÁRIO","TOTAL"]
[3245,"MULTIEXERCITADOR CONJUGADO 6 FUNÇÕES - GALVANIZADO","un"]
[{"$f":"CONCATENATE(\"COTAÇÃO \",Insumos!$B$43)","v":"COTAÇÃO 86"},"(ATI) MULTIEXERCITADOR CONJUGADO 6 FUNÇÕES","un",1,{"$f":"Cotações!M89","v":16191.33},{"$f":"TRUNC(D801*E801,2)","v":16191.33}]
["SUB-TOTAL - EQUIPAMENTO:",null,{"$f":"SUM(F801)","v":16191.33}]
["SINAPI C 88309","PEDREIRO C/ENCARGOS COMPLEMENTARES","h",0.75,{"$f":"'Planilha_M.O.'!E24","v":20.71},{"$f":"TRUNC(D803*E803,2)","v":15.53}]
["SINAPI C 88316","SERVENTE C/ ENCARGOS COMPLEMENTARES","h",0.75,{"$f":"'Planilha_M.O.'!E18","v":17.11},{"$f":"TRUNC(D804*E804,2)","v":12.83}]
["SUB-TOTAL - MÃO-DE-OBRA:",null,{"$f":"SUM(F803:F804)","v":28.36}]
[]
[null,"CUSTO TOTAL:",null,null,null,{"$f":"+C802+C805","v":16219.69}]
[]
[null,"BDI:","%",{"$f":"+$F$7","v":"22,15%"},null,{"$f":"TRUNC(C805*D809,2)","v":6.28}]
[null,"BDI diferenciado:","%",{"$f":"+$F$8","v":0.13699999999999998},null,{"$f":"TRUNC(C802*D810,2)","v":2218.21}]
[]
[null,"PREÇO:",null,null,null,{"$f":"+F807+F809+F810","v":18444.18}]
[]
[]
["CÓDIGO","DISCRIMINAÇÃO","UN","COEFIC.","UNITÁRIO","TOTAL"]
[3252,"SIMULADOR DE REMO - GALVANIZADO","un"]
[{"$f":"CONCATENATE(\"COTAÇÃO \",Insumos!$B$50)","v":"COTAÇÃO 93"},"(ATI) SIMULADOR DE REMO","un",1,{"$f":"Cotações!N96","v":5640},{"$f":"TRUNC(D817*E817,2)","v":5640}]
["SUB-TOTAL - EQUIPAMENTO:",null,{"$f":"SUM(F817)","v":5640}]
["SINAPI C 88309","PEDREIRO C/ENCARGOS COMPLEMENTARES","h",0.75,{"$f":"'Planilha_M.O.'!E24","v":20.71},{"$f":"TRUNC(D819*E819,2)","v":15.53}]
["SINAPI C 88316","SERVENTE C/ ENCARGOS COMPLEMENTARES","h",0.5,{"$f":"'Planilha_M.O.'!E18","v":17.11},{"$f":"TRUNC(D820*E820,2)","v":8.5500000000000007}]
["SUB-TOTAL - MÃO-DE-OBRA:",null,{"$f":"SUM(F819:F820)","v":24.08}]
[]
[null,"CUSTO TOTAL:",null,null,null,{"$f":"+C818+C821","v":5664.08}]
[]
[null,"BDI:","%",{"$f":"+$F$7","v":"22,15%"},null,{"$f":"TRUNC(C821*D825,2)","v":5.33}]
[null,"BDI diferenciado:","%",{"$f":"+$F$8","v":0.13699999999999998},null,{"$f":"TRUNC(C818*D826,2)","v":772.68}]
[]
[null,"PREÇO:",null,null,null,{"$f":"+F823+F825+F826","v":6442.09}]
[]
["CÓDIGO","DISCRIMINAÇÃO","UN","COEFIC.","UNITÁRIO","TOTAL"]
[3260,"PUXADOR DUPLO - GALVANIZADO","un"]
[{"$f":"CONCATENATE(\"COTAÇÃO \",Insumos!$B$66)","v":"COTAÇÃO 113"},"CAÇAMBA 4,00 m³","un",2.1999999999999999E-2,{"$f":"+Insumos!$G$66","v":443.33},{"$f":"TRUNC(D832*E832,2)","v":9.75}]
[{"$f":"CONCATENATE(\"SINAPI C \",'Composições Aux. SINAPI'!$A$37)","v":"SINAPI C 94963"},"CONCRETO fck=15 MPa PREPARO COM BETONEIRA","m³",0.1012,{"$f":"+'Composições Aux. SINAPI'!$E$37:$F$37","v":332.32},{"$f":"TRUNC(D833*E833,2)","v":33.630000000000003}]
["SUB-TOTAL - MATERIAL:",null,{"$f":"SUM(F832:F833)","v":43.38}]
[{"$f":"CONCATENATE(\"COTAÇÃO \",Insumos!$B$47)","v":"COTAÇÃO 90"},"(ATI) PUXADOR DUPLO","un",1,{"$f":"Cotações!N93","v":10428},{"$f":"TRUNC(D835*E835,2)","v":10428}]
["SUB-TOTAL - EQUIPAMENTO:",null,{"$f":"SUM(F835)","v":10428}]
["SINAPI C 88309","PEDREIRO C/ENCARGOS COMPLEMENTARES","h",0.46,{"$f":"'Planilha_M.O.'!E24","v":20.71},{"$f":"TRUNC(D837*E837,2)","v":9.52}]
["SINAPI C 88316","SERVENTE C/ ENCARGOS COMPLEMENTARES","h",1.1253,{"$f":"'Planilha_M.O.'!E18","v":17.11},{"$f":"TRUNC(D838*E838,2)","v":19.25}]
["SUB-TOTAL - MÃO-DE-OBRA:",null,{"$f":"SUM(F837:F838)","v":28.77}]
[]
[null,"CUSTO TOTAL:",null,null,null,{"$f":"+C834+C836+C839","v":10500.15}]
[]
[null,"BDI:","%",{"$f":"+$F$7","v":"22,15%"},null,{"$f":"TRUNC((C834+C839)*D843,2)","v":15.98}]
[null,"BDI diferenciado:","%",{"$f":"+$F$8","v":0.13699999999999998},null,{"$f":"TRUNC(C836*D844,2)","v":1428.63}]
[]
[null,"PREÇO:",null,null,null,{"$f":"+F841+F843+F844","v":11944.759999999998}]
[]
[]
["CÓDIGO","DISCRIMINAÇÃO","UN","COEFIC.","UNITÁRIO","TOTAL"]
[3265,"PEITORAL DUPLO - GALVANIZADO","un"]
[{"$f":"CONCATENATE(\"COTAÇÃO \",Insumos!$B$66)","v":"COTAÇÃO 113"},"CAÇAMBA 4,00 m³","un",2.1999999999999999E-2,{"$f":"+Insumos!$G$66","v":443.33},{"$f":"TRUNC(D851*E851,2)","v":9.75}]
[{"$f":"CONCATENATE(\"SINAPI C \",'Composições Aux. SINAPI'!$A$37)","v":"SINAPI C 94963"},"CONCRETO fck=15 MPa PREPARO COM BETONEIRA","m³",0.1012,{"$f":"+'Composições Aux. SINAPI'!$E$37:$F$37","v":332.32},{"$f":"TRUNC(D852*E852,2)","v":33.630000000000003}]
["SUB-TOTAL - MATERIAL:",null,{"$f":"SUM(F851:F852)","v":43.38}]
[{"$f":"CONCATENATE(\"COTAÇÃO \",Insumos!$B$44)","v":"COTAÇÃO 87"},"(ATI) PEITORAL DUPLO","un",1,{"$f":"Cotações!N90","v":9790},{"$f":"TRUNC(D854*E854,2)","v":9790}]
["SUB-TOTAL - EQUIPAMENTO:",null,{"$f":"SUM(F854)","v":9790}]
["SINAPI C 88309","PEDREIRO C/ENCARGOS COMPLEMENTARES","h",0.46,{"$f":"'Planilha_M.O.'!E24","v":20.71},{"$f":"TRUNC(D856*E856,2)","v":9.52}]
["SINAPI C 88316","SERVENTE C/ ENCARGOS COMPLEMENTARES","h",1.1253,{"$f":"'Planilha_M.O.'!E18","v":17.11},{"$f":"TRUNC(D857*E857,2)","v":19.25}]
["SUB-TOTAL - MÃO-DE-OBRA:",null,{"$f":"SUM(F856:F857)","v":28.77}]
[]
[null,"CUSTO TOTAL:",null,null,null,{"$f":"+C853+C855+C858","v":9862.15}]
[]
[null,"BDI:","%",{"$f":"+$F$7","v":"22,15%"},null,{"$f":"TRUNC((C853+C858)*D862,2)","v":15.98}]
[null,"BDI diferenciado:","%",{"$f":"+$F$8","v":0.13699999999999998},null,{"$f":"TRUNC(C855*D863,2)","v":1341.23}]
[]
[null,"PREÇO:",null,null,null,{"$f":"+F860+F862+F863","v":11219.359999999999}]
[]
["CÓDIGO","DISCRIMINAÇÃO","UN","COEFIC.","UNITÁRIO","TOTAL"]
[3270,"ABDOMINAL SIMPLES - GALVANIZADO","un"]
[{"$f":"CONCATENATE(\"COTAÇÃO \",Insumos!$B$66)","v":"COTAÇÃO 113"},"CAÇAMBA 4,00 m³","un",2.1999999999999999E-2,{"$f":"+Insumos!$G$66","v":443.33},{"$f":"TRUNC(D869*E869,2)","v":9.75}]
[{"$f":"CONCATENATE(\"SINAPI C \",'Composições Aux. SINAPI'!$A$37)","v":"SINAPI C 94963"},"CONCRETO fck=15 MPa PREPARO COM BETONEIRA","m³",0.1012,{"$f":"+'Composições Aux. SINAPI'!$E$37:$F$37","v":332.32},{"$f":"TRUNC(D870*E870,2)","v":33.630000000000003}]
["SUB-TOTAL - MATERIAL:",null,{"$f":"SUM(F869:F870)","v":43.38}]
[{"$f":"CONCATENATE(\"COTAÇÃO \",Insumos!$B$39)","v":"COTAÇÃO 82"},"(ATI) ABDOMINAL SIMPLES]","un",1,{"$f":"Cotações!M85","v":4936.66},{"$f":"TRUNC(D872*E872,2)","v":4936.66}]
["SUB-TOTAL - EQUIPAMENTO:",null,{"$f":"SUM(F872)","v":4936.66}]
["SINAPI C 88309","PEDREIRO C/ENCARGOS COMPLEMENTARES","h",0.46,{"$f":"'Planilha_M.O.'!E24","v":20.71},{"$f":"TRUNC(D874*E874,2)","v":9.52}]
["SINAPI C 88316","SERVENTE C/ ENCARGOS COMPLEMENTARES","h",1.1253,{"$f":"'Planilha_M.O.'!E18","v":17.11},{"$f":"TRUNC(D875*E875,2)","v":19.25}]
["SUB-TOTAL - MÃO-DE-OBRA:",null,{"$f":"SUM(F874:F875)","v":28.77}]
[]
[null,"CUSTO TOTAL:",null,null,null,{"$f":"+C871+C873+C876","v":5008.8100000000004}]
[]
[null,"BDI:","%",{"$f":"+$F$7","v":"22,15%"},null,{"$f":"TRUNC((C871+C876)*D880,2)","v":15.98}]
[null,"BDI diferenciado:","%",{"$f":"+$F$8","v":0.13699999999999998},null,{"$f":"TRUNC(C873*D881,2)","v":676.32}]
[]
[null,"PREÇO:",null,null,null,{"$f":"+F878+F880+F881","v":5701.11}]
[]
["CÓDIGO","DISCRIMINAÇÃO","UN","COEFIC.","UNITÁRIO","TOTAL"]
[3276,"REMADA ESPECIAL - GALVANIZADO","un"]
[{"$f":"CONCATENATE(\"COTAÇÃO \",Insumos!$B$48)","v":"COTAÇÃO 91"},"(APC) REMADA ESPECIAL","un",1,{"$f":"Cotações!N94","v":5940},{"$f":"TRUNC(D887*E887,2)","v":5940}]
["SUB-TOTAL - EQUIPAMENTO:",null,{"$f":"SUM(F887)","v":5940}]
["SINAPI C 88309","PEDREIRO C/ENCARGOS COMPLEMENTARES","h",0.5,{"$f":"'Planilha_M.O.'!E24","v":20.71},{"$f":"TRUNC(D889*E889,2)","v":10.35}]
["SINAPI C 88316","SERVENTE C/ ENCARGOS COMPLEMENTARES","h",0.5,{"$f":"'Planilha_M.O.'!E18","v":17.11},{"$f":"TRUNC(D890*E890,2)","v":8.5500000000000007}]
["SUB-TOTAL - MÃO-DE-OBRA:",null,{"$f":"SUM(F889:F890)","v":18.899999999999999}]
[]
[null,"CUSTO TOTAL:",null,null,null,{"$f":"+C888+C891","v":5958.9}]
[]
[null,"BDI:","%",{"$f":"+$F$7","v":"22,15%"},null,{"$f":"TRUNC(C891*D895,2)","v":4.18}]
[null,"BDI diferenciado:","%",{"$f":"+$F$8","v":0.13699999999999998},null,{"$f":"TRUNC(C888*D896,2)","v":813.78}]
[]
[null,"PREÇO:",null,null,null,{"$f":"+F893+F895+F896","v":6776.86}]
[]
["CÓDIGO","DISCRIMINAÇÃO","UN","COEFIC.","UNITÁRIO","TOTAL"]
[3280,"VOADOR PEITORAL E VOADOR DORSAL","un"]
[{"$f":"CONCATENATE(\"COTAÇÃO \",Insumos!$B$66)","v":"COTAÇÃO 113"},"CAÇAMBA 4,00 m³","un",2.1999999999999999E-2,{"$f":"+Insumos!$G$66","v":443.33},{"$f":"TRUNC(D902*E902,2)","v":9.75}]
[{"$f":"CONCATENATE(\"SINAPI C \",'Composições Aux. SINAPI'!$A$37)","v":"SINAPI C 94963"},"CONCRETO fck=15 MPa PREPARO COM BETONEIRA","m³",0.1012,{"$f":"+'Composições Aux. SINAPI'!$E$37:$F$37","v":332.32},{"$f":"TRUNC(D903*E903,2)","v":33.630000000000003}]
["SUB-TOTAL - MATERIAL:",null,{"$f":"SUM(F902:F903)","v":43.38}]
[{"$f":"CONCATENATE(\"COTAÇÃO \",Insumos!$B$51)","v":"COTAÇÃO 94"},"(APC) VOADOR PEITORAL E VOADOR DORSAL","un",1,{"$f":"Cotações!N97","v":6200},{"$f":"TRUNC(D905*E905,2)","v":6200}]
["SUB-TOTAL - EQUIPAMENTO:",null,{"$f":"SUM(F905)","v":6200}]
["SINAPI C 88309","PEDREIRO C/ENCARGOS COMPLEMENTARES","h",0.46,{"$f":"'Planilha_M.O.'!E24","v":20.71},{"$f":"TRUNC(D907*E907,2)","v":9.52}]
["SINAPI C 88316","SERVENTE C/ ENCARGOS COMPLEMENTARES","h",1.1253,{"$f":"'Planilha_M.O.'!E18","v":17.11},{"$f":"TRUNC(D908*E908,2)","v":19.25}]
["SUB-TOTAL - MÃO-DE-OBRA:",null,{"$f":"SUM(F907:F908)","v":28.77}]
[]
[null,"CUSTO TOTAL:",null,null,null,{"$f":"+C904+C906+C909","v":6272.1500000000005}]
[]
[null,"BDI:","%",{"$f":"+$F$7","v":"22,15%"},null,{"$f":"TRUNC((C904+C909)*D913,2)","v":15.98}]
[null,"BDI diferenciado:","%",{"$f":"+$F$8","v":0.13699999999999998},null,{"$f":"TRUNC(C906*D914,2)","v":849.4}]
[]
[null,"PREÇO:",null,null,null,{"$f":"+F911+F913+F914","v":7137.53}]
[]
["CÓDIGO","DISCRIMINAÇÃO","UN","COEFIC.","UNITÁRIO","TOTAL"]
[3420,"REPINTURA TUBOS VERTICAIS QUADRAS ESPORTIVAS","m"]
[{"$f":"CONCATENATE(\"SINAPI I \",Insumos!$B$182)","v":"SINAPI I 5318"},"SOLVENTE DILUENTE A BASE DE AGUARRÁS","l",3.6999999999999998E-2,{"$f":"+Insumos!$G$182","v":17.98},{"$f":"TRUNC(D920*E920,2)","v":0.66}]
["SINAPI I 3768","LIXA P/FERRO","fl",0.23910000000000001,{"$f":"+Insumos!$G$119","v":3.37},{"$f":"TRUNC(D921*E921,2)","v":0.8}]
[{"$f":"CONCATENATE(\"SINAPI I \",Insumos!$B$204)","v":"SINAPI I 7292"},"TINTA ESMALTE SINTÉTICO BRILHANTE","l",0.20599999999999999,{"$f":"+Insumos!$G$204","v":27.61},{"$f":"TRUNC(D922*E922,2)","v":5.68}]
[{"$f":"CONCATENATE(\"COTAÇÃO \",Insumos!$B$108)","v":"COTAÇÃO 108"},"FUNDO P/GALVANIZADO","l",3.0099999999999998E-2,{"$f":"+Insumos!$G$108","v":34.81},{"$f":"TRUNC(D923*E923,2)","v":1.04}]
["SUB-TOTAL - MATERIAL / EQUIPAMENTOS:",null,{"$f":"SUM(F920:F923)","v":8.18}]
["SINAPI C 88310","PINTOR C/ENCARGOS COMPLEMENTARES","h",0.25590000000000002,{"$f":"'Planilha_M.O.'!E25","v":21.7},{"$f":"TRUNC(D925*E925,2)","v":5.55}]
["SINAPI C 88316","SERVENTE C/ ENCARGOS COMPLEMENTARES","h",0.25590000000000002,{"$f":"'Planilha_M.O.'!E18","v":17.11},{"$f":"TRUNC(D926*E926,2)","v":4.37}]
["SUB-TOTAL - MÃO-DE-OBRA:",null,{"$f":"SUM(F925:F926)","v":9.92}]
[]
[null,"CUSTO TOTAL:",null,null,null,{"$f":"+C924+C927","v":18.100000000000001}]
[]
[null,"BDI:","%",{"$f":"+$F$7","v":"22,15%"},null,{"$f":"TRUNC(F929*D931,2)","v":4}]
[]
[null,"PREÇO:",null,null,null,{"$f":"+F929+F931","v":22.1}]
[]
["CÓDIGO","DISCRIMINAÇÃO","UN","COEFIC.","UNITÁRIO","TOTAL"]
[3430,"REPINTURA TUBOS HORIZONTAIS QUADRAS ESPORTIVAS","m"]
[{"$f":"CONCATENATE(\"SINAPI I \",Insumos!$B$182)","v":"SINAPI I 5318"},"SOLVENTE DILUENTE A BASE DE AGUARRÁS","l",2.5999999999999999E-2,{"$f":"+Insumos!$G$182","v":17.98},{"$f":"TRUNC(D937*E937,2)","v":0.46}]
["SINAPI I 3768","LIXA P/FERRO","fl",0.1517,{"$f":"+Insumos!$G$119","v":3.37},{"$f":"TRUNC(D938*E938,2)","v":0.51}]
[{"$f":"CONCATENATE(\"SINAPI I \",Insumos!$B$204)","v":"SINAPI I 7292"},"TINTA ESMALTE SINTÉTICO BRILHANTE","l",0.14399999999999999,{"$f":"+Insumos!$G$204","v":27.61},{"$f":"TRUNC(D939*E939,2)","v":3.97}]
[{"$f":"CONCATENATE(\"COTAÇÃO \",Insumos!$B$108)","v":"COTAÇÃO 108"},"FUNDO P/GALVANIZADO","l",1.6799999999999999E-2,{"$f":"+Insumos!$G$108","v":34.81},{"$f":"TRUNC(D940*E940,2)","v":0.57999999999999996}]
["SUB-TOTAL - MATERIAL / EQUIPAMENTOS:",null,{"$f":"SUM(F937:F940)","v":5.5200000000000005}]
["SINAPI C 88310","PINTOR C/ENCARGOS COMPLEMENTARES","h",0.15989999999999999,{"$f":"'Planilha_M.O.'!E25","v":21.7},{"$f":"TRUNC(D942*E942,2)","v":3.46}]
["SINAPI C 88316","SERVENTE C/ ENCARGOS COMPLEMENTARES","h",0.15989999999999999,{"$f":"'Planilha_M.O.'!E18","v":17.11},{"$f":"TRUNC(D943*E943,2)","v":2.73}]
["SUB-TOTAL - MÃO-DE-OBRA:",null,{"$f":"SUM(F942:F943)","v":6.1899999999999995}]
[]
[null,"CUSTO TOTAL:",null,null,null,{"$f":"+C941+C944","v":11.71}]
[]
[null,"BDI:","%",{"$f":"+$F$7","v":"22,15%"},null,{"$f":"TRUNC(F946*D948,2)","v":2.59}]
[]
[null,"PREÇO:",null,null,null,{"$f":"+F946+F948","v":14.3}]
[]
["CÓDIGO","DISCRIMINAÇÃO","UN","COEFIC.","UNITÁRIO","TOTAL"]
[3440,"REPINTURA GOLEIRA SALÃO","un"]
[{"$f":"CONCATENATE(\"SINAPI I \",Insumos!$B$182)","v":"SINAPI I 5318"},"SOLVENTE DILUENTE A BASE DE AGUARRÁS","l",0.27010000000000001,{"$f":"+Insumos!$G$182","v":17.98},{"$f":"TRUNC(D954*E954,2)","v":4.8499999999999996}]
["SINAPI I 3768","LIXA P/FERRO","fl",1.7452000000000001,{"$f":"+Insumos!$G$119","v":3.37},{"$f":"TRUNC(D955*E955,2)","v":5.88}]
[{"$f":"CONCATENATE(\"SINAPI I \",Insumos!$B$204)","v":"SINAPI I 7292"},"TINTA ESMALTE SINTÉTICO BRILHANTE","l",1.5038,{"$f":"+Insumos!$G$204","v":27.61},{"$f":"TRUNC(D956*E956,2)","v":41.51}]
[{"$f":"CONCATENATE(\"COTAÇÃO \",Insumos!$B$108)","v":"COTAÇÃO 108"},"FUNDO P/GALVANIZADO","l",0.21970000000000001,{"$f":"+Insumos!$G$108","v":34.81},{"$f":"TRUNC(D957*E957,2)","v":7.64}]
["SUB-TOTAL - MATERIAL / EQUIPAMENTOS:",null,{"$f":"SUM(F954:F957)","v":59.879999999999995}]
["SINAPI C 88310","PINTOR C/ENCARGOS COMPLEMENTARES","h",1,{"$f":"'Planilha_M.O.'!E25","v":21.7},{"$f":"TRUNC(D959*E959,2)","v":21.7}]
["SINAPI C 88316","SERVENTE C/ ENCARGOS COMPLEMENTARES","h",1,{"$f":"'Planilha_M.O.'!E18","v":17.11},{"$f":"TRUNC(D960*E960,2)","v":17.11}]
["SUB-TOTAL - MÃO-DE-OBRA:",null,{"$f":"SUM(F959:F960)","v":38.81}]
[]
[null,"CUSTO TOTAL:",null,null,null,{"$f":"+C958+C961","v":98.69}]
[]
[null,"BDI:","%",{"$f":"+$F$7","v":"22,15%"},null,{"$f":"TRUNC(F963*D965,2)","v":21.85}]
[]
[null,"PREÇO:",null,null,null,{"$f":"+F963+F965","v":120.53999999999999}]
[]
["CÓDIGO","DISCRIMINAÇÃO","UN","COEFIC.","UNITÁRIO","TOTAL"]
[3450,"REPINTURA POSTE DE VÔLEI","m"]
[{"$f":"CONCATENATE(\"SINAPI I \",Insumos!$B$182)","v":"SINAPI I 5318"},"SOLVENTE DILUENTE A BASE DE AGUARRÁS","l",0.1036,{"$f":"+Insumos!$G$182","v":17.98},{"$f":"TRUNC(D971*E971,2)","v":1.86}]
["SINAPI I 3768","LIXA P/FERRO","fl",0.6694,{"$f":"+Insumos!$G$119","v":3.37},{"$f":"TRUNC(D972*E972,2)","v":2.25}]
[{"$f":"CONCATENATE(\"SINAPI I \",Insumos!$B$204)","v":"SINAPI I 7292"},"TINTA ESMALTE SINTÉTICO BRILHANTE","l",0.57679999999999998,{"$f":"+Insumos!$G$204","v":27.61},{"$f":"TRUNC(D973*E973,2)","v":15.92}]
[{"$f":"CONCATENATE(\"COTAÇÃO \",Insumos!$B$108)","v":"COTAÇÃO 108"},"FUNDO P/GALVANIZADO","l",8.43E-2,{"$f":"+Insumos!$G$108","v":34.81},{"$f":"TRUNC(D974*E974,2)","v":2.93}]
["SUB-TOTAL - MATERIAL / EQUIPAMENTOS:",null,{"$f":"SUM(F971:F974)","v":22.96}]
["SINAPI C 88310","PINTOR C/ENCARGOS COMPLEMENTARES","h",0.59,{"$f":"'Planilha_M.O.'!E25","v":21.7},{"$f":"TRUNC(D976*E976,2)","v":12.8}]
["SINAPI C 88316","SERVENTE C/ ENCARGOS COMPLEMENTARES","h",0.59,{"$f":"'Planilha_M.O.'!E18","v":17.11},{"$f":"TRUNC(D977*E977,2)","v":10.09}]
["SUB-TOTAL - MÃO-DE-OBRA:",null,{"$f":"SUM(F976:F977)","v":22.89}]
[]
[null,"CUSTO TOTAL:",null,null,null,{"$f":"+C975+C978","v":45.85}]
[]
[null,"BDI:","%",{"$f":"+$F$7","v":"22,15%"},null,{"$f":"TRUNC(F980*D982,2)","v":10.15}]
[]
[null,"PREÇO:",null,null,null,{"$f":"+F980+F982","v":56}]
[]
["CÓDIGO","DISCRIMINAÇÃO","UN","COEFIC.","UNITÁRIO","TOTAL"]
[3520,"REPINTURA BANCO C/ENCOSTO","un"]
["SINAPI I 3767","LIXA P/MADEIRA","fl",2.7399,{"$f":"+Insumos!$G$120","v":0.79},{"$f":"TRUNC(D988*E988,2)","v":2.16}]
["SINAPI I 3768","LIXA P/FERRO","fl",0.70320000000000005,{"$f":"+Insumos!$G$119","v":3.37},2.36]
["SINAPI I 7307","FUNDO ANTICORROSIVO TIPO ZARCÃO","l",7.8399999999999997E-2,{"$f":"+Insumos!$G$107","v":29.63},2.3199999999999998]
["SINAPI I 7293","TINTA GRAFITE","l",0.16880000000000001,{"$f":"+Insumos!$G$205","v":30.39},5.12]
[{"$f":"CONCATENATE(\"SINAPI I \",Insumos!$B$204)","v":"SINAPI I 7292"},"TINTA ESMALTE SINTÉTICO BRILHANTE","l",0.56440000000000001,{"$f":"+Insumos!$G$204","v":27.61},15.58]
[{"$f":"CONCATENATE(\"SINAPI I \",Insumos!$B$182)","v":"SINAPI I 5318"},"SOLVENTE DILUENTE A BASE DE AGUARRÁS","l",0.1226,{"$f":"+Insumos!$G$182","v":17.98},2.2000000000000002]
["SINAPI 6086","FUNDO SINTÉTICO NIVELADOR BRANCO FOSCO","l",0.54800000000000004,{"$f":"+Insumos!$G$109","v":90.88},49.8]
["SUB-TOTAL - MATERIAL / EQUIPAMENTOS:",null,{"$f":"SUM(F988:F994)","v":79.539999999999992}]
["SINAPI C 88310","PINTOR C/ENCARGOS COMPLEMENTARES","h",0.89,{"$f":"'Planilha_M.O.'!E25","v":21.7},{"$f":"TRUNC(D996*E996,2)","v":19.309999999999999}]
["SINAPI C 88316","SERVENTE C/ ENCARGOS COMPLEMENTARES","h",0.89,{"$f":"'Planilha_M.O.'!E18","v":17.11},{"$f":"TRUNC(D997*E997,2)","v":15.22}]
["SUB-TOTAL - MÃO-DE-OBRA:",null,{"$f":"SUM(F996:F997)","v":34.53}]
[]
[null,"CUSTO TOTAL:",null,null,null,{"$f":"+C995+C998","v":114.07}]
[]
[null,"BDI:","%",{"$f":"+$F$7","v":"22,15%"},null,{"$f":"TRUNC(F1000*D1002,2)","v":25.26}]
[]
[null,"PREÇO:",null,null,null,{"$f":"+F1000+F1002","v":139.32999999999998}]
[]
["CÓDIGO","DISCRIMINAÇÃO","UN","COEFIC.","UNITÁRIO","TOTAL"]
[3523,"REPINTURA BANCO S/ENCOSTO","un"]
["SINAPI I 3767","LIXA P/MADEIRA","fl",1.6466000000000001,{"$f":"+Insumos!$G$120","v":0.79},{"$f":"TRUNC(D1008*E1008,2)","v":1.3}]
["SINAPI I 3768","LIXA P/FERRO","fl",0.70889999999999997,{"$f":"+Insumos!$G$119","v":3.37},2.38]
[{"$f":"CONCATENATE(\"COTAÇÃO \",Insumos!$B$108)","v":"COTAÇÃO 108"},"FUNDO P/GALVANIZADO","l",8.9200000000000002E-2,{"$f":"+Insumos!$G$108","v":34.81},3.1]
["SINAPI I 7293","TINTA GRAFITE","l",0.71479999999999999,{"$f":"+Insumos!$G$205","v":30.39},21.72]
[{"$f":"CONCATENATE(\"SINAPI I \",Insumos!$B$204)","v":"SINAPI I 7292"},"TINTA ESMALTE SINTÉTICO BRILHANTE","l",0.3392,{"$f":"+Insumos!$G$204","v":27.61},9.36]
[{"$f":"CONCATENATE(\"SINAPI I \",Insumos!$B$182)","v":"SINAPI I 5318"},"SOLVENTE DILUENTE A BASE DE AGUARRÁS","l",0.19400000000000001,{"$f":"+Insumos!$G$182","v":17.98},3.48]
["SINAPI 6086","FUNDO SINTÉTICO NIVELADOR BRANCO FOSCO","l",0.32929999999999998,{"$f":"+Insumos!$G$109","v":90.88},29.92]
["SUB-TOTAL - MATERIAL / EQUIPAMENTOS:",null,{"$f":"SUM(F1008:F1014)","v":71.259999999999991}]
["SINAPI C 88310","PINTOR C/ENCARGOS COMPLEMENTARES","h",0.69,{"$f":"'Planilha_M.O.'!E25","v":21.7},{"$f":"TRUNC(D1016*E1016,2)","v":14.97}]
["SINAPI C 88316","SERVENTE C/ ENCARGOS COMPLEMENTARES","h",0.69,{"$f":"'Planilha_M.O.'!E18","v":17.11},{"$f":"TRUNC(D1017*E1017,2)","v":11.8}]
["SUB-TOTAL - MÃO-DE-OBRA:",null,{"$f":"SUM(F1016:F1017)","v":26.770000000000003}]
[]
[null,"CUSTO TOTAL:",null,null,null,{"$f":"+C1015+C1018","v":98.03}]
[]
[null,"BDI:","%",{"$f":"+$F$7","v":"22,15%"},null,{"$f":"TRUNC(F1020*D1022,2)","v":21.71}]
[]
[null,"PREÇO:",null,null,null,{"$f":"+F1020+F1022","v":119.74000000000001}]
[]
["CÓDIGO","DISCRIMINAÇÃO","UN","COEFIC.","UNITÁRIO","TOTAL"]
[3530,"REPINTURA PARACICLO","un"]
["SINAPI I 3768","LIXA P/FERRO","fl",0.48959999999999998,{"$f":"+Insumos!$G$119","v":3.37},{"$f":"TRUNC(D1028*E1028,2)","v":1.64}]
["SINAPI I 7307","FUNDO ANTICORROSIVO TIPO ZARCÃO","l",5.4600000000000003E-2,{"$f":"+Insumos!$G$107","v":29.63},{"$f":"TRUNC(D1029*E1029,2)","v":1.61}]
["SINAPI I 7293","TINTA GRAFITE","l",0.11749999999999999,{"$f":"+Insumos!$G$205","v":30.39},{"$f":"TRUNC(D1030*E1030,2)","v":3.57}]
[{"$f":"CONCATENATE(\"SINAPI I \",Insumos!$B$182)","v":"SINAPI I 5318"},"SOLVENTE DILUENTE A BASE DE AGUARRÁS","l",2.6200000000000001E-2,{"$f":"+Insumos!$G$182","v":17.98},{"$f":"TRUNC(D1031*E1031,2)","v":0.47}]
["SUB-TOTAL - MATERIAL / EQUIPAMENTOS:",null,{"$f":"SUM(F1028:F1031)","v":7.29}]
["SINAPI C 88310","PINTOR C/ENCARGOS COMPLEMENTARES","h",0.25,{"$f":"'Planilha_M.O.'!E25","v":21.7},{"$f":"TRUNC(D1033*E1033,2)","v":5.42}]
["SINAPI C 88316","SERVENTE C/ ENCARGOS COMPLEMENTARES","h",0.25,{"$f":"'Planilha_M.O.'!E18","v":17.11},{"$f":"TRUNC(D1034*E1034,2)","v":4.2699999999999996}]
["SUB-TOTAL - MÃO-DE-OBRA:",null,{"$f":"SUM(F1033:F1034)","v":9.69}]
[]
[null,"CUSTO TOTAL:",null,null,null,{"$f":"+C1032+C1035","v":16.98}]
[]
[null,"BDI:","%",{"$f":"+$F$7","v":"22,15%"},null,{"$f":"TRUNC(F1037*D1039,2)","v":3.76}]
[]
[null,"PREÇO:",null,null,null,{"$f":"+F1037+F1039","v":20.740000000000002}]
[]
["CÓDIGO","DISCRIMINAÇÃO","UN","COEFIC.","UNITÁRIO","TOTAL"]
[3600,"REPINTURA ESTRUTURA 1 - \"S\"","un"]
[{"$f":"CONCATENATE(\"SINAPI I \",Insumos!$B$182)","v":"SINAPI I 5318"},"SOLVENTE DILUENTE A BASE DE AGUARRÁS","l",0.8468,{"$f":"+Insumos!$G$182","v":17.98},{"$f":"TRUNC(D1045*E1045,2)","v":15.22}]
["SINAPI I 3768","LIXA P/FERRO","fl",2.4817,{"$f":"+Insumos!$G$119","v":3.37},{"$f":"TRUNC(D1046*E1046,2)","v":8.36}]
[{"$f":"CONCATENATE(\"SINAPI I \",Insumos!$B$204)","v":"SINAPI I 7292"},"TINTA ESMALTE SINTÉTICO BRILHANTE","l",4.8150000000000004,{"$f":"+Insumos!$G$204","v":27.61},{"$f":"TRUNC(D1047*E1047,2)","v":132.94}]
[{"$f":"CONCATENATE(\"COTAÇÃO \",Insumos!$B$108)","v":"COTAÇÃO 108"},"FUNDO P/GALVANIZADO","l",0.4637,{"$f":"+Insumos!$G$108","v":34.81},{"$f":"TRUNC(D1048*E1048,2)","v":16.14}]
["SUB-TOTAL - MATERIAL / EQUIPAMENTOS:",null,{"$f":"SUM(F1045:F1048)","v":172.65999999999997}]
["SINAPI C 88310","PINTOR C/ENCARGOS COMPLEMENTARES","h",3,{"$f":"'Planilha_M.O.'!E25","v":21.7},{"$f":"TRUNC(D1050*E1050,2)","v":65.099999999999994}]
["SINAPI C 88316","SERVENTE C/ ENCARGOS COMPLEMENTARES","h",3,{"$f":"'Planilha_M.O.'!E18","v":17.11},{"$f":"TRUNC(D1051*E1051,2)","v":51.33}]
["SUB-TOTAL - MÃO-DE-OBRA:",null,{"$f":"SUM(F1050:F1051)","v":116.42999999999999}]
[]
[null,"CUSTO TOTAL:",null,null,null,{"$f":"+C1049+C1052","v":289.08999999999997}]
[]
[null,"BDI:","%",{"$f":"+$F$7","v":"22,15%"},null,{"$f":"TRUNC(F1054*D1056,2)","v":64.03}]
[]
[null,"PREÇO:",null,null,null,{"$f":"+F1054+F1056","v":353.12}]
[]
["CÓDIGO","DISCRIMINAÇÃO","UN","COEFIC.","UNITÁRIO","TOTAL"]
[3605,"REPINTURA ESTRUTURA 2","un"]
[{"$f":"CONCATENATE(\"SINAPI I \",Insumos!$B$182)","v":"SINAPI I 5318"},"SOLVENTE DILUENTE A BASE DE AGUARRÁS","l",0.62380000000000002,{"$f":"+Insumos!$G$182","v":17.98},{"$f":"TRUNC(D1062*E1062,2)","v":11.21}]
["SINAPI I 3768","LIXA P/FERRO","fl",2.3241000000000001,{"$f":"+Insumos!$G$119","v":3.37},{"$f":"TRUNC(D1063*E1063,2)","v":7.83}]
[{"$f":"CONCATENATE(\"SINAPI I \",Insumos!$B$204)","v":"SINAPI I 7292"},"TINTA ESMALTE SINTÉTICO BRILHANTE","l",3.4796999999999998,{"$f":"+Insumos!$G$204","v":27.61},{"$f":"TRUNC(D1064*E1064,2)","v":96.07}]
[{"$f":"CONCATENATE(\"COTAÇÃO \",Insumos!$B$108)","v":"COTAÇÃO 108"},"FUNDO P/GALVANIZADO","l",0.39600000000000002,{"$f":"+Insumos!$G$108","v":34.81},{"$f":"TRUNC(D1065*E1065,2)","v":13.78}]
["SUB-TOTAL - MATERIAL / EQUIPAMENTOS:",null,{"$f":"SUM(F1062:F1065)","v":128.88999999999999}]
["SINAPI C 88310","PINTOR C/ENCARGOS COMPLEMENTARES","h",3,{"$f":"'Planilha_M.O.'!E25","v":21.7},{"$f":"TRUNC(D1067*E1067,2)","v":65.099999999999994}]
["SINAPI C 88316","SERVENTE C/ ENCARGOS COMPLEMENTARES","h",3,{"$f":"'Planilha_M.O.'!E18","v":17.11},{"$f":"TRUNC(D1068*E1068,2)","v":51.33}]
["SUB-TOTAL - MÃO-DE-OBRA:",null,{"$f":"SUM(F1067:F1068)","v":116.42999999999999}]
[]
[null,"CUSTO TOTAL:",null,null,null,{"$f":"+C1066+C1069","v":245.32}]
[]
[null,"BDI:","%",{"$f":"+$F$7","v":"22,15%"},null,{"$f":"TRUNC(F1071*D1073,2)","v":54.33}]
[]
[null,"PREÇO:",null,null,null,{"$f":"+F1071+F1073","v":299.64999999999998}]
[]
["CÓDIGO","DISCRIMINAÇÃO","UN","COEFIC.","UNITÁRIO","TOTAL"]
[3610,"REPINTURA ESTRUTURA 3","un"]
[{"$f":"CONCATENATE(\"SINAPI I \",Insumos!$B$182)","v":"SINAPI I 5318"},"SOLVENTE DILUENTE A BASE DE AGUARRÁS","l",0.51219999999999999,{"$f":"+Insumos!$G$182","v":17.98},{"$f":"TRUNC(D1079*E1079,2)","v":9.1999999999999993}]
["SINAPI I 3768","LIXA P/FERRO","fl",1.9051,{"$f":"+Insumos!$G$119","v":3.37},{"$f":"TRUNC(D1080*E1080,2)","v":6.42}]
[{"$f":"CONCATENATE(\"SINAPI I \",Insumos!$B$204)","v":"SINAPI I 7292"},"TINTA ESMALTE SINTÉTICO BRILHANTE","l",2.8582999999999998,{"$f":"+Insumos!$G$204","v":27.61},{"$f":"TRUNC(D1081*E1081,2)","v":78.91}]
[{"$f":"CONCATENATE(\"COTAÇÃO \",Insumos!$B$108)","v":"COTAÇÃO 108"},"FUNDO P/GALVANIZADO","l",0.32500000000000001,{"$f":"+Insumos!$G$108","v":34.81},{"$f":"TRUNC(D1082*E1082,2)","v":11.31}]
["SUB-TOTAL - MATERIAL / EQUIPAMENTOS:",null,{"$f":"SUM(F1079:F1082)","v":105.84}]
["SINAPI C 88310","PINTOR C/ENCARGOS COMPLEMENTARES","h",3,{"$f":"'Planilha_M.O.'!E25","v":21.7},{"$f":"TRUNC(D1084*E1084,2)","v":65.099999999999994}]
["SINAPI C 88316","SERVENTE C/ ENCARGOS COMPLEMENTARES","h",3,{"$f":"'Planilha_M.O.'!E18","v":17.11},{"$f":"TRUNC(D1085*E1085,2)","v":51.33}]
["SUB-TOTAL - MÃO-DE-OBRA:",null,{"$f":"SUM(F1084:F1085)","v":116.42999999999999}]
[]
[null,"CUSTO TOTAL:",null,null,null,{"$f":"+C1083+C1086","v":222.26999999999998}]
[]
[null,"BDI:","%",{"$f":"+$F$7","v":"22,15%"},null,{"$f":"TRUNC(F1088*D1090,2)","v":49.23}]
[]
[null,"PREÇO:",null,null,null,{"$f":"+F1088+F1090","v":271.5}]
[]
["CÓDIGO","DISCRIMINAÇÃO","UN","COEFIC.","UNITÁRIO","TOTAL"]
[3615,"REPINTURA ESTRUTURA 4","un"]
[{"$f":"CONCATENATE(\"SINAPI I \",Insumos!$B$182)","v":"SINAPI I 5318"},"SOLVENTE DILUENTE A BASE DE AGUARRÁS","l",1.944,{"$f":"+Insumos!$G$182","v":17.98},{"$f":"TRUNC(D1096*E1096,2)","v":34.950000000000003}]
["SINAPI I 3768","LIXA P/FERRO","fl",5.3783000000000003,{"$f":"+Insumos!$G$119","v":3.37},{"$f":"TRUNC(D1097*E1097,2)","v":18.12}]
[{"$f":"CONCATENATE(\"SINAPI I \",Insumos!$B$204)","v":"SINAPI I 7292"},"TINTA ESMALTE SINTÉTICO BRILHANTE","l",11.124000000000001,{"$f":"+Insumos!$G$204","v":27.61},{"$f":"TRUNC(D1098*E1098,2)","v":307.13}]
[{"$f":"CONCATENATE(\"COTAÇÃO \",Insumos!$B$108)","v":"COTAÇÃO 108"},"FUNDO P/GALVANIZADO","l",1.0305,{"$f":"+Insumos!$G$108","v":34.81},{"$f":"TRUNC(D1099*E1099,2)","v":35.869999999999997}]
["SUB-TOTAL - MATERIAL / EQUIPAMENTOS:",null,{"$f":"SUM(F1096:F1099)","v":396.07}]
["SINAPI C 88310","PINTOR C/ENCARGOS COMPLEMENTARES","h",3,{"$f":"'Planilha_M.O.'!E25","v":21.7},{"$f":"TRUNC(D1101*E1101,2)","v":65.099999999999994}]
["SINAPI C 88316","SERVENTE C/ ENCARGOS COMPLEMENTARES","h",3,{"$f":"'Planilha_M.O.'!E18","v":17.11},{"$f":"TRUNC(D1102*E1102,2)","v":51.33}]
["SUB-TOTAL - MÃO-DE-OBRA:",null,{"$f":"SUM(F1101:F1102)","v":116.42999999999999}]
[]
[null,"CUSTO TOTAL:",null,null,null,{"$f":"+C1100+C1103","v":512.5}]
[]
[null,"BDI:","%",{"$f":"+$F$7","v":"22,15%"},null,{"$f":"TRUNC(F1105*D1107,2)","v":113.51}]
[]
[null,"PREÇO:",null,null,null,{"$f":"+F1105+F1107","v":626.01}]
[]
["CÓDIGO","DISCRIMINAÇÃO","UN","COEFIC.","UNITÁRIO","TOTAL"]
[3620,"REPINTURA ESTRUTURA 5","un"]
[{"$f":"CONCATENATE(\"SINAPI I \",Insumos!$B$182)","v":"SINAPI I 5318"},"SOLVENTE DILUENTE A BASE DE AGUARRÁS","l",0.61350000000000005,{"$f":"+Insumos!$G$182","v":17.98},{"$f":"TRUNC(D1113*E1113,2)","v":11.03}]
["SINAPI I 3768","LIXA P/FERRO","fl",3.2645,{"$f":"+Insumos!$G$119","v":3.37},{"$f":"TRUNC(D1114*E1114,2)","v":11}]
[{"$f":"CONCATENATE(\"SINAPI I \",Insumos!$B$204)","v":"SINAPI I 7292"},"TINTA ESMALTE SINTÉTICO BRILHANTE","l",3.3984000000000001,{"$f":"+Insumos!$G$204","v":27.61},{"$f":"TRUNC(D1115*E1115,2)","v":93.82}]
[{"$f":"CONCATENATE(\"COTAÇÃO \",Insumos!$B$108)","v":"COTAÇÃO 108"},"FUNDO P/GALVANIZADO","l",0.50360000000000005,{"$f":"+Insumos!$G$108","v":34.81},{"$f":"TRUNC(D1116*E1116,2)","v":17.53}]
["SUB-TOTAL - MATERIAL / EQUIPAMENTOS:",null,{"$f":"SUM(F1113:F1116)","v":133.38}]
["SINAPI C 88310","PINTOR C/ENCARGOS COMPLEMENTARES","h",3,{"$f":"'Planilha_M.O.'!E25","v":21.7},{"$f":"TRUNC(D1118*E1118,2)","v":65.099999999999994}]
["SINAPI C 88316","SERVENTE C/ ENCARGOS COMPLEMENTARES","h",3,{"$f":"'Planilha_M.O.'!E18","v":17.11},{"$f":"TRUNC(D1119*E1119,2)","v":51.33}]
["SUB-TOTAL - MÃO-DE-OBRA:",null,{"$f":"SUM(F1118:F1119)","v":116.42999999999999}]
[]
[null,"CUSTO TOTAL:",null,null,null,{"$f":"+C1117+C1120","v":249.81}]
[]
[null,"BDI:","%",{"$f":"+$F$7","v":"22,15%"},null,{"$f":"TRUNC(F1122*D1124,2)","v":55.33}]
[]
[null,"PREÇO:",null,null,null,{"$f":"+F1122+F1124","v":305.14}]
[]
["CÓDIGO","DISCRIMINAÇÃO","UN","COEFIC.","UNITÁRIO","TOTAL"]
[3625,"REPINTURA ESTRUTURA 6","un"]
[{"$f":"CONCATENATE(\"SINAPI I \",Insumos!$B$182)","v":"SINAPI I 5318"},"SOLVENTE DILUENTE A BASE DE AGUARRÁS","l",2.2932000000000001,{"$f":"+Insumos!$G$182","v":17.98},{"$f":"TRUNC(D1130*E1130,2)","v":41.23}]
["SINAPI I 3768","LIXA P/FERRO","fl",7.4532999999999996,{"$f":"+Insumos!$G$119","v":3.37},{"$f":"TRUNC(D1131*E1131,2)","v":25.11}]
[{"$f":"CONCATENATE(\"SINAPI I \",Insumos!$B$204)","v":"SINAPI I 7292"},"TINTA ESMALTE SINTÉTICO BRILHANTE","l",12.700799999999999,{"$f":"+Insumos!$G$204","v":27.61},{"$f":"TRUNC(D1132*E1132,2)","v":350.66}]
[{"$f":"CONCATENATE(\"COTAÇÃO \",Insumos!$B$108)","v":"COTAÇÃO 108"},"FUNDO P/GALVANIZADO","l",1.7771999999999999,{"$f":"+Insumos!$G$108","v":34.81},{"$f":"TRUNC(D1133*E1133,2)","v":61.86}]
["SUB-TOTAL - MATERIAL / EQUIPAMENTOS:",null,{"$f":"SUM(F1130:F1133)","v":478.86}]
["SINAPI C 88310","PINTOR C/ENCARGOS COMPLEMENTARES","h",3,{"$f":"'Planilha_M.O.'!E25","v":21.7},{"$f":"TRUNC(D1135*E1135,2)","v":65.099999999999994}]
["SINAPI C 88316","SERVENTE C/ ENCARGOS COMPLEMENTARES","h",3,{"$f":"'Planilha_M.O.'!E18","v":17.11},{"$f":"TRUNC(D1136*E1136,2)","v":51.33}]
["SUB-TOTAL - MÃO-DE-OBRA:",null,{"$f":"SUM(F1135:F1136)","v":116.42999999999999}]
[]
[null,"CUSTO TOTAL:",null,null,null,{"$f":"+C1134+C1137","v":595.29}]
[]
[null,"BDI:","%",{"$f":"+$F$7","v":"22,15%"},null,{"$f":"TRUNC(F1139*D1141,2)","v":131.85}]
[]
[null,"PREÇO:",null,null,null,{"$f":"+F1139+F1141","v":727.14}]
[]
["CÓDIGO","DISCRIMINAÇÃO","UN","COEFIC.","UNITÁRIO","TOTAL"]
[3630,"REPINTURA ESTRUTURA 7","un"]
[{"$f":"CONCATENATE(\"SINAPI I \",Insumos!$B$182)","v":"SINAPI I 5318"},"SOLVENTE DILUENTE A BASE DE AGUARRÁS","l",0.38900000000000001,{"$f":"+Insumos!$G$182","v":17.98},{"$f":"TRUNC(D1147*E1147,2)","v":6.99}]
["SINAPI I 3768","LIXA P/FERRO","fl",3.9903,{"$f":"+Insumos!$G$119","v":3.37},{"$f":"TRUNC(D1148*E1148,2)","v":13.44}]
[{"$f":"CONCATENATE(\"SINAPI I \",Insumos!$B$204)","v":"SINAPI I 7292"},"TINTA ESMALTE SINTÉTICO BRILHANTE","l",2.2122000000000002,{"$f":"+Insumos!$G$204","v":27.61},{"$f":"TRUNC(D1149*E1149,2)","v":61.07}]
[{"$f":"CONCATENATE(\"COTAÇÃO \",Insumos!$B$108)","v":"COTAÇÃO 108"},"FUNDO P/GALVANIZADO","l",0.23519999999999999,{"$f":"+Insumos!$G$108","v":34.81},{"$f":"TRUNC(D1150*E1150,2)","v":8.18}]
["SUB-TOTAL - MATERIAL / EQUIPAMENTOS:",null,{"$f":"SUM(F1147:F1150)","v":89.68}]
["SINAPI C 88310","PINTOR C/ENCARGOS COMPLEMENTARES","h",3,{"$f":"'Planilha_M.O.'!E25","v":21.7},{"$f":"TRUNC(D1152*E1152,2)","v":65.099999999999994}]
["SINAPI C 88316","SERVENTE C/ ENCARGOS COMPLEMENTARES","h",3,{"$f":"'Planilha_M.O.'!E18","v":17.11},{"$f":"TRUNC(D1153*E1153,2)","v":51.33}]
["SUB-TOTAL - MÃO-DE-OBRA:",null,{"$f":"SUM(F1152:F1153)","v":116.42999999999999}]
[]
[null,"CUSTO TOTAL:",null,null,null,{"$f":"+C1151+C1154","v":206.11}]
[]
[null,"BDI:","%",{"$f":"+$F$7","v":"22,15%"},null,{"$f":"TRUNC(F1156*D1158,2)","v":45.65}]
[]
[null,"PREÇO:",null,null,null,{"$f":"+F1156+F1158","v":251.76000000000002}]
[]
["CÓDIGO","DISCRIMINAÇÃO","UN","COEFIC.","UNITÁRIO","TOTAL"]
[3635,"REPINTURA ESTRUTURA 8","un"]
[{"$f":"CONCATENATE(\"SINAPI I \",Insumos!$B$182)","v":"SINAPI I 5318"},"SOLVENTE DILUENTE A BASE DE AGUARRÁS","l",2.3130000000000002,{"$f":"+Insumos!$G$182","v":17.98},{"$f":"TRUNC(D1164*E1164,2)","v":41.58}]
["SINAPI I 3768","LIXA P/FERRO","fl",7.6963999999999997,{"$f":"+Insumos!$G$119","v":3.37},{"$f":"TRUNC(D1165*E1165,2)","v":25.93}]
[{"$f":"CONCATENATE(\"SINAPI I \",Insumos!$B$204)","v":"SINAPI I 7292"},"TINTA ESMALTE SINTÉTICO BRILHANTE","l",13.037699999999999,{"$f":"+Insumos!$G$204","v":27.61},{"$f":"TRUNC(D1166*E1166,2)","v":359.97}]
[{"$f":"CONCATENATE(\"COTAÇÃO \",Insumos!$B$108)","v":"COTAÇÃO 108"},"FUNDO P/GALVANIZADO","l",1.3677999999999999,{"$f":"+Insumos!$G$108","v":34.81},{"$f":"TRUNC(D1167*E1167,2)","v":47.61}]
["SUB-TOTAL - MATERIAL / EQUIPAMENTOS:",null,{"$f":"SUM(F1164:F1167)","v":475.09000000000003}]
["SINAPI C 88310","PINTOR C/ENCARGOS COMPLEMENTARES","h",3,{"$f":"'Planilha_M.O.'!E25","v":21.7},{"$f":"TRUNC(D1169*E1169,2)","v":65.099999999999994}]
["SINAPI C 88316","SERVENTE C/ ENCARGOS COMPLEMENTARES","h",3,{"$f":"'Planilha_M.O.'!E18","v":17.11},{"$f":"TRUNC(D1170*E1170,2)","v":51.33}]
["SUB-TOTAL - MÃO-DE-OBRA:",null,{"$f":"SUM(F1169:F1170)","v":116.42999999999999}]
[]
[null,"CUSTO TOTAL:",null,null,null,{"$f":"+C1168+C1171","v":591.52}]
[]
[null,"BDI:","%",{"$f":"+$F$7","v":"22,15%"},null,{"$f":"TRUNC(F1173*D1175,2)","v":131.02000000000001}]
[]
[null,"PREÇO:",null,null,null,{"$f":"+F1173+F1175","v":722.54}]
[]
["CÓDIGO","DISCRIMINAÇÃO","UN","COEFIC.","UNITÁRIO","TOTAL"]
[3640,"REPINTURA ESTRUTURA 9","un"]
[{"$f":"CONCATENATE(\"SINAPI I \",Insumos!$B$182)","v":"SINAPI I 5318"},"SOLVENTE DILUENTE A BASE DE AGUARRÁS","l",0.56120000000000003,{"$f":"+Insumos!$G$182","v":17.98},{"$f":"TRUNC(D1181*E1181,2)","v":10.09}]
["SINAPI I 3768","LIXA P/FERRO","fl",2.1983999999999999,{"$f":"+Insumos!$G$119","v":3.37},{"$f":"TRUNC(D1182*E1182,2)","v":7.4}]
[{"$f":"CONCATENATE(\"SINAPI I \",Insumos!$B$204)","v":"SINAPI I 7292"},"TINTA ESMALTE SINTÉTICO BRILHANTE","l",3.1663999999999999,{"$f":"+Insumos!$G$204","v":27.61},{"$f":"TRUNC(D1183*E1183,2)","v":87.42}]
[{"$f":"CONCATENATE(\"COTAÇÃO \",Insumos!$B$108)","v":"COTAÇÃO 108"},"FUNDO P/GALVANIZADO","l",0.37319999999999998,{"$f":"+Insumos!$G$108","v":34.81},{"$f":"TRUNC(D1184*E1184,2)","v":12.99}]
["SUB-TOTAL - MATERIAL / EQUIPAMENTOS:",null,{"$f":"SUM(F1181:F1184)","v":117.89999999999999}]
["SINAPI C 88310","PINTOR C/ENCARGOS COMPLEMENTARES","h",3,{"$f":"'Planilha_M.O.'!E25","v":21.7},{"$f":"TRUNC(D1186*E1186,2)","v":65.099999999999994}]
["SINAPI C 88316","SERVENTE C/ ENCARGOS COMPLEMENTARES","h",3,{"$f":"'Planilha_M.O.'!E18","v":17.11},{"$f":"TRUNC(D1187*E1187,2)","v":51.33}]
["SUB-TOTAL - MÃO-DE-OBRA:",null,{"$f":"SUM(F1186:F1187)","v":116.42999999999999}]
[]
[null,"CUSTO TOTAL:",null,null,null,{"$f":"+C1185+C1188","v":234.32999999999998}]
[]
[null,"BDI:","%",{"$f":"+$F$7","v":"22,15%"},null,{"$f":"TRUNC(F1190*D1192,2)","v":51.9}]
[]
[null,"PREÇO:",null,null,null,{"$f":"+F1190+F1192","v":286.22999999999996}]
[]
["CÓDIGO","DISCRIMINAÇÃO","UN","COEFIC.","UNITÁRIO","TOTAL"]
[3645,"REPINTURA ESTRUTURA 10","un"]
[{"$f":"CONCATENATE(\"SINAPI I \",Insumos!$B$182)","v":"SINAPI I 5318"},"SOLVENTE DILUENTE A BASE DE AGUARRÁS","l",5.3968999999999996,{"$f":"+Insumos!$G$182","v":17.98},{"$f":"TRUNC(D1198*E1198,2)","v":97.03}]
["SINAPI I 3768","LIXA P/FERRO","fl",25.750399999999999,{"$f":"+Insumos!$G$119","v":3.37},{"$f":"TRUNC(D1199*E1199,2)","v":86.77}]
[{"$f":"CONCATENATE(\"SINAPI I \",Insumos!$B$204)","v":"SINAPI I 7292"},"TINTA ESMALTE SINTÉTICO BRILHANTE","l",30.372699999999998,{"$f":"+Insumos!$G$204","v":27.61},{"$f":"TRUNC(D1200*E1200,2)","v":838.59}]
[{"$f":"CONCATENATE(\"COTAÇÃO \",Insumos!$B$108)","v":"COTAÇÃO 108"},"FUNDO P/GALVANIZADO","l",4.1093999999999999,{"$f":"+Insumos!$G$108","v":34.81},{"$f":"TRUNC(D1201*E1201,2)","v":143.04}]
["SUB-TOTAL - MATERIAL / EQUIPAMENTOS:",null,{"$f":"SUM(F1198:F1201)","v":1165.43}]
["SINAPI C 88310","PINTOR C/ENCARGOS COMPLEMENTARES","h",3,{"$f":"'Planilha_M.O.'!E25","v":21.7},{"$f":"TRUNC(D1203*E1203,2)","v":65.099999999999994}]
["SINAPI C 88316","SERVENTE C/ ENCARGOS COMPLEMENTARES","h",3,{"$f":"'Planilha_M.O.'!E18","v":17.11},{"$f":"TRUNC(D1204*E1204,2)","v":51.33}]
["SUB-TOTAL - MÃO-DE-OBRA:",null,{"$f":"SUM(F1203:F1204)","v":116.42999999999999}]
[]
[null,"CUSTO TOTAL:",null,null,null,{"$f":"+C1202+C1205","v":1281.8600000000001}]
[]
[null,"BDI:","%",{"$f":"+$F$7","v":"22,15%"},null,{"$f":"TRUNC(F1207*D1209,2)","v":283.93}]
[]
[null,"PREÇO:",null,null,null,{"$f":"+F1207+F1209","v":1565.7900000000002}]
[]
["CÓDIGO","DISCRIMINAÇÃO","UN","COEFIC.","UNITÁRIO","TOTAL"]
[3650,"REPINTURA GANGORRA DUPLA","un"]
["SINAPI I 3767","LIXA P/MADEIRA","fl",3.3018000000000001,{"$f":"+Insumos!$G$120","v":0.79},{"$f":"TRUNC(D1215*E1215,2)","v":2.6}]
["SINAPI I 3768","LIXA P/FERRO","fl",0.81410000000000005,{"$f":"+Insumos!$G$119","v":3.37},2.74]
[{"$f":"CONCATENATE(\"COTAÇÃO \",Insumos!$B$108)","v":"COTAÇÃO 108"},"FUNDO P/GALVANIZADO","l",7.0499999999999993E-2,{"$f":"+Insumos!$G$108","v":34.81},2.4500000000000002]
["SINAPI I 7307","FUNDO ANTICORROSIVO TIPO ZARCÃO","l",3.4200000000000001E-2,{"$f":"+Insumos!$G$107","v":29.63},1.01]
[{"$f":"CONCATENATE(\"SINAPI I \",Insumos!$B$204)","v":"SINAPI I 7292"},"TINTA ESMALTE SINTÉTICO BRILHANTE","l",1.2685,{"$f":"+Insumos!$G$204","v":27.61},35.020000000000003]
[{"$f":"CONCATENATE(\"SINAPI I \",Insumos!$B$182)","v":"SINAPI I 5318"},"SOLVENTE DILUENTE A BASE DE AGUARRÁS","l",0.2077,{"$f":"+Insumos!$G$182","v":17.98},3.73]
["SINAPI 6086","FUNDO SINTÉTICO NIVELADOR BRANCO FOSCO","l",0.66039999999999999,{"$f":"+Insumos!$G$109","v":90.88},60.01]
["SUB-TOTAL - MATERIAL / EQUIPAMENTOS:",null,{"$f":"SUM(F1215:F1221)","v":107.56}]
["SINAPI C 88310","PINTOR C/ENCARGOS COMPLEMENTARES","h",2,{"$f":"'Planilha_M.O.'!E25","v":21.7},{"$f":"TRUNC(D1223*E1223,2)","v":43.4}]
["SINAPI C 88316","SERVENTE C/ ENCARGOS COMPLEMENTARES","h",2,{"$f":"'Planilha_M.O.'!E18","v":17.11},{"$f":"TRUNC(D1224*E1224,2)","v":34.22}]
["SUB-TOTAL - MÃO-DE-OBRA:",null,{"$f":"SUM(F1223:F1224)","v":77.62}]
[]
[null,"CUSTO TOTAL:",null,null,null,{"$f":"+C1222+C1225","v":185.18}]
[]
[null,"BDI:","%",{"$f":"+$F$7","v":"22,15%"},null,{"$f":"TRUNC(F1227*D1229,2)","v":41.01}]
[]
[null,"PREÇO:",null,null,null,{"$f":"+F1227+F1229","v":226.19}]
[]
["CÓDIGO","DISCRIMINAÇÃO","UN","COEFIC.","UNITÁRIO","TOTAL"]
[3655,"REPINTURA GANGORRA TRIPLA","un"]
["SINAPI I 3767","LIXA P/MADEIRA","fl",5.9340999999999999,{"$f":"+Insumos!$G$120","v":0.79},{"$f":"TRUNC(D1235*E1235,2)","v":4.68}]
["SINAPI I 3768","LIXA P/FERRO","fl",0.98140000000000005,{"$f":"+Insumos!$G$119","v":3.37},3.3]
[{"$f":"CONCATENATE(\"COTAÇÃO \",Insumos!$B$108)","v":"COTAÇÃO 108"},"FUNDO P/GALVANIZADO","l",8.9599999999999999E-2,{"$f":"+Insumos!$G$108","v":34.81},3.11]
["SINAPI I 7307","FUNDO ANTICORROSIVO TIPO ZARCÃO","l",5.1200000000000002E-2,{"$f":"+Insumos!$G$107","v":29.63},1.51]
[{"$f":"CONCATENATE(\"SINAPI I \",Insumos!$B$204)","v":"SINAPI I 7292"},"TINTA ESMALTE SINTÉTICO BRILHANTE","l",2.0076999999999998,{"$f":"+Insumos!$G$204","v":27.61},55.43]
[{"$f":"CONCATENATE(\"SINAPI I \",Insumos!$B$182)","v":"SINAPI I 5318"},"SOLVENTE DILUENTE A BASE DE AGUARRÁS","l",0.3246,{"$f":"+Insumos!$G$182","v":17.98},5.83]
["SINAPI 6086","FUNDO SINTÉTICO NIVELADOR BRANCO FOSCO","l",1.1868000000000001,{"$f":"+Insumos!$G$109","v":90.88},107.85]
["SUB-TOTAL - MATERIAL / EQUIPAMENTOS:",null,{"$f":"SUM(F1235:F1241)","v":181.70999999999998}]
["SINAPI C 88310","PINTOR C/ENCARGOS COMPLEMENTARES","h",2.2000000000000002,{"$f":"'Planilha_M.O.'!E25","v":21.7},{"$f":"TRUNC(D1243*E1243,2)","v":47.74}]
["SINAPI C 88316","SERVENTE C/ ENCARGOS COMPLEMENTARES","h",2.2000000000000002,{"$f":"'Planilha_M.O.'!E18","v":17.11},{"$f":"TRUNC(D1244*E1244,2)","v":37.64}]
["SUB-TOTAL - MÃO-DE-OBRA:",null,{"$f":"SUM(F1243:F1244)","v":85.38}]
[]
[null,"CUSTO TOTAL:",null,null,null,{"$f":"+C1242+C1245","v":267.08999999999997}]
[]
[null,"BDI:","%",{"$f":"+$F$7","v":"22,15%"},null,{"$f":"TRUNC(F1247*D1249,2)","v":59.16}]
[]
[null,"PREÇO:",null,null,null,{"$f":"+F1247+F1249","v":326.25}]
[]
["CÓDIGO","DISCRIMINAÇÃO","UN","COEFIC.","UNITÁRIO","TOTAL"]
[3660,"REPINTURA BARRA-BALANÇO","un"]
["SINAPI I 3767","LIXA P/MADEIRA","fl",2.9234,{"$f":"+Insumos!$G$120","v":0.79},{"$f":"TRUNC(D1255*E1255,2)","v":2.2999999999999998}]
["SINAPI I 3768","LIXA P/FERRO","fl",3.5988000000000002,{"$f":"+Insumos!$G$119","v":3.37},12.12]
[{"$f":"CONCATENATE(\"COTAÇÃO \",Insumos!$B$108)","v":"COTAÇÃO 108"},"FUNDO P/GALVANIZADO","l",0.50280000000000002,{"$f":"+Insumos!$G$108","v":34.81},17.5]
["SINAPI I 7307","FUNDO ANTICORROSIVO TIPO ZARCÃO","l",8.3400000000000002E-2,{"$f":"+Insumos!$G$107","v":29.63},2.4700000000000002]
[{"$f":"CONCATENATE(\"SINAPI I \",Insumos!$B$204)","v":"SINAPI I 7292"},"TINTA ESMALTE SINTÉTICO BRILHANTE","l",5.2702999999999998,{"$f":"+Insumos!$G$204","v":27.61},145.51]
[{"$f":"CONCATENATE(\"SINAPI I \",Insumos!$B$182)","v":"SINAPI I 5318"},"SOLVENTE DILUENTE A BASE DE AGUARRÁS","l",0.92979999999999996,{"$f":"+Insumos!$G$182","v":17.98},16.71]
["SINAPI 6086","FUNDO SINTÉTICO NIVELADOR BRANCO FOSCO","l",0.5847,{"$f":"+Insumos!$G$109","v":90.88},53.13]
["SUB-TOTAL - MATERIAL / EQUIPAMENTOS:",null,{"$f":"SUM(F1255:F1261)","v":249.73999999999998}]
["SINAPI C 88310","PINTOR C/ENCARGOS COMPLEMENTARES","h",3.6,{"$f":"'Planilha_M.O.'!E25","v":21.7},{"$f":"TRUNC(D1263*E1263,2)","v":78.12}]
["SINAPI C 88316","SERVENTE C/ ENCARGOS COMPLEMENTARES","h",3.6,{"$f":"'Planilha_M.O.'!E18","v":17.11},{"$f":"TRUNC(D1264*E1264,2)","v":61.59}]
["SUB-TOTAL - MÃO-DE-OBRA:",null,{"$f":"SUM(F1263:F1264)","v":139.71}]
[]
[null,"CUSTO TOTAL:",null,null,null,{"$f":"+C1262+C1265","v":389.45}]
[]
[null,"BDI:","%",{"$f":"+$F$7","v":"22,15%"},null,{"$f":"TRUNC(F1267*D1269,2)","v":86.26}]
[]
[null,"PREÇO:",null,null,null,{"$f":"+F1267+F1269","v":475.71}]
[]
["CÓDIGO","DISCRIMINAÇÃO","UN","COEFIC.","UNITÁRIO","TOTAL"]
[3665,"REPINTURA BALANÇO MISTO","un"]
["SINAPI I 3767","LIXA P/MADEIRA","fl",1.663,{"$f":"+Insumos!$G$120","v":0.79},{"$f":"TRUNC(D1275*E1275,2)","v":1.31}]
["SINAPI I 3768","LIXA P/FERRO","fl",4.2462,{"$f":"+Insumos!$G$119","v":3.37},14.3]
[{"$f":"CONCATENATE(\"COTAÇÃO \",Insumos!$B$108)","v":"COTAÇÃO 108"},"FUNDO P/GALVANIZADO","l",0.50860000000000005,{"$f":"+Insumos!$G$108","v":34.81},17.7]
["SINAPI I 7307","FUNDO ANTICORROSIVO TIPO ZARCÃO","l",0.1782,{"$f":"+Insumos!$G$107","v":29.63},5.28]
[{"$f":"CONCATENATE(\"SINAPI I \",Insumos!$B$204)","v":"SINAPI I 7292"},"TINTA ESMALTE SINTÉTICO BRILHANTE","l",5.7000999999999999,{"$f":"+Insumos!$G$204","v":27.61},157.37]
[{"$f":"CONCATENATE(\"SINAPI I \",Insumos!$B$182)","v":"SINAPI I 5318"},"SOLVENTE DILUENTE A BASE DE AGUARRÁS","l",1.0098,{"$f":"+Insumos!$G$182","v":17.98},18.149999999999999]
["SINAPI 6086","FUNDO SINTÉTICO NIVELADOR BRANCO FOSCO","l",0.33260000000000001,{"$f":"+Insumos!$G$109","v":90.88},30.22]
["SUB-TOTAL - MATERIAL / EQUIPAMENTOS:",null,{"$f":"SUM(F1275:F1281)","v":244.33}]
["SINAPI C 88310","PINTOR C/ENCARGOS COMPLEMENTARES","h",3.5,{"$f":"'Planilha_M.O.'!E25","v":21.7},{"$f":"TRUNC(D1283*E1283,2)","v":75.95}]
["SINAPI C 88316","SERVENTE C/ ENCARGOS COMPLEMENTARES","h",3.5,{"$f":"'Planilha_M.O.'!E18","v":17.11},{"$f":"TRUNC(D1284*E1284,2)","v":59.88}]
["SUB-TOTAL - MÃO-DE-OBRA:",null,{"$f":"SUM(F1283:F1284)","v":135.83000000000001}]
[]
[null,"CUSTO TOTAL:",null,null,null,{"$f":"+C1282+C1285","v":380.16}]
[]
[null,"BDI:","%",{"$f":"+$F$7","v":"22,15%"},null,{"$f":"TRUNC(F1287*D1289,2)","v":84.2}]
[]
[null,"PREÇO:",null,null,null,{"$f":"+F1287+F1289","v":464.36}]
[]
["CÓDIGO","DISCRIMINAÇÃO","UN","COEFIC.","UNITÁRIO","TOTAL"]
[3670,"REPINTURA BALANÇO JUVENIL","un"]
["SINAPI I 3767","LIXA P/MADEIRA","fl",0.63400000000000001,{"$f":"+Insumos!$G$120","v":0.79},{"$f":"TRUNC(D1295*E1295,2)","v":0.5}]
["SINAPI I 3768","LIXA P/FERRO","fl",4.1108000000000002,{"$f":"+Insumos!$G$119","v":3.37},13.85]
[{"$f":"CONCATENATE(\"COTAÇÃO \",Insumos!$B$108)","v":"COTAÇÃO 108"},"FUNDO P/GALVANIZADO","l",0.50860000000000005,{"$f":"+Insumos!$G$108","v":34.81},17.7]
["SINAPI I 7307","FUNDO ANTICORROSIVO TIPO ZARCÃO","l",0.1421,{"$f":"+Insumos!$G$107","v":29.63},4.21]
[{"$f":"CONCATENATE(\"SINAPI I \",Insumos!$B$204)","v":"SINAPI I 7292"},"TINTA ESMALTE SINTÉTICO BRILHANTE","l",4.9104999999999999,{"$f":"+Insumos!$G$204","v":27.61},135.57]
[{"$f":"CONCATENATE(\"SINAPI I \",Insumos!$B$182)","v":"SINAPI I 5318"},"SOLVENTE DILUENTE A BASE DE AGUARRÁS","l",0.877,{"$f":"+Insumos!$G$182","v":17.98},15.76]
["SINAPI 6086","FUNDO SINTÉTICO NIVELADOR BRANCO FOSCO","l",0.1268,{"$f":"+Insumos!$G$109","v":90.88},11.52]
["SUB-TOTAL - MATERIAL / EQUIPAMENTOS:",null,{"$f":"SUM(F1295:F1301)","v":199.10999999999999}]
["SINAPI C 88310","PINTOR C/ENCARGOS COMPLEMENTARES","h",3,{"$f":"'Planilha_M.O.'!E25","v":21.7},{"$f":"TRUNC(D1303*E1303,2)","v":65.099999999999994}]
["SINAPI C 88316","SERVENTE C/ ENCARGOS COMPLEMENTARES","h",3,{"$f":"'Planilha_M.O.'!E18","v":17.11},{"$f":"TRUNC(D1304*E1304,2)","v":51.33}]
["SUB-TOTAL - MÃO-DE-OBRA:",null,{"$f":"SUM(F1303:F1304)","v":116.42999999999999}]
[]
[null,"CUSTO TOTAL:",null,null,null,{"$f":"+C1302+C1305","v":315.53999999999996}]
[]
[null,"BDI:","%",{"$f":"+$F$7","v":"22,15%"},null,{"$f":"TRUNC(F1307*D1309,2)","v":69.89}]
[]
[null,"PREÇO:",null,null,null,{"$f":"+F1307+F1309","v":385.42999999999995}]
[]
["CÓDIGO","DISCRIMINAÇÃO","UN","COEFIC.","UNITÁRIO","TOTAL"]
[3675,"REPINTURA BALANÇO INFANTIL","un"]
["SINAPI I 3767","LIXA P/MADEIRA","fl",2.6920000000000002,{"$f":"+Insumos!$G$120","v":0.79},{"$f":"TRUNC(D1315*E1315,2)","v":2.12}]
["SINAPI I 3768","LIXA P/FERRO","fl",4.3815999999999997,{"$f":"+Insumos!$G$119","v":3.37},14.76]
[{"$f":"CONCATENATE(\"COTAÇÃO \",Insumos!$B$108)","v":"COTAÇÃO 108"},"FUNDO P/GALVANIZADO","l",0.50860000000000005,{"$f":"+Insumos!$G$108","v":34.81},17.7]
["SINAPI I 7307","FUNDO ANTICORROSIVO TIPO ZARCÃO","l",0.2142,{"$f":"+Insumos!$G$107","v":29.63},6.34]
[{"$f":"CONCATENATE(\"SINAPI I \",Insumos!$B$204)","v":"SINAPI I 7292"},"TINTA ESMALTE SINTÉTICO BRILHANTE","l",6.4897,{"$f":"+Insumos!$G$204","v":27.61},179.18]
[{"$f":"CONCATENATE(\"SINAPI I \",Insumos!$B$182)","v":"SINAPI I 5318"},"SOLVENTE DILUENTE A BASE DE AGUARRÁS","l",1.1425000000000001,{"$f":"+Insumos!$G$182","v":17.98},20.54]
["SINAPI 6086","FUNDO SINTÉTICO NIVELADOR BRANCO FOSCO","l",0.53839999999999999,{"$f":"+Insumos!$G$109","v":90.88},48.92]
["SUB-TOTAL - MATERIAL / EQUIPAMENTOS:",null,{"$f":"SUM(F1315:F1321)","v":289.56}]
["SINAPI C 88310","PINTOR C/ENCARGOS COMPLEMENTARES","h",4,{"$f":"'Planilha_M.O.'!E25","v":21.7},{"$f":"TRUNC(D1323*E1323,2)","v":86.8}]
["SINAPI C 88316","SERVENTE C/ ENCARGOS COMPLEMENTARES","h",4,{"$f":"'Planilha_M.O.'!E18","v":17.11},{"$f":"TRUNC(D1324*E1324,2)","v":68.44}]
["SUB-TOTAL - MÃO-DE-OBRA:",null,{"$f":"SUM(F1323:F1324)","v":155.24}]
[]
[null,"CUSTO TOTAL:",null,null,null,{"$f":"+C1322+C1325","v":444.8}]
[]
[null,"BDI:","%",{"$f":"+$F$7","v":"22,15%"},null,{"$f":"TRUNC(F1327*D1329,2)","v":98.52}]
[]
[null,"PREÇO:",null,null,null,{"$f":"+F1327+F1329","v":543.32000000000005}]
[]
["CÓDIGO","DISCRIMINAÇÃO","UN","COEFIC.","UNITÁRIO","TOTAL"]
[3680,"REPINTURA ESCORREGADOR","un"]
["SINAPI I 3767","LIXA P/MADEIRA","fl",7.1513,{"$f":"+Insumos!$G$120","v":0.79},{"$f":"TRUNC(D1335*E1335,2)","v":5.64}]
["SINAPI I 3768","LIXA P/FERRO","fl",0.53459999999999996,{"$f":"+Insumos!$G$119","v":3.37},1.8]
["SINAPI I 7307","FUNDO ANTICORROSIVO TIPO ZARCÃO","l",7.8E-2,{"$f":"+Insumos!$G$107","v":29.63},2.31]
[{"$f":"CONCATENATE(\"SINAPI I \",Insumos!$B$204)","v":"SINAPI I 7292"},"TINTA ESMALTE SINTÉTICO BRILHANTE","l",2.1673,{"$f":"+Insumos!$G$204","v":27.61},59.83]
[{"$f":"CONCATENATE(\"SINAPI I \",Insumos!$B$182)","v":"SINAPI I 5318"},"SOLVENTE DILUENTE A BASE DE AGUARRÁS","l",0.34320000000000001,{"$f":"+Insumos!$G$182","v":17.98},6.17]
["SINAPI 6086","FUNDO SINTÉTICO NIVELADOR BRANCO FOSCO","l",1.4302999999999999,{"$f":"+Insumos!$G$109","v":90.88},129.97999999999999]
["SUB-TOTAL - MATERIAL / EQUIPAMENTOS:",null,{"$f":"SUM(F1335:F1340)","v":205.73}]
["SINAPI C 88310","PINTOR C/ENCARGOS COMPLEMENTARES","h",3.69,{"$f":"'Planilha_M.O.'!E25","v":21.7},{"$f":"TRUNC(D1342*E1342,2)","v":80.069999999999993}]
["SINAPI C 88316","SERVENTE C/ ENCARGOS COMPLEMENTARES","h",3.69,{"$f":"'Planilha_M.O.'!E18","v":17.11},{"$f":"TRUNC(D1343*E1343,2)","v":63.13}]
["SUB-TOTAL - MÃO-DE-OBRA:",null,{"$f":"SUM(F1342:F1343)","v":143.19999999999999}]
[]
[null,"CUSTO TOTAL:",null,null,null,{"$f":"+C1341+C1344","v":348.92999999999995}]
[]
[null,"BDI:","%",{"$f":"+$F$7","v":"22,15%"},null,{"$f":"TRUNC(F1346*D1348,2)","v":77.28}]
[]
[null,"PREÇO:",null,null,null,{"$f":"+F1346+F1348","v":426.20999999999992}]
[]
["CÓDIGO","DISCRIMINAÇÃO","UN","QUANT.","UNITÁRIO","TOTAL"]
["SINAPI C 88489","APLICAÇÃO MANUAL DE PINTURA COM TINTA LÁTEX PVA EM PAREDES, DUAS DEMÃOS.","m²"]
["SINAPI I 7356","TINTA ACRILICA PREMIUM, COR BRANCO FOSCO","l",0.33,24.41,{"$f":"TRUNC((D1354*E1354),2)","v":8.0500000000000007}]
["SUB-TOTAL - MATERIAL / EQUIPAMENTOS:",null,{"$f":"SUM(F1354:F1354)","v":8.0500000000000007}]
["SINAPI C 88310","PINTOR COM ENCARGOS COMPLEMENTARES","h",0.187,{"$f":"'Planilha_M.O.'!E25","v":21.7},{"$f":"TRUNC((D1356*E1356),2)","v":4.05}]
["SINAPI C 88316","SERVENTE C/ ENCARGOS COMPLEMENTARES","h",6.9000000000000006E-2,{"$f":"'Planilha_M.O.'!E18","v":17.11},{"$f":"TRUNC((D1357*E1357),2)","v":1.18}]
["SUB-TOTAL - MÃO-DE-OBRA:",null,{"$f":"SUM(F1356:F1357)","v":5.2299999999999995}]
[]
[null,"CUSTO TOTAL:",null,null,null,{"$f":"+C1355+C1358","v":13.280000000000001}]
[]
[null,"BDI:","%",{"$f":"+$F$7","v":"22,15%"},null,{"$f":"TRUNC((F1360*D1362),2)","v":2.94}]
[]
[null,"PREÇO:",null,null,null,{"$f":"+C1355+F1362+C1358","v":16.22}]
[]
["CÓDIGO","DISCRIMINAÇÃO","UN","COEFIC.","UNITÁRIO","TOTAL"]
[3680,"REPINTURA DE BARRAS PARALELAS TORAS ROLIÇAS","un"]
["SINAPI I 10478","VERNIZ POLIURETANO BRILHANTE PARA MADEIRA, COM FILTRO SOLAR, USO INTERNO E EXTERNO","l",3.6,{"$f":"Insumos!G225","v":30.97},{"$f":"TRUNC(D1368*E1368,2)","v":111.49}]
["SINAPI I 5318","SOLVENTE DILUENTE A BASE DE AGUARRÁS","l",0.36919999999999997,{"$f":"Insumos!G182","v":17.98},{"$f":"TRUNC(D1369*E1369,2)","v":6.63}]
["SINAPI I 006086","FUNDO SINTETICO NIVELADOR BRANCO FOSCO PARA MADEIRA","l",0.2712,{"$f":"Insumos!G109","v":90.88},{"$f":"TRUNC(D1370*E1370,2)","v":24.64}]
["SUB-TOTAL - MATERIAL / EQUIPAMENTOS:",null,{"$f":"SUM(F1368:F1370)","v":142.76}]
["SINAPI C 88310","PINTOR C/ENCARGOS COMPLEMENTARES","h",2,{"$f":"'Planilha_M.O.'!E25","v":21.7},{"$f":"TRUNC(D1372*E1372,2)","v":43.4}]
["SUB-TOTAL - MÃO-DE-OBRA:",null,{"$f":"SUM(F1372:F1372)","v":43.4}]
[]
[null,"CUSTO TOTAL:",null,null,null,{"$f":"+C1371+C1373","v":186.16}]
[]
[null,"BDI:","%",{"$f":"+$F$7","v":"22,15%"},null,{"$f":"TRUNC(F1375*D1377,2)","v":41.23}]
[]
[null,"PREÇO:",null,null,null,{"$f":"+F1375+F1377","v":227.39}]
[]
["CÓDIGO","DISCRIMINAÇÃO","UN","COEFIC.","UNITÁRIO","TOTAL"]
[3685,"REPINTURA BARRA HORIZONTAL - 3 MÓDULOS TORAS ROLIÇAS","un"]
["SINAPI I 10478","VERNIZ POLIURETANO BRILHANTE PARA MADEIRA, COM FILTRO SOLAR, USO INTERNO E EXTERNO","l",4.5999999999999996,{"$f":"Insumos!G225","v":30.97},{"$f":"TRUNC(D1383*E1383,2)","v":142.46}]
["SINAPI I 5318","SOLVENTE DILUENTE A BASE DE AGUARRÁS","l",0.36919999999999997,{"$f":"Insumos!G182","v":17.98},{"$f":"TRUNC(D1384*E1384,2)","v":6.63}]
["SINAPI I 006086","FUNDO SINTETICO NIVELADOR BRANCO FOSCO PARA MADEIRA","l",0.2712,{"$f":"Insumos!G109","v":90.88},{"$f":"TRUNC(D1385*E1385,2)","v":24.64}]
["SUB-TOTAL - MATERIAL / EQUIPAMENTOS:",null,{"$f":"SUM(F1383:F1385)","v":173.73000000000002}]
["SINAPI C 88310","PINTOR C/ENCARGOS COMPLEMENTARES","h",2.6,{"$f":"'Planilha_M.O.'!E25","v":21.7},{"$f":"TRUNC(D1387*E1387,2)","v":56.42}]
["SUB-TOTAL - MÃO-DE-OBRA:",null,{"$f":"SUM(F1387:F1387)","v":56.42}]
[]
[null,"CUSTO TOTAL:",null,null,null,{"$f":"+C1386+C1388","v":230.15000000000003}]
[]
[null,"BDI:","%",{"$f":"+$F$7","v":"22,15%"},null,{"$f":"TRUNC(F1390*D1392,2)","v":50.97}]
[]
[null,"PREÇO:",null,null,null,{"$f":"+F1390+F1392","v":281.12}]
[]
["CÓDIGO","DISCRIMINAÇÃO","UN","COEFIC.","UNITÁRIO","TOTAL"]
[3690,"REPINTURA ESPALDAR - TORAS ROLIÇAS","un"]
["SINAPI I 10478","VERNIZ POLIURETANO BRILHANTE PARA MADEIRA, COM FILTRO SOLAR, USO INTERNO E EXTERNO","l",3.5,{"$f":"Insumos!G225","v":30.97},{"$f":"TRUNC(D1398*E1398,2)","v":108.39}]
["SINAPI I 5318","SOLVENTE DILUENTE A BASE DE AGUARRÁS","l",0.41899999999999998,{"$f":"Insumos!G182","v":17.98},{"$f":"TRUNC(D1399*E1399,2)","v":7.53}]
["SINAPI I 006086","FUNDO SINTETICO NIVELADOR BRANCO FOSCO PARA MADEIRA","l",0.32240000000000002,{"$f":"Insumos!G109","v":90.88},{"$f":"TRUNC(D1400*E1400,2)","v":29.29}]
["SUB-TOTAL - MATERIAL / EQUIPAMENTOS:",null,{"$f":"SUM(F1398:F1400)","v":145.21}]
["SINAPI C 88310","PINTOR C/ENCARGOS COMPLEMENTARES","h",2.2999999999999998,{"$f":"'Planilha_M.O.'!E25","v":21.7},{"$f":"TRUNC(D1402*E1402,2)","v":49.91}]
["SUB-TOTAL - MÃO-DE-OBRA:",null,{"$f":"SUM(F1402:F1402)","v":49.91}]
[]
[null,"CUSTO TOTAL:",null,null,null,{"$f":"+C1401+C1403","v":195.12}]
[]
[null,"BDI:","%",{"$f":"+$F$7","v":"22,15%"},null,{"$f":"TRUNC(F1405*D1407,2)","v":43.21}]
[]
[null,"PREÇO:",null,null,null,{"$f":"+F1405+F1407","v":238.33}]
[]
["CÓDIGO","DISCRIMINAÇÃO","UN","COEFIC.","UNITÁRIO","TOTAL"]
[3695,"REPINTURA DE PRANCHA DE ABDOMINAIS","un"]
["SINAPI I 3767","LIXA P/MADEIRA","fl",2.0870000000000002,{"$f":"Insumos!G120","v":0.79},{"$f":"TRUNC(D1413*E1413,2)","v":1.64}]
["SINAPI I 10478","VERNIZ POLIURETANO BRILHANTE PARA MADEIRA, COM FILTRO SOLAR, USO INTERNO E EXTERNO","l",1.5,{"$f":"Insumos!G225","v":30.97},{"$f":"TRUNC(D1414*E1414,2)","v":46.45}]
["SINAPI I 5318","SOLVENTE DILUENTE A BASE DE AGUARRÁS","l",0.35,{"$f":"Insumos!G182","v":17.98},{"$f":"TRUNC(D1415*E1415,2)","v":6.29}]
["COTAÇÃO 108","FUNDO P/GALVANIZADO","l",0.3,{"$f":"Insumos!G108","v":34.81},{"$f":"TRUNC(D1416*E1416,2)","v":10.44}]
["SINAPI 6086","FUNDO SINTÉTICO NIVELADOR BRANCO FOSCO","l",0.6,{"$f":"Insumos!G109","v":90.88},{"$f":"TRUNC(D1417*E1417,2)","v":54.52}]
["SUB-TOTAL - MATERIAL / EQUIPAMENTOS:",null,{"$f":"SUM(F1413:F1417)","v":119.34}]
["SINAPI C 88310","PINTOR C/ENCARGOS COMPLEMENTARES","h",1.3559000000000001,{"$f":"'Planilha_M.O.'!E25","v":21.7},{"$f":"TRUNC(D1419*E1419,2)","v":29.42}]
["SUB-TOTAL - MÃO-DE-OBRA:",null,{"$f":"SUM(F1419:F1419)","v":29.42}]
[]
[null,"CUSTO TOTAL:",null,null,null,{"$f":"+C1418+C1420","v":148.76}]
[]
[null,"BDI:","%",{"$f":"+$F$7","v":"22,15%"},null,{"$f":"TRUNC(F1422*D1424,2)","v":32.950000000000003}]
[]
[null,"PREÇO:",null,null,null,{"$f":"+F1422+F1424","v":181.70999999999998}]
[]
["CÓDIGO","DISCRIMINAÇÃO","UN","COEFIC.","UNITÁRIO","TOTAL"]
[100758,"PINTURA COM TINTA ALQUÍDICA DE ACABAMENTO (ESMALTE SINTÉTICO ACETINADO) APLICADA A ROLO OU PINCEL SOBRE SUPERFÍCIES METÁLICAS (EXCETO PERFIL) EXECUTADO EM OBRA (02 DEMÃOS). AF_01/2020","m²"]
["SINAPI I 5318","SOLVENTE DILUENTE A BASE DE AGUARRÁS","l",2.5499999999999998E-2,{"$f":"Insumos!G182","v":17.98},{"$f":"TRUNC(D1430*E1430,2)","v":0.45}]
["SINAPI I 7311","TINTA ESMALTE SINTETICO PREMIUM ACETINADO","l",0.25490000000000002,{"$f":"Insumos!G202","v":28.37},{"$f":"TRUNC(D1431*E1431,2)","v":7.23}]
["SUB-TOTAL - MATERIAL / EQUIPAMENTOS:",null,{"$f":"SUM(F1430:F1431)","v":7.6800000000000006}]
["SINAPI C 88310","PINTOR C/ENCARGOS COMPLEMENTARES","h",1.3559000000000001,{"$f":"'Planilha_M.O.'!E25","v":21.7},{"$f":"TRUNC(D1433*E1433,2)","v":29.42}]
["SUB-TOTAL - MÃO-DE-OBRA:",null,{"$f":"SUM(F1433:F1433)","v":29.42}]
[]
[null,"CUSTO TOTAL:",null,null,null,{"$f":"+C1432+C1434","v":37.1}]
[]
[null,"BDI:","%",{"$f":"+$F$7","v":"22,15%"},null,{"$f":"TRUNC(F1436*D1438,2)","v":8.2100000000000009}]
[]
[null,"PREÇO:",null,null,null,{"$f":"+F1436+F1438","v":45.31}]
[]
["CÓDIGO","DISCRIMINAÇÃO","UN","COEFIC.","UNITÁRIO","TOTAL"]
["3003 A","REPINTURA DE BARRA ALONGAMENTO - 2 ALTURAS","un"]
["SINAPI I 7292","TINTA ESMALTE SINTÉTICO ALTO BRILHO","l",1,{"$f":"Insumos!G204","v":27.61},{"$f":"TRUNC(D1444*E1444,2)","v":27.61}]
["SINAPI I 5318","SOLVENTE DILUENTE A BASE DE AGUARRÁS","l",0.3,{"$f":"Insumos!G182","v":17.98},5.39]
["COTAÇÃO 108","FUNDO P/GALVANIZADO","l",0.5,{"$f":"Insumos!G108","v":34.81},17.399999999999999]
["SUB-TOTAL - MATERIAL / EQUIPAMENTOS:",null,{"$f":"SUM(F1444:F1446)","v":50.4}]
["SINAPI C 88310","PINTOR C/ENCARGOS COMPLEMENTARES","h",1.3559000000000001,{"$f":"'Planilha_M.O.'!E25","v":21.7},{"$f":"TRUNC(D1448*E1448,2)","v":29.42}]
["SINAPI C 88316","SERVENTE C/ ENCARGOS COMPLEMENTARES","h",1.3559000000000001,{"$f":"'Planilha_M.O.'!E18","v":17.11},{"$f":"TRUNC(D1449*E1449,2)","v":23.19}]
["SUB-TOTAL - MÃO-DE-OBRA:",null,{"$f":"SUM(F1448:F1449)","v":52.61}]
[]
[null,"CUSTO TOTAL:",null,null,null,{"$f":"+C1447+C1450","v":103.00999999999999}]
[]
[null,"BDI:","%",{"$f":"+$F$7","v":"22,15%"},null,{"$f":"TRUNC(F1452*D1454,2)","v":22.81}]
[]
[null,"PREÇO:",null,null,null,{"$f":"+F1452+F1454","v":125.82}]
[]
["CÓDIGO","DISCRIMINAÇÃO","UN","COEFIC.","UNITÁRIO","TOTAL"]
["3005 A","REPINTURA DE BARRAS PARALELAS","un"]
["SINAPI I 7292","TINTA ESMALTE SINTÉTICO ALTO BRILHO","l",2.0448,{"$f":"Insumos!G204","v":27.61},{"$f":"TRUNC(D1460*E1460,2)","v":56.45}]
["SINAPI I 5318","SOLVENTE DILUENTE A BASE DE AGUARRÁS","l",0.36919999999999997,{"$f":"Insumos!G182","v":17.98},6.63]
["COTAÇÃO 108","FUNDO P/GALVANIZADO","l",0.2712,{"$f":"Insumos!G108","v":34.81},9.44]
["SUB-TOTAL - MATERIAL / EQUIPAMENTOS:",null,{"$f":"SUM(F1460:F1462)","v":72.52000000000001}]
["SINAPI C 88310","PINTOR C/ENCARGOS COMPLEMENTARES","h",0.9,{"$f":"'Planilha_M.O.'!E25","v":21.7},{"$f":"TRUNC(D1464*E1464,2)","v":19.53}]
["SINAPI C 88316","SERVENTE C/ ENCARGOS COMPLEMENTARES","h",0.9,{"$f":"'Planilha_M.O.'!E18","v":17.11},{"$f":"TRUNC(D1465*E1465,2)","v":15.39}]
["SUB-TOTAL - MÃO-DE-OBRA:",null,{"$f":"SUM(F1464:F1465)","v":34.92}]
[]
[null,"CUSTO TOTAL:",null,null,null,{"$f":"+C1463+C1466","v":107.44000000000001}]
[]
[null,"BDI:","%",{"$f":"+$F$7","v":"22,15%"},null,{"$f":"TRUNC(F1468*D1470,2)","v":23.79}]
[]
[null,"PREÇO:",null,null,null,{"$f":"+F1468+F1470","v":131.23000000000002}]
[]
["CÓDIGO","DISCRIMINAÇÃO","UN","COEFIC.","UNITÁRIO","TOTAL"]
["3010 A","REPINTURA DE APOIO P/ MEMBROS SUPERIORES","un"]
["SINAPI I 7292","TINTA ESMALTE SINTÉTICO ALTO BRILHO","l",0.77969999999999995,{"$f":"Insumos!G204","v":27.61},{"$f":"TRUNC(D1476*E1476,2)","v":21.52}]
["SINAPI I 5318","SOLVENTE DILUENTE A BASE DE AGUARRÁS","l",0.1404,{"$f":"Insumos!G182","v":17.98},2.52]
["COTAÇÃO 108","FUNDO P/GALVANIZADO","l",0.122,{"$f":"Insumos!G108","v":34.81},4.24]
["SUB-TOTAL - MATERIAL / EQUIPAMENTOS:",null,{"$f":"SUM(F1476:F1478)","v":28.28}]
["SINAPI C 88310","PINTOR C/ENCARGOS COMPLEMENTARES","h",1.3580000000000001,{"$f":"'Planilha_M.O.'!E25","v":21.7},{"$f":"TRUNC(D1480*E1480,2)","v":29.46}]
["SINAPI C 88316","SERVENTE C/ ENCARGOS COMPLEMENTARES","h",1.3580000000000001,{"$f":"'Planilha_M.O.'!E18","v":17.11},{"$f":"TRUNC(D1481*E1481,2)","v":23.23}]
["SUB-TOTAL - MÃO-DE-OBRA:",null,{"$f":"SUM(F1480:F1481)","v":52.69}]
[]
[null,"CUSTO TOTAL:",null,null,null,{"$f":"+C1479+C1482","v":80.97}]
[]
[null,"BDI:","%",{"$f":"+$F$7","v":"22,15%"},null,{"$f":"TRUNC(F1484*D1486,2)","v":17.93}]
[]
[null,"PREÇO:",null,null,null,{"$f":"+F1484+F1486","v":98.9}]
[]
["CÓDIGO","DISCRIMINAÇÃO","UN","COEFIC.","UNITÁRIO","TOTAL"]
["3015A","REPINTURA DE BARRA P/ ALONGAMENTO","un"]
["SINAPI I 7292","TINTA ESMALTE SINTÉTICO ALTO BRILHO","l",0.74960000000000004,{"$f":"Insumos!G204","v":27.61},{"$f":"TRUNC(D1492*E1492,2)","v":20.69}]
["SINAPI I 5318","SOLVENTE DILUENTE A BASE DE AGUARRÁS","l",0.1348,{"$f":"Insumos!G182","v":17.98},2.42]
["COTAÇÃO 108","FUNDO P/GALVANIZADO","l",0.1002,{"$f":"Insumos!G108","v":34.81},3.48]
["SUB-TOTAL - MATERIAL / EQUIPAMENTOS:",null,{"$f":"SUM(F1492:F1494)","v":26.59}]
["SINAPI C 88310","PINTOR C/ENCARGOS COMPLEMENTARES","h",1.23,{"$f":"'Planilha_M.O.'!E25","v":21.7},{"$f":"TRUNC(D1496*E1496,2)","v":26.69}]
["SINAPI C 88316","SERVENTE C/ ENCARGOS COMPLEMENTARES","h",1.23,{"$f":"'Planilha_M.O.'!E18","v":17.11},{"$f":"TRUNC(D1497*E1497,2)","v":21.04}]
["SUB-TOTAL - MÃO-DE-OBRA:",null,{"$f":"SUM(F1496:F1497)","v":47.730000000000004}]
[]
[null,"CUSTO TOTAL:",null,null,null,{"$f":"+C1495+C1498","v":74.320000000000007}]
[]
[null,"BDI:","%",{"$f":"+$F$7","v":"22,15%"},null,{"$f":"TRUNC(F1500*D1502,2)","v":16.46}]
[]
[null,"PREÇO:",null,null,null,{"$f":"+F1500+F1502","v":90.78}]
[]
["CÓDIGO","DISCRIMINAÇÃO","UN","COEFIC.","UNITÁRIO","TOTAL"]
["3020A","REPINTURA DE BARRA HORIZONTAL - 4 MÓDULOS","un"]
["SINAPI I 7292","TINTA ESMALTE SINTÉTICO ALTO BRILHO","l",3.4085000000000001,{"$f":"Insumos!G204","v":27.61},{"$f":"TRUNC(D1508*E1508,2)","v":94.1}]
["SINAPI I 5318","SOLVENTE DILUENTE A BASE DE AGUARRÁS","l",0.61270000000000002,{"$f":"Insumos!G182","v":17.98},11.01]
["COTAÇÃO 108","FUNDO P/GALVANIZADO","l",0.49030000000000001,{"$f":"Insumos!G108","v":34.81},17.059999999999999]
["SUB-TOTAL - MATERIAL / EQUIPAMENTOS:",null,{"$f":"SUM(F1508:F1510)","v":122.17}]
["SINAPI C 88310","PINTOR C/ENCARGOS COMPLEMENTARES","h",3.23,{"$f":"'Planilha_M.O.'!E25","v":21.7},{"$f":"TRUNC(D1512*E1512,2)","v":70.09}]
["SINAPI C 88316","SERVENTE C/ ENCARGOS COMPLEMENTARES","h",3.23,{"$f":"'Planilha_M.O.'!E18","v":17.11},{"$f":"TRUNC(D1513*E1513,2)","v":55.26}]
["SUB-TOTAL - MÃO-DE-OBRA:",null,{"$f":"SUM(F1512:F1513)","v":125.35}]
[]
[null,"CUSTO TOTAL:",null,null,null,{"$f":"+C1511+C1514","v":247.51999999999998}]
[]
[null,"BDI:","%",{"$f":"+$F$7","v":"22,15%"},null,{"$f":"TRUNC(F1516*D1518,2)","v":54.82}]
[]
[null,"PREÇO:",null,null,null,{"$f":"+F1516+F1518","v":302.33999999999997}]
[]
["CÓDIGO","DISCRIMINAÇÃO","UN","COEFIC.","UNITÁRIO","TOTAL"]
["3021 A","REPINTURA DE BARRA HORIZONTAL - 3 MÓDULOS","un"]
["SINAPI I 7292","TINTA ESMALTE SINTÉTICO ALTO BRILHO","l",2.8216000000000001,{"$f":"Insumos!G204","v":27.61},{"$f":"TRUNC(D1524*E1524,2)","v":77.900000000000006}]
["SINAPI I 5318","SOLVENTE DILUENTE A BASE DE AGUARRÁS","l",0.50719999999999998,{"$f":"Insumos!G182","v":17.98},9.11]
["COTAÇÃO 108","FUNDO P/GALVANIZADO","l",0.40649999999999997,{"$f":"Insumos!G108","v":34.81},14.15]
["SUB-TOTAL - MATERIAL / EQUIPAMENTOS:",null,{"$f":"SUM(F1524:F1526)","v":101.16000000000001}]
["SINAPI C 88310","PINTOR C/ENCARGOS COMPLEMENTARES","h",2.23,{"$f":"'Planilha_M.O.'!E25","v":21.7},{"$f":"TRUNC(D1528*E1528,2)","v":48.39}]
["SINAPI C 88316","SERVENTE C/ ENCARGOS COMPLEMENTARES","h",2.23,{"$f":"'Planilha_M.O.'!E18","v":17.11},{"$f":"TRUNC(D1529*E1529,2)","v":38.15}]
["SUB-TOTAL - MÃO-DE-OBRA:",null,{"$f":"SUM(F1528:F1529)","v":86.539999999999992}]
[]
[null,"CUSTO TOTAL:",null,null,null,{"$f":"+C1527+C1530","v":187.7}]
[]
[null,"BDI:","%",{"$f":"+$F$7","v":"22,15%"},null,{"$f":"TRUNC(F1532*D1534,2)","v":41.57}]
[]
[null,"PREÇO:",null,null,null,{"$f":"+F1532+F1534","v":229.26999999999998}]
[]
["CÓDIGO","DISCRIMINAÇÃO","UN","COEFIC.","UNITÁRIO","TOTAL"]
["3022A","REPINTURA DE BARRA HORIZONTAL - 1 MÓDULO","un"]
["SINAPI I 7292","TINTA ESMALTE SINTÉTICO ALTO BRILHO","l",1.4418,{"$f":"Insumos!G204","v":27.61},{"$f":"TRUNC(D1540*E1540,2)","v":39.799999999999997}]
["SINAPI I 5318","SOLVENTE DILUENTE A BASE DE AGUARRÁS","l",0.2591,{"$f":"Insumos!G182","v":17.98},4.6500000000000004]
["COTAÇÃO 108","FUNDO P/GALVANIZADO","l",0.2087,{"$f":"Insumos!G108","v":34.81},7.26]
["SUB-TOTAL - MATERIAL / EQUIPAMENTOS:",null,{"$f":"SUM(F1540:F1542)","v":51.709999999999994}]
["SINAPI C 88310","PINTOR C/ENCARGOS COMPLEMENTARES","h",1.23,{"$f":"'Planilha_M.O.'!E25","v":21.7},{"$f":"TRUNC(D1544*E1544,2)","v":26.69}]
["SINAPI C 88316","SERVENTE C/ ENCARGOS COMPLEMENTARES","h",1.23,{"$f":"'Planilha_M.O.'!E18","v":17.11},{"$f":"TRUNC(D1545*E1545,2)","v":21.04}]
["SUB-TOTAL - MÃO-DE-OBRA:",null,{"$f":"SUM(F1544:F1545)","v":47.730000000000004}]
[]
[null,"CUSTO TOTAL:",null,null,null,{"$f":"+C1543+C1546","v":99.44}]
[]
[null,"BDI:","%",{"$f":"+$F$7","v":"22,15%"},null,{"$f":"TRUNC(F1548*D1550,2)","v":22.02}]
[]
[null,"PREÇO:",null,null,null,{"$f":"+F1548+F1550","v":121.46}]
[]
["CÓDIGO","DISCRIMINAÇÃO","UN","COEFIC.","UNITÁRIO","TOTAL"]
["3025A","REPINTURA DE ESPALDAR","un"]
["SINAPI I 7292","TINTA ESMALTE SINTÉTICO ALTO BRILHO","l",2.3260000000000001,{"$f":"Insumos!G204","v":27.61},{"$f":"TRUNC(D1556*E1556,2)","v":64.22}]
["SINAPI I 5318","SOLVENTE DILUENTE A BASE DE AGUARRÁS","l",0.41899999999999998,{"$f":"Insumos!G182","v":17.98},7.53]
["COTAÇÃO 108","FUNDO P/GALVANIZADO","l",0.32240000000000002,{"$f":"Insumos!G108","v":34.81},11.22]
["SUB-TOTAL - MATERIAL / EQUIPAMENTOS:",null,{"$f":"SUM(F1556:F1558)","v":82.97}]
["SINAPI C 88310","PINTOR C/ENCARGOS COMPLEMENTARES","h",3,{"$f":"'Planilha_M.O.'!E25","v":21.7},{"$f":"TRUNC(D1560*E1560,2)","v":65.099999999999994}]
["SINAPI C 88316","SERVENTE C/ ENCARGOS COMPLEMENTARES","h",3,{"$f":"'Planilha_M.O.'!E18","v":17.11},{"$f":"TRUNC(D1561*E1561,2)","v":51.33}]
["SUB-TOTAL - MÃO-DE-OBRA:",null,{"$f":"SUM(F1560:F1561)","v":116.42999999999999}]
[]
[null,"CUSTO TOTAL:",null,null,null,{"$f":"+C1559+C1562","v":199.39999999999998}]
[]
[null,"BDI:","%",{"$f":"+$F$7","v":"22,15%"},null,{"$f":"TRUNC(F1564*D1566,2)","v":44.16}]
[]
[null,"PREÇO:",null,null,null,{"$f":"+F1564+F1566","v":243.55999999999997}]
[]
["CÓDIGO","DISCRIMINAÇÃO","UN","COEFIC.","UNITÁRIO","TOTAL"]
["2665A","REPINTURA DE MESA DE DAMAS","un"]
["SINAPI 6086","FUNDO SINTÉTICO NIVELADOR BRANCO FOSCO","l",0.11559999999999999,{"$f":"Insumos!G109","v":90.88},{"$f":"TRUNC(D1572*E1572,2)","v":10.5}]
["SINAPI I 3767","LIXA P/MADEIRA","fl",0.57799999999999996,{"$f":"Insumos!G120","v":0.79},0.45]
["SINAPI I 7292","TINTA ESMALTE SINTÉTICO ALTO BRILHO","l",0.88260000000000005,{"$f":"Insumos!G204","v":27.61},24.36]
["SINAPI I 5318","SOLVENTE DILUENTE A BASE DE AGUARRÁS","l",0.15540000000000001,{"$f":"Insumos!G182","v":17.98},2.79]
["COTAÇÃO 108","FUNDO P/GALVANIZADO","l",0.1207,{"$f":"Insumos!G108","v":34.81},4.2]
["SUB-TOTAL - MATERIAL / EQUIPAMENTOS:",null,{"$f":"SUM(F1572:F1576)","v":42.300000000000004}]
["SINAPI C 88310","PINTOR C/ENCARGOS COMPLEMENTARES","h",2,{"$f":"'Planilha_M.O.'!E25","v":21.7},{"$f":"TRUNC(D1578*E1578,2)","v":43.4}]
["SINAPI C 88316","SERVENTE C/ ENCARGOS COMPLEMENTARES","h",2,{"$f":"'Planilha_M.O.'!E18","v":17.11},34.22]
["SUB-TOTAL - MÃO-DE-OBRA:",null,{"$f":"SUM(F1578:F1579)","v":77.62}]
[]
[null,"CUSTO TOTAL:",null,null,null,{"$f":"+C1577+C1580","v":119.92000000000002}]
[]
[null,"BDI:","%",{"$f":"+$F$7","v":"22,15%"},null,{"$f":"TRUNC(F1582*D1584,2)","v":26.56}]
[]
[null,"PREÇO:",null,null,null,{"$f":"+F1582+F1584","v":146.48000000000002}]
[]
["CÓDIGO","DISCRIMINAÇÃO","UN","COEFIC.","UNITÁRIO","TOTAL"]
["2450 A","REPINTURA DE TODA A TABELA DE BASQUETE","un"]
["SINAPI I 5318","SOLVENTE DILUENTE A BASE DE AGUARRÁS","l",0.48409999999999997,{"$f":"Insumos!G182","v":17.98},{"$f":"TRUNC(D1590*E1590,2)","v":8.6999999999999993}]
["SINAPI I 7292","TINTA ESMALTE SINTÉTICO ALTO BRILHO","l",2.7080000000000002,{"$f":"Insumos!G204","v":27.61},74.760000000000005]
["COTAÇÃO 108","FUNDO P/GALVANIZADO","l",0.4536,{"$f":"Insumos!G108","v":34.81},15.78]
["SINAPI I 3768","LIXA P/FERRO","fl",9.3535000000000004,{"$f":"Insumos!G119","v":3.37},31.52]
["SINAPI I 7307","FUNDO ANTICORROSIVO TIPO ZARCÃO","l",1.0241,{"$f":"Insumos!G107","v":29.63},30.34]
["SUB-TOTAL - MATERIAL / EQUIPAMENTOS:",null,{"$f":"SUM(F1590:F1594)","v":161.10000000000002}]
["SINAPI C 88310","PINTOR C/ENCARGOS COMPLEMENTARES","h",4,{"$f":"'Planilha_M.O.'!E25","v":21.7},{"$f":"TRUNC(D1596*E1596,2)","v":86.8}]
["SINAPI C 88316","SERVENTE C/ ENCARGOS COMPLEMENTARES","h",4,{"$f":"'Planilha_M.O.'!E18","v":17.11},{"$f":"TRUNC(D1597*E1597,2)","v":68.44}]
["SUB-TOTAL - MÃO-DE-OBRA:",null,{"$f":"SUM(F1596:F1597)","v":155.24}]
[]
[null,"CUSTO TOTAL:",null,null,null,{"$f":"+C1595+C1598","v":316.34000000000003}]
[]
[null,"BDI:","%",{"$f":"+$F$7","v":"22,15%"},null,{"$f":"TRUNC(F1600*D1602,2)","v":70.06}]
[]
[null,"PREÇO:",null,null,null,{"$f":"+F1600+F1602","v":386.40000000000003}]
[]
["CÓDIGO","DISCRIMINAÇÃO","UN","QUANT.","UNITÁRIO","TOTAL"]
["SMAMS 3980","CARGA E TRANSPORTE - EQUIPES: 1,2 E 3","%"]
["SINAPI C 91387","CAMINHÃO BASCULANTE 10 M3, TRUCADO CABINE SIMPLES, PESO BRUTO TOTAL 23.000 KG, CARGA ÚTIL MÁXIMA 15.935 KG, DISTÂNCIA ENTRE EIXOS 4,80 M, POTÊNCIA 230 CV INCLUSIVE CAÇAMBA METÁLICA - CHI DIURNO. AF_06/2014","chi",{"$f":"(5*22*12)/100","v":13.2},{"$f":"'Composições Aux. SINAPI'!E29:F29","v":47.29},{"$f":"TRUNC((D1608*E1608),2)","v":624.22}]
["SINAPI C 91386","CAMINHÃO BASCULANTE 10 M3, TRUCADO CABINE SIMPLES, PESO BRUTO TOTAL 23.000 KG, CARGA ÚTIL MÁXIMA 15.935 KG, DISTÂNCIA ENTRE EIXOS 4,80 M, POTÊNCIA 230 CV INCLUSIVE CAÇAMBA METÁLICA - CHP DIURNO. AF_06/2014","chp",{"$f":"(3*22*12)/100","v":7.92},{"$f":"'Composições Aux. SINAPI'!E30:F30","v":185.8},{"$f":"TRUNC((D1609*E1609),2)","v":1471.53}]
["SUB-TOTAL - MATERIAL / EQUIPAMENTOS:",null,{"$f":"SUM(F1608:F1609)","v":2095.75}]
[]
[null,"CUSTO TOTAL:",null,null,null,{"$f":"+C1610","v":2095.75}]
[]
[null,"BDI:","%",{"$f":"+$F$7","v":"22,15%"},null,{"$f":"TRUNC((F1612*D1614),2)","v":464.2}]
[]
[null,"PREÇO:",null,null,null,{"$f":"+C1610+F1614","v":2559.9499999999998}]
[null,"CÁLCULO: 8 HORAS / DIA DURANTE 22 DIAS EM 12 MESES"]
[null,"chp 3h/dia"]
[null,"chi 5h/dia"]
[null,"Dentro da Composição SINAPI C 91387 já está incluído o Motorista c/ encargos complementares"]
[]
["CÓDIGO","DISCRIMINAÇÃO","UN","COEFIC.","UNITÁRIO","TOTAL"]
[3715,"INSTALAÇÃO TELA h=5,50 m EM ESTRUTURA TUBULAR EXISTENTE DE QUADRA ESPORTIVA","m"]
[{"$f":"CONCATENATE(\"SINAPI I \",Insumos!$B$25)","v":"SINAPI I 10527"},"ANDAIME METÁLICO, TIPO TORRE, LARGURA DE 1 A 1,5 m E ALTURA DE 1 m LOCAÇÃO","mxmês",8.3199999999999996E-2,{"$f":"+Insumos!$G$25","v":23.5},{"$f":"TRUNC(D1624*E1624,2)","v":1.95}]
[{"$f":"CONCATENATE(\"SINAPI I \",Insumos!$B$184)","v":"SINAPI I 6189"},"TÁBUA MADEIRA NÃO APARELHADA CEDRINHO 2,5 x 30 cm","m",3.44E-2,{"$f":"+Insumos!$G$184","v":21.86},0.75]
["SINAPI I 007158","TELA DE ARAME GALVANIZADA QUADRANGULAR / LOSANGULAR, FIO 2,77 MM (12 BWG), MALHA 5 X 5 CM, H = 2 M","m²",5.5,{"$f":"Insumos!G196","v":23.48},129.13999999999999]
[{"$f":"CONCATENATE(\"SINAPI I \",Insumos!$B$27)","v":"SINAPI I 43131"},"ARAME GALVANIZADO 10 BWG","kg",0.64170000000000005,{"$f":"+Insumos!$G$27","v":27.77},17.82]
[{"$f":"CONCATENATE(\"SINAPI I \",Insumos!$B$28)","v":"SINAPI I 43130"},"ARAME GALVANIZADO 12 BWG","kg",0.1837,{"$f":"+Insumos!$G$28","v":23.91},4.3899999999999997]
[{"$f":"CONCATENATE(\"COTAÇÃO \",Insumos!#REF!)","v":{"$error":"#REF!"}},"ESTICADOR DE ARAME","un",0.58330000000000004,{"$f":"+Insumos!#REF!","v":{"$error":"#REF!"}},{"$error":"#REF!"}]
["SUB-TOTAL - MATERIAL / EQUIPAMENTOS:",null,{"$f":"SUM(F1624:F1629)","v":{"$error":"#REF!"}}]
["SINAPI C 88315","SERRALHEIRO C/ENCARGOS COMPLEMENTARES","h",2.0625,{"$f":"'Planilha_M.O.'!E30","v":20.6},{"$f":"TRUNC(D1631*E1631,2)","v":42.48}]
["SINAPI C 88316","SERVENTE C/ ENCARGOS COMPLEMENTARES","h",1.7050000000000001,{"$f":"'Planilha_M.O.'!E18","v":17.11},{"$f":"TRUNC(D1632*E1632,2)","v":29.17}]
["SUB-TOTAL - MÃO-DE-OBRA:",null,{"$f":"SUM(F1631:F1632)","v":71.650000000000006}]
[]
[null,"CUSTO TOTAL:",null,null,null,{"$f":"+C1630+C1633","v":{"$error":"#REF!"}}]
[]
[null,"BDI:","%",{"$f":"+$F$7","v":"22,15%"},null,{"$f":"TRUNC(F1635*D1637,2)","v":{"$error":"#REF!"}}]
[]
[null,"PREÇO:",null,null,null,{"$f":"+F1635+F1637","v":{"$error":"#REF!"}}]
[]
["CÓDIGO","DISCRIMINAÇÃO","UN","COEFIC.","UNITÁRIO","TOTAL"]
[3717,"INSTALAÇÃO TELA h=3,00 m EM ESTRUTURA TUBULAR EXISTENTE DE QUADRA ESPORTIVA","m"]
[{"$f":"CONCATENATE(\"SINAPI I \",Insumos!$B$25)","v":"SINAPI I 10527"},"ANDAIME METÁLICO, TIPO TORRE, LARGURA DE 1 A 1,5 m E ALTURA DE 1 m LOCAÇÃO","mxmês",4.1500000000000002E-2,{"$f":"+Insumos!$G$25","v":23.5},{"$f":"TRUNC(D1643*E1643,2)","v":0.97}]
[{"$f":"CONCATENATE(\"SINAPI I \",Insumos!$B$184)","v":"SINAPI I 6189"},"TÁBUA MADEIRA NÃO APARELHADA CEDRINHO 2,5 x 30 cm","m",3.44E-2,{"$f":"+Insumos!$G$184","v":21.86},0.75]
["SINAPI I 007158","TELA DE ARAME GALVANIZADA QUADRANGULAR / LOSANGULAR, FIO 2,77 MM (12 BWG), MALHA 5 X 5 CM, H = 2 M","m²",3,{"$f":"Insumos!G196","v":23.48},70.44]
[{"$f":"CONCATENATE(\"SINAPI I \",Insumos!$B$27)","v":"SINAPI I 43131"},"ARAME GALVANIZADO 10 BWG","kg",0.35649999999999998,{"$f":"+Insumos!$G$27","v":27.77},9.9]
[{"$f":"CONCATENATE(\"SINAPI I \",Insumos!$B$28)","v":"SINAPI I 43130"},"ARAME GALVANIZADO 12 BWG","kg",0.14860000000000001,{"$f":"+Insumos!$G$28","v":23.91},3.55]
[{"$f":"CONCATENATE(\"COTAÇÃO \",Insumos!#REF!)","v":{"$error":"#REF!"}},"ESTICADOR DE ARAME","un",0.41670000000000001,{"$f":"+Insumos!#REF!","v":{"$error":"#REF!"}},{"$error":"#REF!"}]
["SUB-TOTAL - MATERIAL / EQUIPAMENTOS:",null,{"$f":"SUM(F1643:F1648)","v":{"$error":"#REF!"}}]
["SINAPI C 88315","SERRALHEIRO C/ENCARGOS COMPLEMENTARES","h",1.125,{"$f":"'Planilha_M.O.'!E30","v":20.6},{"$f":"TRUNC(D1650*E1650,2)","v":23.17}]
["SINAPI C 88316","SERVENTE C/ ENCARGOS COMPLEMENTARES","h",0.93,{"$f":"'Planilha_M.O.'!E18","v":17.11},{"$f":"TRUNC(D1651*E1651,2)","v":15.91}]
["SUB-TOTAL - MÃO-DE-OBRA:",null,{"$f":"SUM(F1650:F1651)","v":39.08}]
[]
[null,"CUSTO TOTAL:",null,null,null,{"$f":"+C1649+C1652","v":{"$error":"#REF!"}}]
[]
[null,"BDI:","%",{"$f":"+$F$7","v":"22,15%"},null,{"$f":"TRUNC(F1654*D1656,2)","v":{"$error":"#REF!"}}]
[]
[null,"PREÇO:",null,null,null,{"$f":"+F1654+F1656","v":{"$error":"#REF!"}}]
[]
["CÓDIGO","DISCRIMINAÇÃO","UN","COEFIC.","UNITÁRIO","TOTAL"]
["SMAMS 3718","INSTALAÇÃO TELA h=1,70 m EM ESTRUTURA TUBULAR EXISTENTE DE QUADRA ESPORTIVA","m"]
["SINAPI I 10527","ANDAIME METÁLICO, TIPO TORRE, LARGURA DE 1 A 1,5 m E ALTURA DE 1 m LOCAÇÃO","ms",4.1500000000000002E-2,{"$f":"Insumos!G25","v":23.5},{"$f":"TRUNC(D1662*E1662,2)","v":0.97}]
["SINAPI I 6189","TÁBUA MADEIRA CEDRINHO 2,5 x 30 cm (1 X 12\")","m",3.44E-2,{"$f":"Insumos!G184","v":21.86},0.75]
["SINAPI I 007158","TELA DE ARAME GALVANIZADA QUADRANGULAR / LOSANGULAR, FIO 2,77 MM (12 BWG), MALHA 5 X 5 CM, H = 2 M","m²",1.7,{"$f":"Insumos!G196","v":23.48},39.909999999999997]
["SINAPI I 335","ARAME GALVANIZADO 10 BWG","kg",{"$f":"0.3566*0.57","v":0.20326199999999997},{"$f":"+Insumos!$G$27","v":27.77},5.64]
["SINAPI 342","ARAME GALVANIZADO 12 BWG","kg",{"$f":"0.1486*0.57","v":8.4702E-2},{"$f":"+Insumos!$G$28","v":23.91},2.02]
[{"$f":"CONCATENATE(\"COTAÇÃO \",[6]Insumos!$B$179)","v":"COTAÇÃO 80"},"ESTICADOR DE ARAME","un",{"$f":"0.4168*0.57","v":0.23757599999999998},{"$f":"+Insumos!#REF!","v":{"$error":"#REF!"}},{"$error":"#REF!"}]
["SUB-TOTAL - MATERIAL / EQUIPAMENTOS:",null,{"$f":"SUM(F1662:F1667)","v":{"$error":"#REF!"}}]
["SINAPI C 88245","ALAMBRADOR C/ENCARGOS COMPLEMENTARES","h",{"$f":"1.125*0.57","v":0.64124999999999999},{"$f":"'Planilha_M.O.'!E29","v":20.6},{"$f":"TRUNC(D1669*E1669,2)","v":13.2}]
["SINAPI C 88316","SERVENTE C/ ENCARGOS COMPLEMENTARES","h",{"$f":"0.93*0.57","v":0.53010000000000002},{"$f":"'Planilha_M.O.'!E18","v":17.11},{"$f":"TRUNC(D1670*E1670,2)","v":9.07}]
["SUB-TOTAL - MÃO-DE-OBRA:",null,{"$f":"SUM(F1669:F1670)","v":22.27}]
[]
[null,"CUSTO TOTAL:",null,null,null,{"$f":"+C1668+C1671","v":{"$error":"#REF!"}}]
[]
[null,"BDI:","%",{"$f":"+$F$7","v":"22,15%"},null,{"$f":"TRUNC(F1673*D1675,2)","v":{"$error":"#REF!"}}]
[]
[null,"PREÇO:",null,null,null,{"$f":"+F1673+F1675","v":{"$error":"#REF!"}}]
[]
["CÓDIGO","DISCRIMINAÇÃO","UN","COEFIC.","UNITÁRIO","TOTAL"]
["SMAMS 3719","INSTALAÇÃO TELA h=1,00 m EM ESTRUTURA TUBULAR EXISTENTE DE QUADRA ESPORTIVA","m"]
["SINAPI I 10527","ANDAIME METÁLICO, TIPO TORRE, LARGURA DE 1 A 1,5 m E ALTURA DE 1 m LOCAÇÃO","ms",4.1500000000000002E-2,{"$f":"Insumos!G25","v":23.5},{"$f":"TRUNC(D1681*E1681,2)","v":0.97}]
["SINAPI I 6189","TÁBUA MADEIRA CEDRINHO 2,5 x 30 cm (1 X 12\")","m",3.44E-2,{"$f":"Insumos!G184","v":21.86},0.75]
["SINAPI I 007158","TELA DE ARAME GALVANIZADA QUADRANGULAR / LOSANGULAR, FIO 2,77 MM (12 BWG), MALHA 5 X 5 CM, H = 2 M","m²",1,{"$f":"Insumos!G196","v":23.48},23.48]
["SINAPI I 335","ARAME GALVANIZADO 10 BWG","kg",{"$f":"0.3566*0.334","v":0.1191044},{"$f":"+Insumos!$G$27","v":27.77},3.3]
["SINAPI 342","ARAME GALVANIZADO 12 BWG","kg",{"$f":"0.1486*0.334","v":4.9632400000000007E-2},{"$f":"+Insumos!$G$28","v":23.91},1.18]
[{"$f":"CONCATENATE(\"COTAÇÃO \",[6]Insumos!$B$179)","v":"COTAÇÃO 80"},"ESTICADOR DE ARAME","un",{"$f":"0.4168*0.334","v":0.13921120000000001},{"$f":"+Insumos!#REF!","v":{"$error":"#REF!"}},{"$error":"#REF!"}]
["SUB-TOTAL - MATERIAL / EQUIPAMENTOS:",null,{"$f":"SUM(F1681:F1686)","v":{"$error":"#REF!"}}]
["SINAPI C 88245","ALAMBRADOR C/ENCARGOS COMPLEMENTARES","h",{"$f":"1.125*0.334","v":0.37575000000000003},{"$f":"'Planilha_M.O.'!E29","v":20.6},{"$f":"TRUNC(D1688*E1688,2)","v":7.74}]
["SINAPI C 88316","SERVENTE C/ ENCARGOS COMPLEMENTARES","h",{"$f":"0.93*0.334","v":0.31062000000000001},{"$f":"'Planilha_M.O.'!E18","v":17.11},{"$f":"TRUNC(D1689*E1689,2)","v":5.31}]
["SUB-TOTAL - MÃO-DE-OBRA:",null,{"$f":"SUM(F1688:F1689)","v":13.05}]
[]
[null,"CUSTO TOTAL:",null,null,null,{"$f":"+C1687+C1690","v":{"$error":"#REF!"}}]
[]
[null,"BDI:","%",{"$f":"+$F$7","v":"22,15%"},null,{"$f":"TRUNC(F1692*D1694,2)","v":{"$error":"#REF!"}}]
[]
[null,"PREÇO:",null,null,null,{"$f":"+F1692+F1694","v":{"$error":"#REF!"}}]
[]
["CÓDIGO","DISCRIMINAÇÃO","UN","COEFIC.","UNITÁRIO","TOTAL"]
[3720,"INSTALAÇÃO BANCO C/ENCOSTO","un"]
["COTAÇÃO 113","CAÇAMBA 4,00 m³","un",0.18720000000000001,{"$f":"+Insumos!G66","v":443.33},{"$f":"TRUNC(D1700*E1700,2)","v":82.99}]
["SINAPI C 94963","CONCRETO fck = 15MPa, TRAÇO 1:3,4:3,5 (CIMENTO/ AREIA MÉDIA/ BRITA 1) - PREPARO MECÂNICO COM BETONEIRA 400 l","m³",0.14399999999999999,{"$f":"'Composições Aux. SINAPI'!E37:F37","v":332.32},47.85]
["SUB-TOTAL - MATERIAL / EQUIPAMENTOS:",null,{"$f":"SUM(F1700:F1701)","v":130.84}]
["SINAPI C 88309","PEDREIRO C/ENCARGOS COMPLEMENTARES","h",1.7,{"$f":"'Planilha_M.O.'!E24","v":20.71},{"$f":"TRUNC(D1703*E1703,2)","v":35.200000000000003}]
["SINAPI C 88316","SERVENTE C/ ENCARGOS COMPLEMENTARES","h",1.7,{"$f":"'Planilha_M.O.'!E18","v":17.11},{"$f":"TRUNC(D1704*E1704,2)","v":29.08}]
["SUB-TOTAL - MÃO-DE-OBRA:",null,{"$f":"SUM(F1703:F1704)","v":64.28}]
[]
[null,"CUSTO TOTAL:",null,null,null,{"$f":"+C1702+C1705","v":195.12}]
[]
[null,"BDI:","%",{"$f":"+$F$7","v":"22,15%"},null,{"$f":"TRUNC(F1707*D1709,2)","v":43.21}]
[]
[null,"PREÇO:",null,null,null,{"$f":"+F1707+F1709","v":238.33}]
[]
["CÓDIGO","DISCRIMINAÇÃO","UN","COEFIC.","UNITÁRIO","TOTAL"]
[3723,"INSTALAÇÃO BANCO S/ENCOSTO","un"]
["COTAÇÃO 113","CAÇAMBA 4,00 m³","un",9.3600000000000003E-2,{"$f":"Insumos!G66","v":443.33},{"$f":"TRUNC(D1715*E1715,2)","v":41.49}]
["SINAPI C 94963","CONCRETO fck = 15MPa, TRAÇO 1:3,4:3,5 (CIMENTO/ AREIA MÉDIA/ BRITA 1) - PREPARO MECÂNICO COM BETONEIRA 400 l","m³",7.1999999999999995E-2,{"$f":"'Composições Aux. SINAPI'!E37:F37","v":332.32},23.92]
["SUB-TOTAL - MATERIAL / EQUIPAMENTOS:",null,{"$f":"SUM(F1715:F1716)","v":65.41}]
["SINAPI C 88309","PEDREIRO C/ENCARGOS COMPLEMENTARES","h",1.65,{"$f":"'Planilha_M.O.'!E24","v":20.71},{"$f":"TRUNC(D1718*E1718,2)","v":34.17}]
["SINAPI C 88316","SERVENTE C/ ENCARGOS COMPLEMENTARES","h",1.65,{"$f":"'Planilha_M.O.'!E18","v":17.11},{"$f":"TRUNC(D1719*E1719,2)","v":28.23}]
["SUB-TOTAL - MÃO-DE-OBRA:",null,{"$f":"SUM(F1718:F1719)","v":62.400000000000006}]
[]
[null,"CUSTO TOTAL:",null,null,null,{"$f":"+C1717+C1720","v":127.81}]
[]
[null,"BDI:","%",{"$f":"+$F$7","v":"22,15%"},null,{"$f":"TRUNC(F1722*D1724,2)","v":28.3}]
[]
[null,"PREÇO:",null,null,null,{"$f":"+F1722+F1724","v":156.11000000000001}]
[]
["CÓDIGO","DISCRIMINAÇÃO","UN","COEFIC.","UNITÁRIO","TOTAL"]
[3850,"INSTALAÇÃO GANGORRA DUPLA E TRIPLA","un"]
["COTAÇÃO 113","CAÇAMBA 4,00 m³","un",9.3600000000000003E-2,{"$f":"Insumos!G66","v":443.33},{"$f":"TRUNC(D1730*E1730,2)","v":41.49}]
["SINAPI C 94963","CONCRETO fck = 15MPa, TRAÇO 1:3,4:3,5 (CIMENTO/ AREIA MÉDIA/ BRITA 1) - PREPARO MECÂNICO COM BETONEIRA 400 l","m³",7.1999999999999995E-2,{"$f":"'Composições Aux. SINAPI'!E37:F37","v":332.32},23.92]
["SUB-TOTAL - MATERIAL / EQUIPAMENTOS:",null,{"$f":"SUM(F1730:F1731)","v":65.41}]
["SINAPI C 88309","PEDREIRO C/ENCARGOS COMPLEMENTARES","h",1.6,{"$f":"'Planilha_M.O.'!E24","v":20.71},{"$f":"TRUNC(D1733*E1733,2)","v":33.130000000000003}]
["SINAPI C 88316","SERVENTE C/ ENCARGOS COMPLEMENTARES","h",1.7,{"$f":"'Planilha_M.O.'!E18","v":17.11},{"$f":"TRUNC(D1734*E1734,2)","v":29.08}]
["SUB-TOTAL - MÃO-DE-OBRA:",null,{"$f":"SUM(F1733:F1734)","v":62.21}]
[]
[null,"CUSTO TOTAL:",null,null,null,{"$f":"+C1732+C1735","v":127.62}]
[]
[null,"BDI:","%",{"$f":"+$F$7","v":"22,15%"},null,{"$f":"TRUNC(F1737*D1739,2)","v":28.26}]
[]
[null,"PREÇO:",null,null,null,{"$f":"+F1737+F1739","v":155.88}]
[]
["CÓDIGO","DISCRIMINAÇÃO","UN","COEFIC.","UNITÁRIO","TOTAL"]
[3860,"INSTALAÇÃO BARRA-BALANÇO","un"]
["COTAÇÃO 113","CAÇAMBA 4,00 m³","un",0.66559999999999997,{"$f":"Insumos!G66","v":443.33},{"$f":"TRUNC(D1745*E1745,2)","v":295.08}]
["SINAPI C 94963","CONCRETO fck = 15MPa, TRAÇO 1:3,4:3,5 (CIMENTO/ AREIA MÉDIA/ BRITA 1) - PREPARO MECÂNICO COM BETONEIRA 400 l","m³",0.51200000000000001,{"$f":"'Composições Aux. SINAPI'!E37:F37","v":332.32},170.14]
["SUB-TOTAL - MATERIAL / EQUIPAMENTOS:",null,{"$f":"SUM(F1745:F1746)","v":465.21999999999997}]
["SINAPI C 88309","PEDREIRO C/ENCARGOS COMPLEMENTARES","h",2.798,{"$f":"'Planilha_M.O.'!E24","v":20.71},{"$f":"TRUNC(D1748*E1748,2)","v":57.94}]
["SINAPI C 88316","SERVENTE C/ ENCARGOS COMPLEMENTARES","h",2.798,{"$f":"'Planilha_M.O.'!E18","v":17.11},{"$f":"TRUNC(D1749*E1749,2)","v":47.87}]
["SUB-TOTAL - MÃO-DE-OBRA:",null,{"$f":"SUM(F1748:F1749)","v":105.81}]
[]
[null,"CUSTO TOTAL:",null,null,null,{"$f":"+C1747+C1750","v":571.03}]
[]
[null,"BDI:","%",{"$f":"+$F$7","v":"22,15%"},null,{"$f":"TRUNC(F1752*D1754,2)","v":126.48}]
[]
[null,"PREÇO:",null,null,null,{"$f":"+F1752+F1754","v":697.51}]
[]
["CÓDIGO","DISCRIMINAÇÃO","UN","COEFIC.","UNITÁRIO","TOTAL"]
[3870,"INSTALAÇÃO BALANÇO MISTO, INFANTIL E JUVENIL","un"]
["COTAÇÃO 113","CAÇAMBA 4,00 m³","un",0.49919999999999998,{"$f":"Insumos!G66","v":443.33},{"$f":"TRUNC(D1760*E1760,2)","v":221.31}]
["SINAPI C 94963","CONCRETO fck = 15MPa, TRAÇO 1:3,4:3,5 (CIMENTO/ AREIA MÉDIA/ BRITA 1) - PREPARO MECÂNICO COM BETONEIRA 400 l","m³",0.38400000000000001,{"$f":"'Composições Aux. SINAPI'!E37:F37","v":332.32},127.61]
["SUB-TOTAL - MATERIAL / EQUIPAMENTOS:",null,{"$f":"SUM(F1760:F1761)","v":348.92}]
["SINAPI C 88309","PEDREIRO C/ENCARGOS COMPLEMENTARES","h",2.286,{"$f":"'Planilha_M.O.'!E24","v":20.71},{"$f":"TRUNC(D1763*E1763,2)","v":47.34}]
["SINAPI C 88316","SERVENTE C/ ENCARGOS COMPLEMENTARES","h",2.286,{"$f":"'Planilha_M.O.'!E18","v":17.11},{"$f":"TRUNC(D1764*E1764,2)","v":39.11}]
["SUB-TOTAL - MÃO-DE-OBRA:",null,{"$f":"SUM(F1763:F1764)","v":86.45}]
[]
[null,"CUSTO TOTAL:",null,null,null,{"$f":"+C1762+C1765","v":435.37}]
[]
[null,"BDI:","%",{"$f":"+$F$7","v":"22,15%"},null,{"$f":"TRUNC(F1767*D1769,2)","v":96.43}]
[]
[null,"PREÇO:",null,null,null,{"$f":"+F1767+F1769","v":531.79999999999995}]
[]
["CÓDIGO","DISCRIMINAÇÃO","UN","COEFIC.","UNITÁRIO","TOTAL"]
[3880,"INSTALAÇÃO ESCORREGADOR","un"]
["COTAÇÃO 113","CAÇAMBA 4,00 m³","un",0.45760000000000001,{"$f":"Insumos!G66","v":443.33},{"$f":"TRUNC(D1775*E1775,2)","v":202.86}]
["SINAPI C 94963","CONCRETO fck = 15MPa, TRAÇO 1:3,4:3,5 (CIMENTO/ AREIA MÉDIA/ BRITA 1) - PREPARO MECÂNICO COM BETONEIRA 400 l","m³",0.35199999999999998,{"$f":"'Composições Aux. SINAPI'!E37:F37","v":332.32},116.97]
["SUB-TOTAL - MATERIAL / EQUIPAMENTOS:",null,{"$f":"SUM(F1775:F1776)","v":319.83000000000004}]
["SINAPI C 88309","PEDREIRO C/ENCARGOS COMPLEMENTARES","h",2.1221000000000001,{"$f":"'Planilha_M.O.'!E24","v":20.71},{"$f":"TRUNC(D1778*E1778,2)","v":43.94}]
["SINAPI C 88316","SERVENTE C/ ENCARGOS COMPLEMENTARES","h",2.1221000000000001,{"$f":"'Planilha_M.O.'!E18","v":17.11},{"$f":"TRUNC(D1779*E1779,2)","v":36.299999999999997}]
["SUB-TOTAL - MÃO-DE-OBRA:",null,{"$f":"SUM(F1778:F1779)","v":80.239999999999995}]
[]
[null,"CUSTO TOTAL:",null,null,null,{"$f":"+C1777+C1780","v":400.07000000000005}]
[]
[null,"BDI:","%",{"$f":"+$F$7","v":"22,15%"},null,{"$f":"TRUNC(F1782*D1784,2)","v":88.61}]
[]
[null,"PREÇO:",null,null,null,{"$f":"+F1782+F1784","v":488.68000000000006}]
[]
["CÓDIGO","DISCRIMINAÇÃO","UN","QUANT.","UNITÁRIO","TOTAL"]
[3890,"ESTICAMENTO DE TELAMENTO  H=5,5m","    m"]
["SINAPI I 0043131","ARAME GALVANIZADO 6 BWG, D = 5,16 MM (0,157 KG/M), OU 8 BWG, D = 4,19 MM (0,101 KG/M), OU 10 BWG, D = 3,40 MM (0,0713 KG/M)","kg",0.64170000000000005,{"$f":"Insumos!G27","v":27.77},{"$f":"TRUNC((D1790*E1790),2)","v":17.82}]
["COTAÇÃO 78","ESTICADOR DE ARAME","un",0.58330000000000004,{"$f":"Insumos!#REF!","v":{"$error":"#REF!"}},{"$f":"TRUNC((D1791*E1791),2)","v":{"$error":"#REF!"}}]
["SUB-TOTAL - MATERIAL / EQUIPAMENTOS:",null,{"$f":"SUM(F1790:F1791)","v":{"$error":"#REF!"}}]
["SINAPI C 88254","ALAMBRADOR C/ENCARGOS COMPLEMENTARES","h",0.39,{"$f":"'Planilha_M.O.'!E29","v":20.6},{"$f":"TRUNC((D1793*E1793),2)","v":8.0299999999999994}]
["SINAPI C 88316","SERVENTE C/ ENCARGOS COMPLEMENTARES","h",0.39,{"$f":"'Planilha_M.O.'!E18","v":17.11},{"$f":"TRUNC((D1794*E1794),2)","v":6.67}]
["SUB-TOTAL - MÃO-DE-OBRA:",null,{"$f":"SUM(F1793:F1794)","v":14.7}]
[]
[null,"CUSTO TOTAL:",null,null,null,{"$f":"C1795+C1792","v":{"$error":"#REF!"}}]
[]
[null,"BDI:","%",{"$f":"+$F$7","v":"22,15%"},null,{"$f":"TRUNC((F1797*D1799),2)","v":{"$error":"#REF!"}}]
[]
[null,"PREÇO:",null,null,null,{"$f":"F1797+F1799","v":{"$error":"#REF!"}}]
[]
["CÓDIGO","DISCRIMINAÇÃO","UN","QUANT.","UNITÁRIO","TOTAL"]
[3900,"ESTICAMENTO DE TELAMENTO  H=3,00m","    m"]
["SINAPI I 0043131","ARAME GALVANIZADO 6 BWG, D = 5,16 MM (0,157 KG/M), OU 8 BWG, D = 4,19 MM (0,101 KG/M), OU 10 BWG, D = 3,40 MM (0,0713 KG/M)","kg",0.35649999999999998,{"$f":"Insumos!G27","v":27.77},{"$f":"TRUNC((D1805*E1805),2)","v":9.9}]
["COTAÇÃO 78","ESTICADOR DE ARAME","un",0.41670000000000001,{"$f":"Insumos!#REF!","v":{"$error":"#REF!"}},{"$f":"TRUNC((D1806*E1806),2)","v":{"$error":"#REF!"}}]
["SUB-TOTAL - MATERIAL / EQUIPAMENTOS:",null,{"$f":"SUM(F1805:F1806)","v":{"$error":"#REF!"}}]
["SINAPI C 88254","ALAMBRADOR C/ENCARGOS COMPLEMENTARES","h",0.31,{"$f":"'Planilha_M.O.'!E29","v":20.6},{"$f":"TRUNC((D1808*E1808),2)","v":6.38}]
["SINAPI C 88316","SERVENTE C/ ENCARGOS COMPLEMENTARES","h",0.31,{"$f":"'Planilha_M.O.'!E18","v":17.11},{"$f":"TRUNC((D1809*E1809),2)","v":5.3}]
["SUB-TOTAL - MÃO-DE-OBRA:",null,{"$f":"SUM(F1808:F1809)","v":11.68}]
[]
[null,"CUSTO TOTAL:",null,null,null,{"$f":"C1810+C1807","v":{"$error":"#REF!"}}]
[]
[null,"BDI:","%",{"$f":"+$F$7","v":"22,15%"},null,{"$f":"TRUNC((F1812*D1814),2)","v":{"$error":"#REF!"}}]
[]
[null,"PREÇO:",null,null,null,{"$f":"F1812+F1814","v":{"$error":"#REF!"}}]
[]
["CÓDIGO","DISCRIMINAÇÃO","UN","QUANT.","UNITÁRIO","TOTAL"]
[3901,"ESTICAMENTO DE TELAMENTO  H=1,70 m","    m"]
["SINAPI I 0043131","ARAME GALVANIZADO 6 BWG, D = 5,16 MM (0,157 KG/M), OU 8 BWG, D = 4,19 MM (0,101 KG/M), OU 10 BWG, D = 3,40 MM (0,0713 KG/M)","kg",{"$f":"0.3565*1.7/3","v":0.20201666666666665},{"$f":"Insumos!G26","v":27.77},{"$f":"TRUNC((D1820*E1820),2)","v":5.61}]
["COTAÇÃO 78","ESTICADOR DE ARAME","un",{"$f":"0.4167*1.7/3","v":0.23612999999999998},{"$f":"Insumos!#REF!","v":{"$error":"#REF!"}},{"$f":"TRUNC((D1821*E1821),2)","v":{"$error":"#REF!"}}]
["SUB-TOTAL - MATERIAL / EQUIPAMENTOS:",null,{"$f":"SUM(F1820:F1821)","v":{"$error":"#REF!"}}]
["SINAPI C 88254","ALAMBRADOR C/ENCARGOS COMPLEMENTARES","h",0.23,{"$f":"'Planilha_M.O.'!E29","v":20.6},{"$f":"TRUNC((D1823*E1823),2)","v":4.7300000000000004}]
["SINAPI C 88316","SERVENTE C/ ENCARGOS COMPLEMENTARES","h",0.23,{"$f":"'Planilha_M.O.'!E18","v":17.11},{"$f":"TRUNC((D1824*E1824),2)","v":3.93}]
["SUB-TOTAL - MÃO-DE-OBRA:",null,{"$f":"SUM(F1823:F1824)","v":8.66}]
[]
[null,"CUSTO TOTAL:",null,null,null,{"$f":"C1825+C1822","v":{"$error":"#REF!"}}]
[]
[null,"BDI:","%",{"$f":"+$F$7","v":"22,15%"},null,{"$f":"TRUNC((F1827*D1829),2)","v":{"$error":"#REF!"}}]
[]
[null,"PREÇO:",null,null,null,{"$f":"F1827+F1829","v":{"$error":"#REF!"}}]
[]
["CÓDIGO","DISCRIMINAÇÃO","UN","QUANT.","UNITÁRIO","TOTAL"]
[3902,"ESTICAMENTO DE TELAMENTO  H=1,00 m","    m"]
["SINAPI I 0043131","ARAME GALVANIZADO 6 BWG, D = 5,16 MM (0,157 KG/M), OU 8 BWG, D = 4,19 MM (0,101 KG/M), OU 10 BWG, D = 3,40 MM (0,0713 KG/M)","kg",{"$f":"0.3565*0.334","v":0.119071},{"$f":"Insumos!G27","v":27.77},{"$f":"TRUNC((D1835*E1835),2)","v":3.3}]
["COTAÇÃO 78","ESTICADOR DE ARAME","un",{"$f":"0.4167*0.334","v":0.13917780000000002},{"$f":"Insumos!#REF!","v":{"$error":"#REF!"}},{"$f":"TRUNC((D1836*E1836),2)","v":{"$error":"#REF!"}}]
["SUB-TOTAL - MATERIAL / EQUIPAMENTOS:",null,{"$f":"SUM(F1835:F1836)","v":{"$error":"#REF!"}}]
["SINAPI C 88254","ALAMBRADOR C/ENCARGOS COMPLEMENTARES","h",0.21,{"$f":"'Planilha_M.O.'!E29","v":20.6},{"$f":"TRUNC((D1838*E1838),2)","v":4.32}]
["SINAPI C 88316","SERVENTE C/ ENCARGOS COMPLEMENTARES","h",0.21,{"$f":"'Planilha_M.O.'!E18","v":17.11},{"$f":"TRUNC((D1839*E1839),2)","v":3.59}]
["SUB-TOTAL - MÃO-DE-OBRA:",null,{"$f":"SUM(F1838:F1839)","v":7.91}]
[]
[null,"CUSTO TOTAL:",null,null,null,{"$f":"C1840+C1837","v":{"$error":"#REF!"}}]
[]
[null,"BDI:","%",{"$f":"+$F$7","v":"22,15%"},null,{"$f":"TRUNC((F1842*D1844),2)","v":{"$error":"#REF!"}}]
[]
[null,"PREÇO:",null,null,null,{"$f":"F1842+F1844","v":{"$error":"#REF!"}}]
[]
["CÓDIGO","DISCRIMINAÇÃO","UN","QUANT.","UNITÁRIO","TOTAL"]
[3910,"INSTALAÇÃO DE CADEIRA DE BALANÇO","   un"]
["SINAPI C 88309","PEDREIRO C/ENCARGOS COMPLEMENTARES","h",0.75,{"$f":"'Planilha_M.O.'!E24","v":20.71},{"$f":"TRUNC((D1850*E1850),2)","v":15.53}]
["SINAPI C 88316","SERVENTE C/ ENCARGOS COMPLEMENTARES","h",1,{"$f":"'Planilha_M.O.'!E18","v":17.11},{"$f":"TRUNC((D1851*E1851),2)","v":17.11}]
["SUB-TOTAL - MÃO-DE-OBRA:",null,{"$f":"SUM(F1850:F1851)","v":32.64}]
[]
[null,"CUSTO TOTAL:",null,null,null,{"$f":"C1852","v":32.64}]
[]
[null,"BDI:","%",{"$f":"+$F$7","v":"22,15%"},null,{"$f":"TRUNC((F1854*D1856),2)","v":7.22}]
[]
[null,"PREÇO:",null,null,null,{"$f":"F1854+F1856","v":39.86}]
[]
["CÓDIGO","DISCRIMINAÇÃO","UN","QUANT.","UNITÁRIO","TOTAL"]
[3920,"INSTALAÇÃO DE PRANCHA DE ASSENTO DE GANGORA","   un"]
["SINAPI C 88309","PEDREIRO C/ENCARGOS COMPLEMENTARES","h",0.65,{"$f":"'Planilha_M.O.'!E24","v":20.71},{"$f":"TRUNC((D1862*E1862),2)","v":13.46}]
["SINAPI C 88316","SERVENTE C/ ENCARGOS COMPLEMENTARES","h",1.25,{"$f":"'Planilha_M.O.'!E18","v":17.11},{"$f":"TRUNC((D1863*E1863),2)","v":21.38}]
["SUB-TOTAL - MÃO-DE-OBRA:",null,{"$f":"SUM(F1862:F1863)","v":34.840000000000003}]
[]
[null,"CUSTO TOTAL:",null,null,null,{"$f":"C1864","v":34.840000000000003}]
[]
[null,"BDI:","%",{"$f":"+$F$7","v":"22,15%"},null,{"$f":"TRUNC((F1866*D1868),2)","v":7.71}]
[]
[null,"PREÇO:",null,null,null,{"$f":"F1866+F1868","v":42.550000000000004}]
[]
["CÓDIGO","DISCRIMINAÇÃO","UN","QUANT.","UNITÁRIO","TOTAL"]
[3930,"INSTALAÇÃO DE PRANCHA DE ASSENTO DO BARRA BALANÇO","   un"]
["SINAPI C 88309","PEDREIRO C/ENCARGOS COMPLEMENTARES","h",1.5,{"$f":"'Planilha_M.O.'!E24","v":20.71},{"$f":"TRUNC((D1874*E1874),2)","v":31.06}]
["SINAPI C 88316","SERVENTE C/ ENCARGOS COMPLEMENTARES","h",2,{"$f":"'Planilha_M.O.'!E18","v":17.11},{"$f":"TRUNC((D1875*E1875),2)","v":34.22}]
["SUB-TOTAL - MÃO-DE-OBRA:",null,{"$f":"SUM(F1874:F1875)","v":65.28}]
[]
[null,"CUSTO TOTAL:",null,null,null,{"$f":"C1876","v":65.28}]
[]
[null,"BDI:","%",{"$f":"+$F$7","v":"22,15%"},null,{"$f":"TRUNC((F1878*D1880),2)","v":14.45}]
[]
[null,"PREÇO:",null,null,null,{"$f":"F1878+F1880","v":79.73}]
[]
["CÓDIGO","DISCRIMINAÇÃO","UN","QUANT.","UNITÁRIO","TOTAL"]
[3940,"INSTALAÇÃO DE PEGA MÃO","   un"]
["SINAPI C 88309","PEDREIRO C/ENCARGOS COMPLEMENTARES","h",0.9,{"$f":"'Planilha_M.O.'!E24","v":20.71},{"$f":"TRUNC((D1886*E1886),2)","v":18.63}]
["SUB-TOTAL - MÃO-DE-OBRA:",null,{"$f":"SUM(F1886:F1886)","v":18.63}]
[]
[null,"CUSTO TOTAL:",null,null,null,{"$f":"C1887","v":18.63}]
[]
[null,"BDI:","%",{"$f":"+$F$7","v":"22,15%"},null,{"$f":"TRUNC((F1889*D1891),2)","v":4.12}]
[]
[null,"PREÇO:",null,null,null,{"$f":"F1889+F1891","v":22.75}]
[]
["CÓDIGO","DISCRIMINAÇÃO","UN","QUANT.","UNITÁRIO","TOTAL"]
[3950,"INSTALAÇÃO DE CORRIMÃO","m"]
["SINAPI C 88309","PEDREIRO C/ENCARGOS COMPLEMENTARES","h",0.9,{"$f":"'Planilha_M.O.'!E24","v":20.71},{"$f":"TRUNC((D1897*E1897),2)","v":18.63}]
["SINAPI C 88316","SERVENTE C/ ENCARGOS COMPLEMENTARES","h",0.9,{"$f":"'Planilha_M.O.'!E18","v":17.11},{"$f":"TRUNC((D1898*E1898),2)","v":15.39}]
["SUB-TOTAL - MÃO-DE-OBRA:",null,{"$f":"SUM(F1897:F1898)","v":34.019999999999996}]
[]
[null,"CUSTO TOTAL:",null,null,null,{"$f":"C1899","v":34.019999999999996}]
[]
[null,"BDI:","%",{"$f":"+$F$7","v":"22,15%"},null,{"$f":"TRUNC((F1901*D1903),2)","v":7.53}]
[]
[null,"PREÇO:",null,null,null,{"$f":"F1901+F1903","v":41.55}]
[]
["CÓDIGO","DISCRIMINAÇÃO","UN","QUANT.","UNITÁRIO","TOTAL"]
[3960,"FIXAÇÃO DE CHUMBADOR  EQUIPAMENTOS  ( SAPATA 30X30)","   un"]
["COTAÇÃO 113","CAÇAMBA 4,00 m³","un",5.8500000000000002E-3,{"$f":"Insumos!G66","v":443.33},{"$f":"TRUNC(D1909*E1909,2)","v":2.59}]
["SINAPI C 94963","CONCRETO fck = 15MPa, TRAÇO 1:3,4:3,5 (CIMENTO/ AREIA MÉDIA/ BRITA 1) - PREPARO MECÂNICO COM BETONEIRA 400 l","m³",4.4999999999999998E-2,{"$f":"'Composições Aux. SINAPI'!E37:F37","v":332.32},14.95]
["SUB-TOTAL - MATERIAL / EQUIPAMENTOS:",null,{"$f":"SUM(F1909:F1910)","v":17.54}]
["SINAPI C 88309","PEDREIRO C/ENCARGOS COMPLEMENTARES","h",0.14399999999999999,{"$f":"'Planilha_M.O.'!E24","v":20.71},{"$f":"TRUNC((D1912*E1912),2)","v":2.98}]
["SINAPI C 88316","SERVENTE C/ ENCARGOS COMPLEMENTARES","h",0.61919999999999997,{"$f":"'Planilha_M.O.'!E18","v":17.11},{"$f":"TRUNC((D1913*E1913),2)","v":10.59}]
["SUB-TOTAL - MÃO-DE-OBRA:",null,{"$f":"SUM(F1912:F1913)","v":13.57}]
[]
[null,"CUSTO TOTAL:",null,null,null,{"$f":"+C1911+C1914","v":31.11}]
[]
[null,"BDI:","%",{"$f":"+$F$7","v":"22,15%"},null,{"$f":"TRUNC((F1916*D1918),2)","v":6.89}]
[]
[null,"PREÇO:",null,null,null,{"$f":"+C1911+F1918+C1914","v":38}]
[]
["CÓDIGO","DISCRIMINAÇÃO","UN","QUANT.","UNITÁRIO","TOTAL"]
[3970,"INSTALAÇÃO DE PRANCHA DE ASSENTO OU ENCOSTO DE BANCO","   un"]
["SINAPI C 88309","PEDREIRO C/ENCARGOS COMPLEMENTARES","h",0.75,{"$f":"'Planilha_M.O.'!E24","v":20.71},{"$f":"TRUNC((D1924*E1924),2)","v":15.53}]
["SINAPI C 88316","SERVENTE C/ ENCARGOS COMPLEMENTARES","h",1.45,{"$f":"'Planilha_M.O.'!E18","v":17.11},{"$f":"TRUNC((D1925*E1925),2)","v":24.8}]
["SUB-TOTAL - MÃO-DE-OBRA:",null,{"$f":"SUM(F1924:F1925)","v":40.33}]
[]
[null,"CUSTO TOTAL:",null,null,null,{"$f":"C1926","v":40.33}]
[]
[null,"BDI:","%",{"$f":"+$F$7","v":"22,15%"},null,{"$f":"TRUNC((F1928*D1930),2)","v":8.93}]
[]
[null,"PREÇO:",null,null,null,{"$f":"F1928+F1930","v":49.26}]
[]
["CÓDIGO","DISCRIMINAÇÃO","UN","COEFIC.","UNITÁRIO","TOTAL"]
["2430A","INSTALAÇÃO DE GOLEIRA DE FUTSAL","un"]
["COTAÇÃO 113","CAÇAMBA 4,00 m³","un",5.8500000000000002E-3,{"$f":"Insumos!G66","v":443.33},{"$f":"TRUNC(D1936*E1936,2)","v":2.59}]
["SINAPI C 94963","CONCRETO fck = 15MPa, TRAÇO 1:3,4:3,5 (CIMENTO/ AREIA MÉDIA/ BRITA 1) - PREPARO MECÂNICO COM BETONEIRA 400 l","m³",4.4999999999999998E-2,{"$f":"'Composições Aux. SINAPI'!E37:F37","v":332.32},14.95]
["SUB-TOTAL - MATERIAL / EQUIPAMENTOS:",null,{"$f":"SUM(F1936:F1937)","v":17.54}]
["SINAPI C 88309","PEDREIRO C/ENCARGOS COMPLEMENTARES","h",1.79,{"$f":"'Planilha_M.O.'!E24","v":20.71},{"$f":"TRUNC(D1939*E1939,2)","v":37.07}]
["SINAPI C 88316","SERVENTE C/ ENCARGOS COMPLEMENTARES","h",1.79,{"$f":"'Planilha_M.O.'!E18","v":17.11},{"$f":"TRUNC(D1940*E1940,2)","v":30.62}]
["SUB-TOTAL - MÃO-DE-OBRA:",null,{"$f":"SUM(F1939:F1940)","v":67.69}]
[]
[null,"CUSTO TOTAL:",null,null,null,{"$f":"+C1938+C1941","v":85.22999999999999}]
[]
[null,"BDI:","%",{"$f":"+$F$7","v":"22,15%"},null,{"$f":"TRUNC(F1943*D1945,2)","v":18.87}]
[]
[null,"PREÇO:",null,null,null,{"$f":"+F1943+F1945","v":104.1}]
[]
["CÓDIGO","DISCRIMINAÇÃO","UN","COEFIC.","UNITÁRIO","TOTAL"]
["2433A","INSTALAÇÃO DE GOLEIRA DE FUTEBOL SOCIETY","un"]
["COTAÇÃO 113","CAÇAMBA 4,00 m³","un",1.04E-2,{"$f":"Insumos!G66","v":443.33},{"$f":"TRUNC(D1951*E1951,2)","v":4.6100000000000003}]
["SINAPI C 94963","CONCRETO fck = 15MPa, TRAÇO 1:3,4:3,5 (CIMENTO/ AREIA MÉDIA/ BRITA 1) - PREPARO MECÂNICO COM BETONEIRA 400 l","m³",0.08,{"$f":"'Composições Aux. SINAPI'!E37:F37","v":332.32},26.58]
["SUB-TOTAL - MATERIAL / EQUIPAMENTOS:",null,{"$f":"SUM(F1951:F1952)","v":31.189999999999998}]
["SINAPI C 88310","PINTOR C/ENCARGOS COMPLEMENTARES","h",1.79,{"$f":"'Planilha_M.O.'!E25","v":21.7},{"$f":"TRUNC(D1954*E1954,2)","v":38.840000000000003}]
["SINAPI C 88316","SERVENTE C/ ENCARGOS COMPLEMENTARES","h",1.79,{"$f":"'Planilha_M.O.'!E18","v":17.11},{"$f":"TRUNC(D1955*E1955,2)","v":30.62}]
["SUB-TOTAL - MÃO-DE-OBRA:",null,{"$f":"SUM(F1954:F1955)","v":69.460000000000008}]
[]
[null,"CUSTO TOTAL:",null,null,null,{"$f":"+C1953+C1956","v":100.65}]
[]
[null,"BDI:","%",{"$f":"+$F$7","v":"22,15%"},null,{"$f":"TRUNC(F1958*D1960,2)","v":22.29}]
[]
[null,"PREÇO:",null,null,null,{"$f":"+F1958+F1960","v":122.94}]
[]
["CÓDIGO","DISCRIMINAÇÃO","UN","COEFIC.","UNITÁRIO","TOTAL"]
["2435A","INSTALAÇÃO DE GOLEIRA DE FUTEBOL DE CAMPO","un"]
["COTAÇÃO 113","CAÇAMBA 4,00 m³","un",0.12479999999999999,{"$f":"Insumos!G66","v":443.33},{"$f":"TRUNC(D1966*E1966,2)","v":55.32}]
["SINAPI C 94963","CONCRETO fck = 15MPa, TRAÇO 1:3,4:3,5 (CIMENTO/ AREIA MÉDIA/ BRITA 1) - PREPARO MECÂNICO COM BETONEIRA 400 l","m³",9.6000000000000002E-2,{"$f":"'Composições Aux. SINAPI'!E37:F37","v":332.32},31.9]
["SUB-TOTAL - MATERIAL / EQUIPAMENTOS:",null,{"$f":"SUM(F1966:F1967)","v":87.22}]
["SINAPI C 88310","PINTOR C/ENCARGOS COMPLEMENTARES","h",1.89,{"$f":"'Planilha_M.O.'!E25","v":21.7},{"$f":"TRUNC(D1969*E1969,2)","v":41.01}]
["SINAPI C 88316","SERVENTE C/ ENCARGOS COMPLEMENTARES","h",1.89,{"$f":"'Planilha_M.O.'!E18","v":17.11},{"$f":"TRUNC(D1970*E1970,2)","v":32.33}]
["SUB-TOTAL - MÃO-DE-OBRA:",null,{"$f":"SUM(F1969:F1970)","v":73.34}]
[]
[null,"CUSTO TOTAL:",null,null,null,{"$f":"+C1968+C1971","v":160.56}]
[]
[null,"BDI:","%",{"$f":"+$F$7","v":"22,15%"},null,{"$f":"TRUNC(F1973*D1975,2)","v":35.56}]
[]
[null,"PREÇO:",null,null,null,{"$f":"+F1973+F1975","v":196.12}]
[]
["CÓDIGO","DISCRIMINAÇÃO","UN","COEFIC.","UNITÁRIO","TOTAL"]
["2440 A","INSTALAÇÃO DE POSTE DE VÔLEI - SEM FORNECIMENTO","un"]
["COTAÇÃO 113","CAÇAMBA 4,00 m³","un",1.04E-2,{"$f":"Insumos!G66","v":443.33},{"$f":"TRUNC(D1981*E1981,2)","v":4.6100000000000003}]
["SINAPI C 94963","CONCRETO fck = 15MPa, TRAÇO 1:3,4:3,5 (CIMENTO/ AREIA MÉDIA/ BRITA 1) - PREPARO MECÂNICO COM BETONEIRA 400 l","m³",0.08,{"$f":"'Composições Aux. SINAPI'!E37:F37","v":332.32},26.58]
["SINAPI I 00033","ACO CA-50, 8,0 MM, VERGALHAO","kg",0.2351,{"$f":"Insumos!G16","v":12.73},2.99]
["SUB-TOTAL - MATERIAL / EQUIPAMENTOS:",null,{"$f":"SUM(F1981:F1983)","v":34.18}]
["SINAPI C 88310","PINTOR C/ENCARGOS COMPLEMENTARES","h",1.1000000000000001,{"$f":"'Planilha_M.O.'!E25","v":21.7},{"$f":"TRUNC(D1985*E1985,2)","v":23.87}]
["SINAPI C 88316","SERVENTE C/ ENCARGOS COMPLEMENTARES","h",1.1000000000000001,{"$f":"'Planilha_M.O.'!E18","v":17.11},{"$f":"TRUNC(D1986*E1986,2)","v":18.82}]
["SUB-TOTAL - MÃO-DE-OBRA:",null,{"$f":"SUM(F1985:F1986)","v":42.69}]
[]
[null,"CUSTO TOTAL:",null,null,null,{"$f":"+C1984+C1987","v":76.87}]
[]
[null,"BDI:","%",{"$f":"+$F$7","v":"22,15%"},null,{"$f":"TRUNC(F1989*D1991,2)","v":17.02}]
[]
[null,"PREÇO:",null,null,null,{"$f":"+F1989+F1991","v":93.89}]
[]
["CÓDIGO","DISCRIMINAÇÃO","UN","COEFIC.","UNITÁRIO","TOTAL"]
["2445 A","INSTALAÇÃO DE POSTE DE VÔLEI - QUADRA DE AREIA - SEM FORNECIMENTO","un"]
["COTAÇÃO 113","CAÇAMBA 4,00 m³","un",1.04E-2,{"$f":"Insumos!G66","v":443.33},{"$f":"TRUNC(D1997*E1997,2)","v":4.6100000000000003}]
["SINAPI C 94963","CONCRETO fck = 15MPa, TRAÇO 1:3,4:3,5 (CIMENTO/ AREIA MÉDIA/ BRITA 1) - PREPARO MECÂNICO COM BETONEIRA 400 l","m³",0.08,{"$f":"'Composições Aux. SINAPI'!E37:F37","v":332.32},26.58]
["SINAPI I 00033","ACO CA-50, 8,0 MM, VERGALHAO","kg",0.2351,{"$f":"Insumos!G16","v":12.73},2.99]
["SUB-TOTAL - MATERIAL / EQUIPAMENTOS:",null,{"$f":"SUM(F1997:F1999)","v":34.18}]
["SINAPI C 88310","PINTOR C/ENCARGOS COMPLEMENTARES","h",1.1000000000000001,{"$f":"'Planilha_M.O.'!E25","v":21.7},{"$f":"TRUNC(D2001*E2001,2)","v":23.87}]
["SINAPI C 88316","SERVENTE C/ ENCARGOS COMPLEMENTARES","h",1.1000000000000001,{"$f":"'Planilha_M.O.'!E18","v":17.11},{"$f":"TRUNC(D2002*E2002,2)","v":18.82}]
["SUB-TOTAL - MÃO-DE-OBRA:",null,{"$f":"SUM(F2001:F2002)","v":42.69}]
[]
[null,"CUSTO TOTAL:",null,null,null,{"$f":"+C2000+C2003","v":76.87}]
[]
[null,"BDI:","%",{"$f":"+$F$7","v":"22,15%"},null,{"$f":"TRUNC(F2005*D2007,2)","v":17.02}]
[]
[null,"PREÇO:",null,null,null,{"$f":"+F2005+F2007","v":93.89}]
[]
["CÓDIGO","DISCRIMINAÇÃO","UN","COEFIC.","UNITÁRIO","TOTAL"]
["2450B","INSTALAÇÃO E FORNECIMENTO DE TABELA DE BASQUETE - CHAPA METÁLICA + ARO","un"]
["SINAPI I 4777","CANTONEIRA FERRO 1 1/4\" x 1/8\"","kg",17.100000000000001,{"$f":"Insumos!G73","v":10.65},{"$f":"TRUNC(D2013*E2013,2)","v":182.11}]
["SINAPI I 0011046","CHAPA DE ACO GALVANIZADA BITOLA GSG 18, E = 1,25 MM (10,00 KG/M2)","kg",12.8969,{"$f":"Insumos!G75","v":15.77},203.38]
["SINAPI I 00011049","CHAPA DE ACO GALVANIZADA BITOLA GSG 22, E = 0,80 MM (6,40 KG/M2)","kg",6.4,{"$f":"Insumos!G76","v":16.43},105.15]
["SINAPI I 0011051","CHAPA DE ACO GALVANIZADA BITOLA GSG 26, E = 0,50 MM (4,00 KG/M2)","kg",4,{"$f":"Insumos!G77","v":17.25},69]
["SINAPI I 4339","PORCA SEXTAVADA AÇO ZINCADO 1/2\"","un",4,{"$f":"Insumos!G161","v":0.34},1.36]
["SINAPI I 4342","PORCA SEXTAVADA AÇO ZINCADO 3/8\"","un",4,{"$f":"Insumos!G162","v":0.14000000000000001},0.56000000000000005]
["COTAÇÃO 56","PARAFUSO SEXTAVADO AÇO ZINCADO 1/2\" x 3 1/2\"","un",4,{"$f":"Insumos!G144","v":3.38},13.52]
["SINAPI I 4332","PARAFUSO SEXTAVADO AÇO ZINCADO 3/8\" x 2\"","un",4,{"$f":"Insumos!G142","v":0.68},2.72]
["SINAPI I 5318","SOLVENTE DILUENTE A BASE DE AGUARRÁS","l",0.48409999999999997,{"$f":"Insumos!G182","v":17.98},8.6999999999999993]
["SINAPI I 7292","TINTA ESMALTE SINTÉTICO ALTO BRILHO","l",2.7080000000000002,{"$f":"Insumos!G204","v":27.61},74.760000000000005]
["COTAÇÃO 108","FUNDO P/GALVANIZADO","l",0.4536,{"$f":"Insumos!G108","v":34.81},15.78]
["SINAPI I 3768","LIXA P/FERRO","fl",5,{"$f":"Insumos!G119","v":3.37},16.850000000000001]
["SUB-TOTAL - MATERIAL / EQUIPAMENTOS:",null,{"$f":"SUM(F2013:F2024)","v":693.89}]
["SINAPI C 88315","SERRALHEIRO C/ENCARGOS COMPLEMENTARES","h",5,{"$f":"'Planilha_M.O.'!E30","v":20.6},{"$f":"TRUNC(D2026*E2026,2)","v":103}]
["SINAPI C 88310","PINTOR C/ENCARGOS COMPLEMENTARES","h",5,{"$f":"'Planilha_M.O.'!E25","v":21.7},{"$f":"TRUNC(D2027*E2027,2)","v":108.5}]
["SINAPI C 88316","SERVENTE C/ ENCARGOS COMPLEMENTARES","h",2.35,{"$f":"'Planilha_M.O.'!E18","v":17.11},{"$f":"TRUNC(D2028*E2028,2)","v":40.200000000000003}]
["SUB-TOTAL - MÃO-DE-OBRA:",null,{"$f":"SUM(F2026:F2028)","v":251.7}]
[]
[null,"CUSTO TOTAL:",null,null,null,{"$f":"+C2025+C2029","v":945.58999999999992}]
[]
[null,"BDI:","%",{"$f":"+$F$7","v":"22,15%"},null,{"$f":"TRUNC(F2031*D2033,2)","v":209.44}]
[]
[null,"PREÇO:",null,null,null,{"$f":"+F2031+F2033","v":1155.03}]
[]
["CÓDIGO","DISCRIMINAÇÃO","UN","COEFIC.","UNITÁRIO","TOTAL"]
["2690 A","INSTALAÇÃO E FORNECIMENTO DE MOURÃO DE CONCRETO COM BLOCO FUNDAÇÃO","m"]
["COTAÇÃO 113","CAÇAMBA 4,00 m³","un",1.04E-2,{"$f":"Insumos!G66","v":443.33},{"$f":"TRUNC(D2039*E2039,2)","v":4.6100000000000003}]
["SINAPI C 94963","CONCRETO fck = 15MPa, TRAÇO 1:3,4:3,5 (CIMENTO/ AREIA MÉDIA/ BRITA 1) - PREPARO MECÂNICO COM BETONEIRA 400 l","m³",0.08,{"$f":"'Composições Aux. SINAPI'!E37:F37","v":332.32},26.58]
["SINAPI I 4107","MOURÃO DE CONCRETO RETO, 10 x 10 cm, h= 2,30 m","un",1,{"$f":"Insumos!G127","v":43.99},43.99]
["SUB-TOTAL - MATERIAL / EQUIPAMENTOS:",null,{"$f":"SUM(F2039:F2041)","v":75.180000000000007}]
["SINAPI C 88309","PEDREIRO C/ENCARGOS COMPLEMENTARES","h",0.12790000000000001,{"$f":"'Planilha_M.O.'!E24","v":20.71},{"$f":"TRUNC(D2043*E2043,2)","v":2.64}]
["SINAPI C 88316","SERVENTE C/ ENCARGOS COMPLEMENTARES","h",0.33400000000000002,{"$f":"'Planilha_M.O.'!E18","v":17.11},{"$f":"TRUNC(D2044*E2044,2)","v":5.71}]
["SUB-TOTAL - MÃO-DE-OBRA:",null,{"$f":"SUM(F2043:F2044)","v":8.35}]
[]
[null,"CUSTO TOTAL:",null,null,null,{"$f":"+C2042+C2045","v":83.53}]
[]
[null,"BDI:","%",{"$f":"+$F$7","v":"22,15%"},null,{"$f":"TRUNC(F2047*D2049,2)","v":18.5}]
[]
[null,"PREÇO:",null,null,null,{"$f":"+F2047+F2049","v":102.03}]
[]
["CÓDIGO","DISCRIMINAÇÃO","UN","COEFIC.","UNITÁRIO","TOTAL"]
["3005 A","INSTALAÇÃO DE EQUIPAMENTOS DE GINÁSTICA PADRÃO SMAMS - APOIO P/ MEBROS SUPERIORES -  BARRA ALONGAMENTO 2 ALTURAS - BARRA PARA ALONGAMENTOS","un"]
["COTAÇÃO 113","CAÇAMBA 4,00 m³","un",9.3600000000000003E-2,{"$f":"Insumos!G66","v":443.33},{"$f":"TRUNC(D2055*E2055,2)","v":41.49}]
["SINAPI C 94963","CONCRETO fck = 15MPa, TRAÇO 1:3,4:3,5 (CIMENTO/ AREIA MÉDIA/ BRITA 1) - PREPARO MECÂNICO COM BETONEIRA 400 l","m³",7.1999999999999995E-2,{"$f":"'Composições Aux. SINAPI'!E37:F37","v":332.32},23.92]
["SUB-TOTAL - MATERIAL / EQUIPAMENTOS:",null,{"$f":"SUM(F2055:F2056)","v":65.41}]
["SINAPI C 88309","PEDREIRO C/ENCARGOS COMPLEMENTARES","h",1.69,{"$f":"'Planilha_M.O.'!E24","v":20.71},{"$f":"TRUNC(D2058*E2058,2)","v":34.99}]
["SINAPI C 88316","SERVENTE C/ ENCARGOS COMPLEMENTARES","h",1.69,{"$f":"'Planilha_M.O.'!E18","v":17.11},{"$f":"TRUNC(D2059*E2059,2)","v":28.91}]
["SUB-TOTAL - MÃO-DE-OBRA:",null,{"$f":"SUM(F2058:F2059)","v":63.900000000000006}]
[]
[null,"CUSTO TOTAL:",null,null,null,{"$f":"+C2057+C2060","v":129.31}]
[]
[null,"BDI:","%",{"$f":"+$F$7","v":"22,15%"},null,{"$f":"TRUNC(F2062*D2064,2)","v":28.64}]
[]
[null,"PREÇO:",null,null,null,{"$f":"+F2062+F2064","v":157.94999999999999}]
[]
["CÓDIGO","DISCRIMINAÇÃO","UN","COEFIC.","UNITÁRIO","TOTAL"]
["3005 B","INSTALAÇÃO DE EQUIPAMENTOS DE GINÁSTICA PADRÃO SMAMS - BARRA HORIZONTAL 1 MÓDULO - ESPALDAR - PRANCHA DE ABDOMINAL","un"]
["COTAÇÃO 113","CAÇAMBA 4,00 m³","un",0.11700000000000001,{"$f":"Insumos!G66","v":443.33},{"$f":"TRUNC(D2070*E2070,2)","v":51.86}]
["SINAPI C 94963","CONCRETO fck = 15MPa, TRAÇO 1:3,4:3,5 (CIMENTO/ AREIA MÉDIA/ BRITA 1) - PREPARO MECÂNICO COM BETONEIRA 400 l","m³",0.09,{"$f":"'Composições Aux. SINAPI'!E37:F37","v":332.32},29.9]
["SUB-TOTAL - MATERIAL / EQUIPAMENTOS:",null,{"$f":"SUM(F2070:F2071)","v":81.759999999999991}]
["SINAPI C 88309","PEDREIRO C/ENCARGOS COMPLEMENTARES","h",1.85,{"$f":"'Planilha_M.O.'!E24","v":20.71},{"$f":"TRUNC(D2073*E2073,2)","v":38.31}]
["SINAPI C 88316","SERVENTE C/ ENCARGOS COMPLEMENTARES","h",1.85,{"$f":"'Planilha_M.O.'!E18","v":17.11},{"$f":"TRUNC(D2074*E2074,2)","v":31.65}]
["SUB-TOTAL - MÃO-DE-OBRA:",null,{"$f":"SUM(F2073:F2074)","v":69.960000000000008}]
[]
[null,"CUSTO TOTAL:",null,null,null,{"$f":"+C2072+C2075","v":151.72}]
[]
[null,"BDI:","%",{"$f":"+$F$7","v":"22,15%"},null,{"$f":"TRUNC(F2077*D2079,2)","v":33.6}]
[]
[null,"PREÇO:",null,null,null,{"$f":"+F2077+F2079","v":185.32}]
[]
["CÓDIGO","DISCRIMINAÇÃO","UN","COEFIC.","UNITÁRIO","TOTAL"]
["3005 C","INSTALAÇÃO DE EQUIPAMENTOS DE GINÁSTICA PADRÃO SMAMS - BARRA HORIZONTAL 3 MÓDULOS - BARRA HORIZONTAL 4 MÓDULOS - BARRAS PARALELAS","un"]
["COTAÇÃO 113","CAÇAMBA 4,00 m³","un",0.29249999999999998,{"$f":"Insumos!G66","v":443.33},{"$f":"TRUNC(D2085*E2085,2)","v":129.66999999999999}]
["SINAPI C 94963","CONCRETO fck = 15MPa, TRAÇO 1:3,4:3,5 (CIMENTO/ AREIA MÉDIA/ BRITA 1) - PREPARO MECÂNICO COM BETONEIRA 400 l","m³",0.22500000000000001,{"$f":"'Composições Aux. SINAPI'!E37:F37","v":332.32},74.77]
["SUB-TOTAL - MATERIAL / EQUIPAMENTOS:",null,{"$f":"SUM(F2085:F2086)","v":204.44}]
["SINAPI C 88309","PEDREIRO C/ENCARGOS COMPLEMENTARES","h",2.19,{"$f":"'Planilha_M.O.'!E35","v":23.8},{"$f":"TRUNC(D2088*E2088,2)","v":52.12}]
["SINAPI C 88316","SERVENTE C/ ENCARGOS COMPLEMENTARES","h",2.19,{"$f":"'Planilha_M.O.'!E31","v":20},{"$f":"TRUNC(D2089*E2089,2)","v":43.8}]
["SUB-TOTAL - MÃO-DE-OBRA:",null,{"$f":"SUM(F2088:F2089)","v":95.919999999999987}]
[]
[null,"CUSTO TOTAL:",null,null,null,{"$f":"+C2087+C2090","v":300.36}]
[]
[null,"BDI:","%",{"$f":"+$F$7","v":"22,15%"},null,{"$f":"TRUNC(F2092*D2094,2)","v":66.52}]
[]
[null,"PREÇO:",null,null,null,{"$f":"+F2092+F2094","v":366.88}]
[]
["CÓDIGO","DISCRIMINAÇÃO","UN","COEFIC.","UNITÁRIO","TOTAL"]
[4105,"PLANTIO DE GRAMA CATARINA COM COMPOSTO ORGANICO","m²"]
[{"$f":"CONCATENATE(\"SINAPI I \",Insumos!$B$111)","v":"SINAPI I 3322"},"GRAMA CATARINA","m²",1,{"$f":"+Insumos!$G$111","v":20.45},{"$f":"TRUNC(D2100*E2100,2)","v":20.45}]
[{"$f":"CONCATENATE(\"SINAPI I \",Insumos!$B$100)","v":"SINAPI I 38125"},"FERTILIZANTE ORGÂNICO COMPOSTO, CLASSE A","kg",3,{"$f":"Insumos!G100","v":1.33},{"$f":"TRUNC(D2101*E2101,2)","v":3.99}]
["SUB-TOTAL - MATERIAL:",null,{"$f":"SUM(F2100:F2101)","v":24.439999999999998}]
["SINAPI C 88441","JARDINEIRO C/ENCARGOS COMPLEMENTARES","h",3.9100000000000003E-2,{"$f":"'Planilha_M.O.'!E31","v":20},{"$f":"TRUNC(D2103*E2103,2)","v":0.78}]
["SINAPI C 88316","SERVENTE C/ ENCARGOS COMPLEMENTARES","h",0.15640000000000001,{"$f":"'Planilha_M.O.'!E18","v":17.11},{"$f":"TRUNC(D2104*E2104,2)","v":2.67}]
["SUB-TOTAL - MÃO-DE-OBRA:",null,{"$f":"SUM(F2103:F2104)","v":3.45}]
[]
[null,"CUSTO TOTAL:",null,null,null,{"$f":"+C2102+C2105","v":27.889999999999997}]
[]
[null,"BDI:","%",{"$f":"+$F$7","v":"22,15%"},null,{"$f":"TRUNC(F2107*D2109,2)","v":6.17}]
[]
[null,"PREÇO:",null,null,null,{"$f":"+F2107+F2109","v":34.059999999999995}]
[]
["CÓDIGO","DISCRIMINAÇÃO","UN","COEFIC.","UNITÁRIO","TOTAL"]
["SMAMS 4200","PLANTIO DE GRAMA ESMERALDA EM ROLO PARA CAMPO DE FUTEBOL","m²"]
["SINAPI I 3322"," GRAMA ESMERALDA OU SAO CARLOS OU CURITIBANA, EM PLACAS, SEM PLANTIO","m²",1,{"$f":"Insumos!G111","v":20.45},{"$f":"TRUNC(D2115*E2115,2)","v":20.45}]
["SINAPI I 25951","FERTILIZANTE NPK - 10:10:10","kg",0.1,{"$f":"Insumos!G101","v":2.25},{"$f":"TRUNC(D2116*E2116,2)","v":0.22}]
["SINAPI I 25963","CALCARIO DOLOMITICO A (POSTO PEDREIRA/FORNECEDOR, SEM FRETE)","kg",0.15,{"$f":"Insumos!G71","v":0.08},{"$f":"TRUNC(D2117*E2117,2)","v":0.01}]
["SINAPI I 38125","FERTILIZANTE ORGANICO COMPOSTO, CLASSE A","kg",3,{"$f":"Insumos!G100","v":1.33},{"$f":"TRUNC(D2118*E2118,2)","v":3.99}]
["SUB-TOTAL - MATERIAL / EQUIPAMENTOS:",null,{"$f":"SUM(F2115:F2118)","v":24.67}]
["SINAPI C 88441","JARDINEIRO C/ENCARGOS COMPLEMENTARES","h",0.1,{"$f":"'Planilha_M.O.'!E31","v":20},{"$f":"TRUNC(D2120*E2120,2)","v":2}]
["SINAPI C 88316","SERVENTE C/ ENCARGOS COMPLEMENTARES","h",0.1,{"$f":"'Planilha_M.O.'!E18","v":17.11},{"$f":"TRUNC(D2121*E2121,2)","v":1.71}]
["SUB-TOTAL - MÃO-DE-OBRA:",null,{"$f":"SUM(F2120:F2121)","v":3.71}]
[]
[null,"CUSTO TOTAL:",null,null,null,{"$f":"+C2119+C2122","v":28.380000000000003}]
[]
[null,"BDI:","%",{"$f":"+$F$7","v":"22,15%"},null,{"$f":"TRUNC(F2124*D2126,2)","v":6.28}]
[]
[null,"PREÇO:",null,null,null,{"$f":"+F2124+F2126","v":34.660000000000004}]

{"sheet":"Memória_Cálculo","index":3,"n_rows":363,"n_cols":6,"rows_kept":363,"cut":false,"hidden":false,"merged":[[6,1,6,8]]}
[]
[]
[]
[]
[]
["MEMÓRIA DE CÁLCULO"]
["OBJETO:","Obras de Aquisição e Instalação de Academias de Ginástica ao ar livre na Praça Professor Emílio Mabilde Rípole (155/02), Praça Irene Elisalde Stricher (145/10) e Praça José Mariano de Freitas Beck (164/09)."]
[]
["1 EXECUÇÃO DE ACADEMIA AO AR LIVRE PRAÇA PROF. EMÍLIO M. RÍPOLE 155/02"]
[]
["1.1 ART"]
["DEVERÁ SER ELABORADA APENAS UMA ART PARA AS TRÊS ACADEMIAS."]
[]
["2.1 TAPUME EM CHAPA DE COMPENSADO RESINADO (L=9,90; C=15,40m e H=2,20M)"]
[]
["LARGURA (M)","COMPRIMENTO (M)","PERÍMETRO (M)","ALTURA H=2,20M","ÁREA(M²)"]
[9.9,15.4,{"$f":"A17*2+B17*2","v":50.6},2.2000000000000002,{"$f":"D17*C17","v":111.32000000000001}]
[]
["2.2  LOCAÇÃO DE SANITÁRIO QUÍMICO E 2.3 FRETE"]
[]
["QUANTIDADE","PRAZO","LIMPEZA / SEMANAIS","FRETE IDA","FRETE VOLTA"]
[1,"30 DIAS",3,1,1]
[]
["2.6 PLACA DE OBRA (PARA CONSTRUCAO CIVIL) EM CHAPA GALVANIZADA *N. 22*, ADESIVADA, DE *2,0 X 1,125* M"]
[]
["LARGURA (M)","ALTURA (M)","ÁREA(M²)"]
[2,1.25,{"$f":"B27*A27","v":2.5}]
[]
[]
["2.7 LOCAÇÃO DE OBRA"]
[]
["PISO ACADEMIA"]
["LARGURA (M)","LARGURA (M)","COMPRIMENTO (M)","COMPRIMENTO (M)"]
[8,8,14.5,14.5]
[]
["PASSEIO"]
["COMPRIMENTO (M)","COMPRIMENTO (M)",null,"TOTAL LOCAÇÃO (M)"]
[2,2,null,{"$f":"B38+A38+A34+B34+C34+D34","v":49}]
[]
[]
["2.8 NIVELAMENTO"]
[]
["ACADEMIA ÁREA","PASSEIO ÁREA (M²)","GRAMA ÁREA","PODOTAIL ÁREA","TOTAL (M²)"]
[{"$f":"C82","v":116},{"$f":"B63","v":2.25},{"$f":"C63","v":49.5},{"$f":"12*0.25*0.25","v":0.75},{"$f":"C44+B44+A44+D44","v":168.5}]
[]
[]
["3 ADMINISTRAÇÃO LOCAL"]
["ENGENHEIRO"]
["DIAS","MESES","HORAS / DIA","TOTAL","PERCENTUAL","COEFICIENTE"]
[22,1,2,{"$f":"C50*A50","v":44},100,{"$f":"D50/E50","v":0.44}]
[]
["ENCARREGADO"]
["PRAZO OBRA","MESES","PERCENTUAL","COEFICIENTE"]
["30 DIAS",1,100,{"$f":"B54/C54","v":0.01}]
[]
["VIGIA NOTURNO"]
["PRAZO OBRA","HOAS / DIA","TOTAL HORAS","PERCENTUAL","COEFICIENTE"]
[30,10,{"$f":"B58*A58","v":300},100,{"$f":"C58/D58","v":3}]
[null,null,null," "]
["4.1 MODELAGEM (MOVIMENTO DE TERRA ATÉ 15CM)"]
[]
["ACADEMIA ÁREA","PASSEIO ÁREA (M²)","GRAMA ÁREA","PODOTAIL ÁREA","TOTAL (M²)"]
[{"$f":"C82","v":116},{"$f":"C76","v":2.25},{"$f":"C110","v":49.5},{"$f":"12*0.25*0.25","v":0.75},{"$f":"C63+B63+A63+D63","v":168.5}]
[]
[]
["4.2 ATERRO MECÂNICO COM MATERIAL IMPORTADO COM COMPACTAÇÃO MECÂNICA"]
[]
["LARGURA (M)","COMPRIMENTO (M)","ÁREA (M²)","ALTURA ATERRO","VOLUME (M³)"]
[8,14.5,{"$f":"A69*B69","v":116},0.10345,{"$f":"D69*C69","v":12.0002}]
[]
[]
["5.1 EXECUÇÃO DE PASSEIO (CALÇADA) OU PISO DE CONCRETO COM CONCRETO MOLDADO IN LOCO, "]
["FEITO EM OBRA, ACABAMENTO CONVENCIONAL, ESPESSURA 8 CM, ARMADO"]
[]
["LARGURA (M)","COMPRIMENTO (M)","ÁREA(M²)"]
[1.5,1.5,{"$f":"B76*A76","v":2.25}]
[]
[]
["5.2 PISO CONCRETO ARMADO E= 10 cm - ACADEMIA AO AR LIVRE"]
[]
["LARGURA","COMPRIMENTO","ÁREA (M²)"]
[8,14.5,{"$f":"A82*B82","v":116}]
[]
[]
["5.3 PISO PODOTÁTIL 25x25 cm"]
["QUATDADE PEÇAS","DIMENSÕES","COMPRIMENTO (M)"]
[12,0.25,{"$f":"B87*A87","v":3}]
[]
["8.1 PLANTIO DE GRAMA CATARINA COM COMPOSTO ORGANICO"]
[]
["LARGURA (M)","COMPRIMENTO (M)","ÁREA(M²)"]
[1,10,{"$f":"B92*A92","v":10}]
[]
["LARGURA (M)","COMPRIMENTO (M)","ÁREA(M²)"]
[1,10,{"$f":"B95*A95","v":10}]
[]
["LARGURA (M)","COMPRIMENTO (M)","ÁREA(M²)"]
[1,14.5,{"$f":"B98*A98","v":14.5}]
[]
["LARGURA (M)","COMPRIMENTO (M)","ÁREA(M²)"]
[1,13,{"$f":"B101*A101","v":13}]
[]
["LARGURA (M)","COMPRIMENTO (M)","ÁREA(M²)"]
[1,1,{"$f":"B104*A104","v":1}]
[]
["LARGURA (M)","COMPRIMENTO (M)","ÁREA(M²)"]
[1,1,{"$f":"B107*A107","v":1}]
[]
[null,null,"ATOTAL (M²)"]
[null,null,{"$f":"C92+C95+C98+C101+C104+C107","v":49.5}]
[]
[]
["9 EXECUÇÃO DE ACADEMIA AO AR LIVRE PRAÇA IRENE ELISALDE STRICHER"]
["9.1 DEMOLIÇÃO CHURRASQUEIRA C/REMOÇÃO DE ENTULHOS"]
[]
["LARGURA (M)","COMPRIMENTO (M)","ALTURA(M)","TOTAL"]
[1.1000000000000001,1.2,0.6,"1 UN"]
[]
[]
["9.2 DEMOLIÇÃO MESA E BANCOS DE CONCRETO C/REMOÇÃO DE ENTULHOS"]
[]
["LARGURA (M)","COMPRIMENTO (M)","ALTURA(M)","TOTAL"]
[0.6,1.2,0.9,"1 UN"]
[]
[]
["10.1 TAPUME EM CHAPA DE COMPENSADO RESINADO (L=7,70; C=11,00m e H=2,20M)"]
[]
["LARGURA (M)","COMPRIMENTO (M)","PERÍMETRO (M)","ALTURA H=2,20M","ÁREA(M²)"]
[7.7,{"$f":"1.1*10","v":11},{"$f":"A129*2+B129*2","v":37.4},2.2000000000000002,{"$f":"D129*C129","v":82.28}]
[]
[]
["10.6 PLACA DE OBRA (PARA CONSTRUCAO CIVIL) EM CHAPA GALVANIZADA *N. 22*, ADESIVADA, DE *2,0 X 1,125* M"]
[]
["LARGURA (M)","ALTURA (M)","ÁREA(M²)"]
[2,1.25,{"$f":"B135*A135","v":2.5}]
[]
[]
["10.7 SINALIZAÇÃO COM TELA PLÁSTICA LARANJA FIXADA EM CONE PLÁSTICO"]
[null,"COMPRIMENTO 1 (M)"]
[null,22]
[]
[null,"COMPRIMENTO 2 (M)"]
[null,22,null,"COMPRIMENTO TOTAL (M)"]
[null,null,null,{"$f":"B140+B143+B146+B149","v":58}]
[null,"COMPRIMENTO 3 (M)"]
[null,7]
[]
[null,"COMPRIMENTO 4 (M)"]
[null,7]
["SERÁ UTILIZADA NO PERÍMETRO DO PISO DE CONCRETO DA ACADEMIA"]
[]
[]
["10.8 LOCAÇÃO DE OBRA"]
[]
["PISO ACADEMIA"]
["LARGURA (M)","LARGURA (M)","COMPRIMENTO (M)","COMPRIMENTO (M)"]
[5,5,20,20]
[]
["PASSEIO"]
["COMPRIMENTO (M)","COMPRIMENTO (M)",null,"TOTAL LOCAÇÃO (M)"]
[1,1,null,{"$f":"B161+A161+A157+B157+C157+D157","v":52}]
[]
[]
["10.9 NIVELAMENTO"]
[]
["ACADEMIA ÁREA (M²)","PASSEIO ÁREA (M²)","GRAMA ÁREA","PODOTAIL ÁREA(M²)","TOTAL (M²)"]
[{"$f":"C205","v":100},{"$f":"B186","v":1},{"$f":"C186","v":52},{"$f":"16*0.25*0.25","v":1},{"$f":"C167+B167+A167+D167","v":154}]
[]
[]
["11.1 ADMINISTRAÇÃO LOCAL"]
["ENGENHEIRO"]
["DIAS","MESES","HORAS / DIA","TOTAL","PERCENTUAL","COEFICIENTE"]
[22,1,2,{"$f":"C173*A173","v":44},100,{"$f":"D173/E173","v":0.44}]
[]
["ENCARREGADO"]
["PRAZO OBRA","MESES","PERCENTUAL","COEFICIENTE"]
["30 DIAS",1,100,{"$f":"B177/C177","v":0.01}]
[]
["VIGIA NOTURNO"]
["PRAZO OBRA","HOAS / DIA","TOTAL HORAS","PERCENTUAL","COEFICIENTE"]
[30,10,{"$f":"B181*A181","v":300},100,{"$f":"C181/D181","v":3}]
[null,null,null," "]
["12.1 MODELAGEM (MOVIMENTO DE TERRA ATÉ 15CM)"]
[]
["ACADEMIA ÁREA (M²)","PASSEIO ÁREA (M²)","GRAMA ÁREA","PODOTAIL ÁREA(M²)","TOTAL (M²)"]
[{"$f":"C205","v":100},{"$f":"C199","v":1},{"$f":"C228","v":52},{"$f":"16*0.25*0.25","v":1},{"$f":"C186+B186+A186+D186","v":154}]
[]
[]
["12.2 ATERRO MECÂNICO COM MATERIAL IMPORTADO COM COMPACTAÇÃO MECÂNICA"]
[]
["LARGURA","COMPRIMENTO","ÁREA (M²)","ALTURA ATERRO","VOLUME (M³)"]
[5,10,{"$f":"A192*B192","v":50},0.05,{"$f":"D192*C192","v":2.5}]
[]
[]
["13.1 EXECUÇÃO DE PASSEIO (CALÇADA) OU PISO DE CONCRETO COM CONCRETO MOLDADO IN LOCO, "]
["FEITO EM OBRA, ACABAMENTO CONVENCIONAL, ESPESSURA 8 CM, ARMADO"]
[]
["LARGURA (M)","COMPRIMENTO (M)","ÁREA(M²)"]
[2,0.5,{"$f":"B199*A199","v":1}]
[]
[]
["13.2 PISO CONCRETO ARMADO E= 10 cm - ACADEMIA AO AR LIVRE"]
[]
["LARGURA","COMPRIMENTO","ÁREA (M²)"]
[5,20,{"$f":"A205*B205","v":100}]
[]
[]
["13.3 PISO PODOTÁTIL 25x25 cm"]
["QUATDADE PEÇAS","DIMENSÕES","COMPRIMENTO (M)"]
[16,0.25,{"$f":"B210*A210","v":4}]
[]
[]
["16.1 PLANTIO DE GRAMA CATARINA COM COMPOSTO ORGÂNICO"]
[]
["LARGURA (M)","COMPRIMENTO (M)","ÁREA(M²)"]
[1,20,{"$f":"B216*A216","v":20}]
[]
["LARGURA (M)","COMPRIMENTO (M)","ÁREA(M²)"]
[1,18,{"$f":"B219*A219","v":18}]
[]
["LARGURA (M)","COMPRIMENTO (M)","ÁREA(M²)"]
[1,7,{"$f":"B222*A222","v":7}]
[]
["LARGURA (M)","COMPRIMENTO (M)","ÁREA(M²)"]
[1,7,{"$f":"B225*A225","v":7}]
[]
[null,null,"ATOTAL (M²)"]
[null,null,{"$f":"C225+C222+C219+C216","v":52}]
[]
[]
["17 EXECUÇÃO DE ACADEMIA AO AR LIVRE PRAÇA JOSÉ MARIANO DE FREITAS BECK"]
[]
["17.1 REMOÇÃO DE PASSEIOS - SEM REMOÇÃO DE ENTULHOS"]
[]
["LADO ESQUERDO"]
["LARGURA (m)","COMPRIMENTO (m)","ÁREA(M²)"]
[1,2,{"$f":"B237*A237","v":2}]
[{"$nulls":4},"ÁREA TOTAL"]
["LADO DIREITO",null,null,null,{"$f":"C237+C241+C245","v":7}]
["LARGURA (m)","COMPRIMENTO (m)","ÁREA(M²)"]
[1,2,{"$f":"B241*A241","v":2}]
[]
["PISO CONCRETO"]
["LARGURA (m)","COMPRIMENTO (m)","ÁREA(M²)"]
[1.5,2,{"$f":"B245*A245","v":3}]
[]
["17.2 REMOÇÃO DE ENTULHOS COM CAÇAMBA 4M³"]
["REFERE-SE AO DESCARTE DE ENTUHLO ORIUNDO DA DEMOLIÇÃO DE PARTE DO PASSEIO GRES"]
[]
["ÁREA TOTAL (M²)","ESPESSURA (M)","VOLUME (M³)","EMPLOLAM(25%)","TOTAL VOLUME (M³)"]
[{"$f":"E239","v":7},0.08,{"$f":"B251*A251","v":0.56000000000000005},{"$f":"C251*0.24","v":0.13440000000000002},{"$f":"D251+C251","v":0.69440000000000013}]
[]
[]
["18.1 TAPUME EM CHAPA DE COMPENSADO RESINADO (L=7,70m; C=11,00 m e H=2,20M)"]
[]
["LARGURA (M)","COMPRIMENTO (M)","PERÍMETRO (M)","ALTURA H=2,20M","ÁREA(M²)"]
[7.7,11,{"$f":"A257*2+B257*2","v":37.4},2.2000000000000002,{"$f":"D257*C257","v":82.28}]
[]
[]
["18.6 PLACA DE OBRA (PARA CONSTRUCAO CIVIL) EM CHAPA GALVANIZADA *N. 22*, ADESIVADA, DE *2,0 X 1,125* M"]
[]
["LARGURA (M)","ALTURA (M)","ÁREA(M²)"]
[2,1.25,{"$f":"B263*A263","v":2.5}]
[]
[]
["18.7 SINALIZAÇÃO COM TELA PLÁSTICA LARANJA FIXADA EM CONE PLÁSTICO"]
[]
["LARGURA 1 (M)","COMPRIMENTO 1 (M)","COMPRIMENTO 1 "]
[11,16.5,{"$f":"B269+A269","v":27.5}]
[]
["LARGURA 2 (M)","COMPRIMENTO 2 (M)","COMPRIMENTO 2"]
[11,16.5,{"$f":"B272+A272","v":27.5}]
[]
[null,null,"COMPRIM TOTAL"]
[null,null,{"$f":"C272+C269","v":55}]
[]
[]
["18.8 LOCAÇÃO DE OBRA"]
[]
["PISO ACADEMIA"]
["LARGURA (M)","LARGURA (M)","COMPRIMENTO (M)","COMPRIMENTO (M)"]
[9,9,14.5,14.5]
[]
["PASSEIO"]
["COMPRIMENTO (M)","COMPRIMENTO (M)",null,"TOTAL LOCAÇÃO (M)"]
[2,2,null,{"$f":"B286+A286+A282+B282+C282+D282","v":51}]
[]
[]
["18.9 NIVELAMENTO"]
[]
["ACADEMIA ÁREA","PASSEIO ÁREA","GRAMA ÁREA","PODOTAIL ÁREA","TOTAL (M²)"]
[{"$f":"C330","v":130.5},{"$f":"B311","v":3},{"$f":"C311","v":49.5},{"$f":"6*0.25*0.25","v":0.375},{"$f":"C292+B292+A292+D292","v":183.375}]
[]
[]
["19.1 ADMINISTRAÇÃO LOCAL"]
["ENGENHEIRO"]
["DIAS","MESES","HORAS / DIA","TOTAL","PERCENTUAL","COEFICIENTE"]
[22,1,2,{"$f":"C298*A298","v":44},100,{"$f":"D298/E298","v":0.44}]
[]
["ENCARREGADO"]
["PRAZO OBRA","MESES","PERCENTUAL","COEFICIENTE"]
["30 DIAS",1,100,{"$f":"B302/C302","v":0.01}]
[]
["VIGIA NOTURNO"]
["PRAZO OBRA","HOAS / DIA","TOTAL HORAS","PERCENTUAL","COEFICIENTE"]
[30,10,{"$f":"B306*A306","v":300},100,{"$f":"C306/D306","v":3}]
[null,null,null," "]
["20.1 MODELAGEM (MOVIMENTO DE TERRA ATÉ 15CM)"]
[]
["ACADEMIA ÁREA","PASSEIO ÁREA","GRAMA ÁREA","PODOTAIL ÁREA","TOTAL (M²)"]
[{"$f":"C330","v":130.5},{"$f":"C324","v":3},{"$f":"C363","v":49.5},{"$f":"6*0.25*0.25","v":0.375},{"$f":"C311+B311+A311+D311","v":183.375}]
[]
[]
["20.2 ATERRO MECÂNICO COM MATERIAL IMPORTADO COM COMPACTAÇÃO MECÂNICA"]
[]
["LARGURA","COMPRIMENTO","ÁREA (M²)","ALTURA ATERRO","VOLUME (M³)"]
[9,14.5,{"$f":"A317*B317","v":130.5},0.1,{"$f":"D317*C317","v":13.05}]
[]
[]
["21.1 EXECUÇÃO DE PASSEIO (CALÇADA) OU PISO DE CONCRETO COM CONCRETO MOLDADO IN LOCO, "]
["FEITO EM OBRA, ACABAMENTO CONVENCIONAL, ESPESSURA 8 CM, ARMADO"]
[]
["LARGURA (M)","COMPRIMENTO (M)","ÁREA(M²)"]
[1.5,2,{"$f":"B324*A324","v":3}]
[]
[]
["21.2 PISO CONCRETO ARMADO E= 10 cm - ACADEMIA AO AR LIVRE"]
[]
["LARGURA","COMPRIMENTO","ÁREA (M²)"]
[9,14.5,{"$f":"A330*B330","v":130.5}]
[]
[]
["21.3 LAJE DE GRÊS ASSENTADA NA AREIA"]
[]
["LADO ESQUERDO"]
["LARGURA","COMPRIMENTO (M)","ÁREA (M²)"]
[1,2,{"$f":"B337*A337","v":2}]
[null,null,null,"AREA TOTAL"]
["LADO DIREITO",null,null,{"$f":"C337+C341","v":4}]
["LARGURA","COMPRIMENTO (M)","ÁREA (M²)"]
[1,2,{"$f":"B341*A341","v":2}]
[]
[]
["21.4 PISO PODOTÁTIL 25x25 cm"]
["QUATDADE PEÇAS","DIMENSÕES","COMPRIMENTO (M)"]
[6,0.25,{"$f":"B346*A346","v":1.5}]
[]
["25.1 PLANTIO DE GRAMA CATARINA COM COMPOSTO ORGANICO"]
[]
["LARGURA (M)","COMPRIMENTO (M)","ÁREA(M²)"]
[1,11,{"$f":"B351*A351","v":11}]
[]
["LARGURA (M)","COMPRIMENTO (M)","ÁREA(M²)"]
[1,{"$f":"11-1.5","v":9.5},{"$f":"B354*A354","v":9.5}]
[]
["LARGURA (M)","COMPRIMENTO (M)","ÁREA(M²)"]
[1,14.5,{"$f":"B357*A357","v":14.5}]
[]
["LARGURA (M)","COMPRIMENTO (M)","ÁREA(M²)"]
[1,14.5,{"$f":"B360*A360","v":14.5}]
[]
[null,null,"ATOTAL (M²)"]
[null,null,{"$f":"C351+C354+C357+C360","v":49.5}]

{"sheet":"Composições Aux. SINAPI","index":4,"n_rows":78,"n_cols":6,"rows_kept":78,"cut":false,"hidden":false,"merged":[[75,4,75,5],[52,4,52,5],[27,4,27,5],[73,4,73,5],[15,4,15,5],[18,4,18,5],[38,4,38,5],[39,4,39,5],[20,4,20,5],[21,4,21,5],[25,4,25,5],[23,4,23,5],[22,4,22,5],[30,4,30,5],[37,4,37,5],[61,4,61,5],[0,0,0,5],[1,0,1,5],[2,0,2,5],[3,0,3,5],[4,0,4,2],[62,4,62,5],[49,4,49,5],[42,4,42,5],[51,4,51,5],[53,4,53,5],[60,4,60,5],[54,4,54,5],[59,4,59,5],[45,4,45,5],[46,4,46,5],[48,4,48,5],[57,4,57,5],[43,4,43,5],[44,4,44,5],[47,4,47,5],[55,4,55,5],[5,0,6,1],[5,4,6,4],[5,5,6,5],[7,0,7,5],[8,0,14,1],[8,2,14,2],[8,3,14,3],[8,4,14,5],[77,4,77,5],[50,4,50,5],[63,4,63,5],[64,4,64,5],[65,4,65,5],[66,4,66,5],[71,4,71,5],[72,4,72,5],[56,4,56,5],[76,4,76,5],[69,4,69,5],[70,4,70,5],[74,4,74,5],[67,4,67,5],[68,4,68,5],[58,4,58,5],[19,4,19,5],[17,4,17,5],[16,4,16,5],[28,4,28,5],[29,4,29,5],[24,4,24,5],[26,4,26,5],[31,4,31,5],[32,4,32,5],[33,4,33,5],[34,4,34,5],[41,4,41,5],[36,4,36,5],[40,4,40,5],[35,4,35,5]]}
["COMPOSIÇÕES AUXILIARES"]
[]
["Data Base SINAPI: JUNHO 2021 - Data Base das Cotações: Junho 2021"]
[]
[]
[{"$f":"+'Planilha_M.O.'!$D$5","v":"s/desoneração"},null,"Leis Sociais Horistas:",{"$f":"+'Planilha_M.O.'!$D$7","v":1.111},"BDI=",{"$f":"+'Planilha_M.O.'!$F$7","v":"22,15%"}]
[null,null,"Leis Sociais Mensalistas:",{"$f":"+'Planilha_M.O.'!$D$8","v":0.69159999999999999}]
[]
[{"$f":"+E16","v":"JUNHO / 2021"},null,"Vem da aba Comp.SINAPI c_des.","Vem da aba Comp.SINAPI s_des.","Valor utilizado na composição"]
[]
[]
[]
[]
[]
[]
["Código SINAPI","Composição","Custo (c/desoneração)","Custo (s/desoneração)",{"$f":"+'Planilha_M.O.'!$E$17","v":"JUNHO / 2021"}]
[87292,"ARGAMASSA TRAÇO 1:2:8 (EM VOLUME DE CIMENTO, CAL E AREIA MÉDIA ÚMIDA) PARA EMBOÇO/MASSA ÚNICA/ASSENTAMENTO DE ALVENARIA DE VEDAÇÃO, PREPARO MECÂNICO COM BETONEIRA 400 L. AF_08/2019",399.47,410.14,{"$f":"IF('Planilha_M.O.'!$D$5=\"c/desoneração\",C17,(IF('Planilha_M.O.'!$D$5=\"s/desoneração\",D17)))","v":410.14}]
[87313,"ARGAMASSA TRAÇO 1:3 (EM VOLUME DE CIMENTO E AREIA GROSSA ÚMIDA) PARA CHAPISCO CONVENCIONAL, PREPARO MECÂNICO COM BETONEIRA 400 L. AF_08/2019",416.61,426.85,{"$f":"IF('Planilha_M.O.'!$D$5=\"c/desoneração\",C18,(IF('Planilha_M.O.'!$D$5=\"s/desoneração\",D18)))","v":426.85}]
[87335,"ARGAMASSA TRAÇO 1:2:8 (CIMENTO, CAL E AREIA MÉDIA) PARA EMBOÇO/MASSA ÚNICA/ASSENTAMENTO DE ALVENARIA DE VEDAÇÃO, PREPARO MECÂNICO",395.78,407.54,{"$f":"IF('Planilha_M.O.'!$D$5=\"c/desoneração\",C19,(IF('Planilha_M.O.'!$D$5=\"s/desoneração\",D19)))","v":407.54}]
[87369,"ARGAMASSA TRAÇO 1:2:8 (EM VOLUME DE CIMENTO, CAL E AREIA MÉDIA ÚMIDA) PARA EMBOÇO/MASSA ÚNICA/ASSENTAMENTO DE ALVENARIA DE VEDAÇÃO, PREPARO MANUAL. AF_08/2019",479.13,498.67,{"$f":"IF('Planilha_M.O.'!$D$5=\"c/desoneração\",C20,(IF('Planilha_M.O.'!$D$5=\"s/desoneração\",D20)))","v":498.67}]
[88629,"ARGAMASSA TRAÇO 1:3 (CIMENTO E AREIA MÉDIA), PREPARO MANUAL",513.4,528.49,{"$f":"IF('Planilha_M.O.'!$D$5=\"c/desoneração\",C21,(IF('Planilha_M.O.'!$D$5=\"s/desoneração\",D21)))","v":528.49}]
[88630,"ARGAMASSA TRAÇO 1:4 (CIMENTO E AREIA MÉDIA), PREPARO MECÂNICO COM BETONEIRA 400 L",372.59,380.55,{"$f":"IF('Planilha_M.O.'!$D$5=\"c/desoneração\",C22,(IF('Planilha_M.O.'!$D$5=\"s/desoneração\",D22)))","v":380.55}]
[88631,"ARGAMASSA TRAÇO 1:4 (EM VOLUME DE CIMENTO E AREIA MÉDIA ÚMIDA), PREPARO MANUAL",453.47,468.06,{"$f":"IF('Planilha_M.O.'!$D$5=\"c/desoneração\",C23,(IF('Planilha_M.O.'!$D$5=\"s/desoneração\",D23)))","v":468.06}]
[100578,"ASSENTAMENTO DE POSTE DE CONCRETO COM COMPRIMENTO NOMINAL DE 9 m",400.08,412.48,{"$f":"IF('Planilha_M.O.'!$D$5=\"c/desoneração\",C24,(IF('Planilha_M.O.'!$D$5=\"s/desoneração\",D24)))","v":412.48}]
[88830,"BETONEIRA 400 l, POTÊNCIA 2 cv, SEM CARREGADOR (chp)",1.65,1.65,{"$f":"IF('Planilha_M.O.'!$D$5=\"c/desoneração\",C25,(IF('Planilha_M.O.'!$D$5=\"s/desoneração\",D25)))","v":1.65}]
[88831,"BETONEIRA 400 l, POTÊNCIA 2 cv, SEM CARREGADOR (chi)",0.28000000000000003,0.28000000000000003,{"$f":"IF('Planilha_M.O.'!$D$5=\"c/desoneração\",C26,(IF('Planilha_M.O.'!$D$5=\"s/desoneração\",D26)))","v":0.28000000000000003}]
[91933,"CABO DE COBRE FLEXÍVEL ISOLADO, 10 mm², ANTI-CHAMA 0,6/1,0 kV",15.88,16.22,{"$f":"IF('Planilha_M.O.'!$D$5=\"c/desoneração\",C27,(IF('Planilha_M.O.'!$D$5=\"s/desoneração\",D27)))","v":16.22}]
[95676,"CAIXA EM CONCRETO PRÉ-MOLDADO PARA ABRIGO DE HIDRÔMETRO COM DN 20 (½\u0094)",92.66,93.49,{"$f":"IF('Planilha_M.O.'!$D$5=\"c/desoneração\",C28,(IF('Planilha_M.O.'!$D$5=\"s/desoneração\",D28)))","v":93.49}]
[91387,"CAMINHÃO BASCULANTE 10 M3, TRUCADO CABINE SIMPLES, PESO BRUTO TOTAL 23.000 KG, CARGA ÚTIL MÁXIMA 15.935 KG, DISTÂNCIA ENTRE EIXOS 4,80 M, POTÊNCIA 230 CV INCLUSIVE CAÇAMBA METÁLICA - CHI DIURNO. AF_06/2014",44.73,47.29,{"$f":"IF('Planilha_M.O.'!$D$5=\"c/desoneração\",C29,(IF('Planilha_M.O.'!$D$5=\"s/desoneração\",D29)))","v":47.29}]
[91386,"CAMINHÃO BASCULANTE 10 M3, TRUCADO CABINE SIMPLES, PESO BRUTO TOTAL 23.000 KG, CARGA ÚTIL MÁXIMA 15.935 KG, DISTÂNCIA ENTRE EIXOS 4,80 M, POTÊNCIA 230 CV INCLUSIVE CAÇAMBA METÁLICA - CHP DIURNO. AF_06/2014",183.24,185.8,{"$f":"IF('Planilha_M.O.'!$D$5=\"c/desoneração\",C30,(IF('Planilha_M.O.'!$D$5=\"s/desoneração\",D30)))","v":185.8}]
[91383,"CAMINHÃO BASCULANTE 10 M3, TRUCADO CABINE SIMPLES, PESO BRUTO TOTAL 23.000 KG, CARGA ÚTIL MÁXIMA 15.935 KG, DISTÂNCIA ENTRE EIXOS 4,80 M, POTÊNCIA 230 CV INCLUSIVE CAÇAMBA METÁLICA - MANUTENÇÃO. AF_06/2014",37.549999999999997,37.549999999999997,{"$f":"IF('Planilha_M.O.'!$D$5=\"c/desoneração\",C31,(IF('Planilha_M.O.'!$D$5=\"s/desoneração\",D31)))","v":37.549999999999997}]
[91533,"COMPACTADOR DE SOLOS DE PERCUSSÃO C/MOTOR A GASOLINA, POTÊNCIA 4 cv (chp)",29.27,32.03,{"$f":"IF('Planilha_M.O.'!$D$5=\"c/desoneração\",C32,(IF('Planilha_M.O.'!$D$5=\"s/desoneração\",D32)))","v":32.03}]
[91534,"COMPACTADOR DE SOLOS DE PERCUSSÃO C/MOTOR A GASOLINA, POTÊNCIA 4 cv (chi)",22.05,24.83,{"$f":"IF('Planilha_M.O.'!$D$5=\"c/desoneração\",C33,(IF('Planilha_M.O.'!$D$5=\"s/desoneração\",D33)))","v":24.83}]
[5953,"COMPRESSOR DE AR REBOCÁVEL, VAZÃO 189 PCM, PRESSÃO EFETIVA DE TRABALHO 102 PSI, MOTOR DIESEL, POTÊNCIA 63 CV - CHP DIURNO",41.39,41.39,{"$f":"IF('Planilha_M.O.'!$D$5=\"c/desoneração\",C34,(IF('Planilha_M.O.'!$D$5=\"s/desoneração\",D34)))","v":41.39}]
[5954,"COMPRESSOR DE AR REBOCÁVEL, VAZÃO 189 PCM, PRESSÃO EFETIVA DE TRABALHO 102 PSI, MOTOR DIESEL, POTÊNCIA 63 CV - CHI DIURNO",3.73,3.73,{"$f":"IF('Planilha_M.O.'!$D$5=\"c/desoneração\",C35,(IF('Planilha_M.O.'!$D$5=\"s/desoneração\",D35)))","v":3.73}]
[94962,"CONCRETO MAGRO PARA LASTRO, TRAÇO 1:4,5:4,5 (EM MASSA SECA DE CIMENTO/ AREIA MÉDIA/ BRITA 1) - PREPARO MECÂNICO COM BETONEIRA 400 L. AF_05/2021",286.89,294.52999999999997,{"$f":"IF('Planilha_M.O.'!$D$5=\"c/desoneração\",C36,(IF('Planilha_M.O.'!$D$5=\"s/desoneração\",D36)))","v":294.52999999999997}]
[94963,"CONCRETO fck = 15MPa, TRAÇO 1:3,4:3,5 (CIMENTO/ AREIA MÉDIA/ BRITA 1) - PREPARO MECÂNICO COM BETONEIRA 400 l",324.74,332.32,{"$f":"IF('Planilha_M.O.'!$D$5=\"c/desoneração\",C37,(IF('Planilha_M.O.'!$D$5=\"s/desoneração\",D37)))","v":332.32}]
[94964,"CONCRETO FCK = 20MPA, TRAÇO 1:2,7:3 (CIMENTO/ AREIA MÉDIA/ BRITA 1) - PREPARO MECÂNICO COM BETONEIRA 400 L. AF_07/2016",360.31,368.57,{"$f":"IF('Planilha_M.O.'!$D$5=\"c/desoneração\",C38,(IF('Planilha_M.O.'!$D$5=\"s/desoneração\",D38)))","v":368.57}]
[91283,"CORTADORA DE PISO, POTÊNCIA 13 hp, C/DISCO DE CORTE DIAMANTADO 350 mm (chp)",21.82,21.82,{"$f":"IF('Planilha_M.O.'!$D$5=\"c/desoneração\",C39,(IF('Planilha_M.O.'!$D$5=\"s/desoneração\",D39)))","v":21.82}]
[91285,"CORTADORA DE PISO, POTÊNCIA 13 hp, C/DISCO DE CORTE DIAMANTADO 350 mm (chi)",0.84,0.84,{"$f":"IF('Planilha_M.O.'!$D$5=\"c/desoneração\",C40,(IF('Planilha_M.O.'!$D$5=\"s/desoneração\",D40)))","v":0.84}]
[92791,"CORTE E DOBRA DE AÇO CA-60, DIÂMETRO DE 5,0 MM, UTILIZADO EM ESTRUTURAS DIVERSAS, EXCETO LAJES (4,2 mm, 5 mm, 6 mm e 7 mm)",13.82,14,{"$f":"IF('Planilha_M.O.'!$D$5=\"c/desoneração\",C41,(IF('Planilha_M.O.'!$D$5=\"s/desoneração\",D41)))","v":14}]
[92794,"CORTE E DOBRA DE AÇO CA-50, DIÂMETRO DE 10,0 MM, UTILIZADO EM ESTRUTURAS DIVERSAS, EXCETO LAJES",13.68,13.71,{"$f":"IF('Planilha_M.O.'!$D$5=\"c/desoneração\",C42,(IF('Planilha_M.O.'!$D$5=\"s/desoneração\",D42)))","v":13.71}]
[96977,"CORDOALHA DE COBRE NU 50 mm², ENTERRADA, SEM ISOLADOR",49.98,50.13,{"$f":"IF('Planilha_M.O.'!$D$5=\"c/desoneração\",C43,(IF('Planilha_M.O.'!$D$5=\"s/desoneração\",D43)))","v":50.13}]
[91917,"CURVA 90° PARA ELETRODUTO, PVC, ROSCÁVEL, DN 32 mm (1\")",13.83,14.99,{"$f":"IF('Planilha_M.O.'!$D$5=\"c/desoneração\",C44,(IF('Planilha_M.O.'!$D$5=\"s/desoneração\",D44)))","v":14.99}]
[91919,"CURVA 180° P/ELETRODUTO, PVC, ROSCÁVEL, DN 32 mm (1\"\u0094)",15.82,16.98,{"$f":"IF('Planilha_M.O.'!$D$5=\"c/desoneração\",C45,(IF('Planilha_M.O.'!$D$5=\"s/desoneração\",D45)))","v":16.98}]
[95282,"DESEMPENADEIRA DE CONCRETO, PESO DE 75KG, 4 PÁS, MOTOR A GASOLINA, POTÊNCIA 5,5 HP - CHP DIURNO",9.33,9.33,{"$f":"IF('Planilha_M.O.'!$D$5=\"c/desoneração\",C46,(IF('Planilha_M.O.'!$D$5=\"s/desoneração\",D46)))","v":9.33}]
[95283,"DESEMPENADEIRA DE CONCRETO, PESO DE 75KG, 4 PÁS, MOTOR A GASOLINA, POTÊNCIA 5,5 HP - CHI DIURNO",0.49,0.49,{"$f":"IF('Planilha_M.O.'!$D$5=\"c/desoneração\",C47,(IF('Planilha_M.O.'!$D$5=\"s/desoneração\",D47)))","v":0.49}]
[93673,"DISJUNTOR TRIPOLAR TIPO DIN, CORRENTE NOMINAL DE 50 A",91.7,94.12,{"$f":"IF('Planilha_M.O.'!$D$5=\"c/desoneração\",C48,(IF('Planilha_M.O.'!$D$5=\"s/desoneração\",D48)))","v":94.12}]
[91872,"ELETRODUTO RÍGIDO ROSCÁVEL, PVC, DN 32 mm (1\"), PARA CIRCUITOS TERMINAIS",14.14,14.97,{"$f":"IF('Planilha_M.O.'!$D$5=\"c/desoneração\",C49,(IF('Planilha_M.O.'!$D$5=\"s/desoneração\",D49)))","v":14.97}]
[93358,"ESCAVAÇÃO MANUAL DE VALA COM PROFUNDIDADE MENOR OU IGUAL A 1,30 M",60.72,67.680000000000007,{"$f":"IF('Planilha_M.O.'!$D$5=\"c/desoneração\",C50,(IF('Planilha_M.O.'!$D$5=\"s/desoneração\",D50)))","v":67.680000000000007}]
[93402,"GUINDAUTO HIDRÁULICO, CAP. 3.330 kg, INCLUSIVE CAMINHÃO TOCO (chp)",174.94,177.73,{"$f":"IF('Planilha_M.O.'!$D$5=\"c/desoneração\",C51,(IF('Planilha_M.O.'!$D$5=\"s/desoneração\",D51)))","v":177.73}]
[96986,"HASTE DE ATERRAMENTO 3/4\" PARA SPDA",100.88,102.57,{"$f":"IF('Planilha_M.O.'!$D$5=\"c/desoneração\",C52,(IF('Planilha_M.O.'!$D$5=\"s/desoneração\",D52)))","v":102.57}]
[89358,"JOELHO 90 GRAUS, PVC, SOLDÁVEL, DN 20MM - FORNECIMENTO E INSTALAÇÃO",5.89,6.38,{"$f":"IF('Planilha_M.O.'!$D$5=\"c/desoneração\",C53,(IF('Planilha_M.O.'!$D$5=\"s/desoneração\",D53)))","v":6.38}]
[89971,"KIT DE REGISTRO DE GAVETA BRUTO DE LATÃO ½\", INCLUSIVE CONEXÕES, ROSCÁVEL",49.13,50.53,{"$f":"IF('Planilha_M.O.'!$D$5=\"c/desoneração\",C54,(IF('Planilha_M.O.'!$D$5=\"s/desoneração\",D54)))","v":50.53}]
[99833,"LAVADORA DE ALTA PRESSÃO (LAVA-JATO) PARA ÁGUA FRIA, PRESSÃO DE OPERAÇÃO ENTRE 1400 E 1900 LIB/POL², VAZÃO MÁXIMA ENTRE 400 E 700 L/H - CHP DIURNO",1.43,1.43,{"$f":"IF('Planilha_M.O.'!$D$5=\"c/desoneração\",C55,(IF('Planilha_M.O.'!$D$5=\"s/desoneração\",D55)))","v":1.43}]
[92873,"LANÇAMENTO COM USO DE BALDES, ADENSAMENTO E ACABAMENTO DE CONCRETO EM ESTRUTURAS. AF_12/2015",154.5,172.47,{"$f":"IF('Planilha_M.O.'!$D$5=\"c/desoneração\",C56,(IF('Planilha_M.O.'!$D$5=\"s/desoneração\",D56)))","v":172.47}]
[99058,"LOCAÇÃO DE PONTO PARA REFERÊNCIA TOPOGRÁFICA",9.15,10.33,{"$f":"IF('Planilha_M.O.'!$D$5=\"c/desoneração\",C57,(IF('Planilha_M.O.'!$D$5=\"s/desoneração\",D57)))","v":10.33}]
[91885,"LUVA PARA ELETRODUTO, PVC, ROSCÁVEL, DN 32 mm (1\")",8.11,8.8800000000000008,{"$f":"IF('Planilha_M.O.'!$D$5=\"c/desoneração\",C58,(IF('Planilha_M.O.'!$D$5=\"s/desoneração\",D58)))","v":8.8800000000000008}]
[5795,"MARTELETE OU ROMPEDOR PNEUMÁTICO MANUAL, 28 KG, COM SILENCIADOR - CHP DIURNO",23.81,26.44,{"$f":"IF('Planilha_M.O.'!$D$5=\"c/desoneração\",C59,(IF('Planilha_M.O.'!$D$5=\"s/desoneração\",D59)))","v":26.44}]
[5952,"MARTELETE OU ROMPEDOR PNEUMÁTICO MANUAL, 28 KG, COM SILENCIADOR - CHI DIURNO",21.81,24.44,{"$f":"IF('Planilha_M.O.'!$D$5=\"c/desoneração\",C60,(IF('Planilha_M.O.'!$D$5=\"s/desoneração\",D60)))","v":24.44}]
[97064,"MONTAGEM E DESMONTAGEM DE ANDAIME TUBULAR TIPO \u0093TORRE\u0094 (EXCLUSIVE ANDAIME E LIMPEZA)",14.38,16.16,{"$f":"IF('Planilha_M.O.'!$D$5=\"c/desoneração\",C61,(IF('Planilha_M.O.'!$D$5=\"s/desoneração\",D61)))","v":16.16}]
[5940,"PÁ CARREGADEIRA SOBRE RODAS, POTÊNCIA LÍQUIDA 128 HP, CAPACIDADE DA CAÇAMBA 1,7 A 2,8 M3, PESO OPERACIONAL 11632 KG - CHP DIURNO. AF_06/2014",144.08000000000001,147.06,{"$f":"IF('Planilha_M.O.'!$D$5=\"c/desoneração\",C62,(IF('Planilha_M.O.'!$D$5=\"s/desoneração\",D62)))","v":147.06}]
[5942,"PÁ CARREGADEIRA SOBRE RODAS, POTÊNCIA LÍQUIDA 128 HP, CAPACIDADE DA CAÇAMBA 1,7 A 2,8 M3, PESO OPERACIONAL 11632 KG - CHI DIURNO. AF_06/2014",53.18,56.16,{"$f":"IF('Planilha_M.O.'!$D$5=\"c/desoneração\",C63,(IF('Planilha_M.O.'!$D$5=\"s/desoneração\",D63)))","v":56.16}]
[91277,"PLACA VIBRATÓRIA REVERSÍVEL, POTÊNCIA 5,5 cv (chp)",9.84,9.84,{"$f":"IF('Planilha_M.O.'!$D$5=\"c/desoneração\",C64,(IF('Planilha_M.O.'!$D$5=\"s/desoneração\",D64)))","v":9.84}]
[91278,"PLACA VIBRATÓRIA REVERSÍVEL, POTÊNCIA 5,5 cv (chi)",0.7,0.7,{"$f":"IF('Planilha_M.O.'!$D$5=\"c/desoneração\",C65,(IF('Planilha_M.O.'!$D$5=\"s/desoneração\",D65)))","v":0.7}]
[5678,"RETROESCAVADEIRA SOBRE RODAS, POTÊNCIA 88 hp (chp)",107.63,110.93,{"$f":"IF('Planilha_M.O.'!$D$5=\"c/desoneração\",C66,(IF('Planilha_M.O.'!$D$5=\"s/desoneração\",D66)))","v":110.93}]
[5679,"RETROESCAVADEIRA SOBRE RODAS, POTÊNCIA 88 hp (chi)",45.92,49.22,{"$f":"IF('Planilha_M.O.'!$D$5=\"c/desoneração\",C67,(IF('Planilha_M.O.'!$D$5=\"s/desoneração\",D67)))","v":49.22}]
[5684,"ROLO COMPACTADOR VIBRATÓRIO DE UM CILINDRO AÇO LISO, POTÊNCIA 80 hp, PESO OPERACIONAL MÁXIMO 8,1 T, LARGURA DE TRABALHO 1,68 m (chp)",108.62,110.98,{"$f":"IF('Planilha_M.O.'!$D$5=\"c/desoneração\",C68,(IF('Planilha_M.O.'!$D$5=\"s/desoneração\",D68)))","v":110.98}]
[5685,"ROLO COMPACTADOR VIBRATÓRIO DE UM CILINDRO AÇO LISO, POTÊNCIA 80 hp, PESO OPERACIONAL MÁXIMO 8,1 T, LARGURA DE TRABALHO 1,68 m (chi)",41.96,44.32,{"$f":"IF('Planilha_M.O.'!$D$5=\"c/desoneração\",C69,(IF('Planilha_M.O.'!$D$5=\"s/desoneração\",D69)))","v":44.32}]
[5867,"ROLO COMPACTADOR VIBRATÓRIO TANDEM AÇO LISO, POTÊNCIA 58 hp, PESO SEM/COM LASTRO 6,5 / 9,4 t, LARGURA DE TRABALHO 1,2 m (chp)",107.71,111.07,{"$f":"IF('Planilha_M.O.'!$D$5=\"c/desoneração\",C70,(IF('Planilha_M.O.'!$D$5=\"s/desoneração\",D70)))","v":111.07}]
[5869,"ROLO COMPACTADOR VIBRATÓRIO TANDEM AÇO LISO, POTÊNCIA 58 hp, PESO SEM/COM LASTRO 6,5 / 9,4 t, LARGURA DE TRABALHO 1,2 m (chi)",47.34,49.7,{"$f":"IF('Planilha_M.O.'!$D$5=\"c/desoneração\",C71,(IF('Planilha_M.O.'!$D$5=\"s/desoneração\",D71)))","v":49.7}]
[91692,"SERRA CIRCULAR DE BANCADA COM MOTOR ELÉTRICO POTÊNCIA DE 5HP, COM COIFA PARA DISCO 10\" - CHP DIURNO",24.05,26.83,{"$f":"IF('Planilha_M.O.'!$D$5=\"c/desoneração\",C72,(IF('Planilha_M.O.'!$D$5=\"s/desoneração\",D72)))","v":26.83}]
[91693,"SERRA CIRCULAR DE BANCADA COM MOTOR ELÉTRICO POTÊNCIA DE 5HP, COM COIFA PARA DISCO 10\" - CHI DIURNO",21.11,23.89,{"$f":"IF('Planilha_M.O.'!$D$5=\"c/desoneração\",C73,(IF('Planilha_M.O.'!$D$5=\"s/desoneração\",D73)))","v":23.89}]
[86913,"TORNEIRA CROMADA 1/2\" OU 3/4\" PARA TANQUE, PADRÃO POPULAR",27.28,27.71,{"$f":"IF('Planilha_M.O.'!$D$5=\"c/desoneração\",C74,(IF('Planilha_M.O.'!$D$5=\"s/desoneração\",D74)))","v":27.71}]
[95875,"TRANSPORTE COM CAMINHÃO BASCULANTE DE 10 M³, EM VIA URBANA PAVIMENTADA, DMT ATÉ 30 KM (UNIDADE: M3XKM)",1.68,1.71,{"$f":"IF('Planilha_M.O.'!$D$5=\"c/desoneração\",C75,(IF('Planilha_M.O.'!$D$5=\"s/desoneração\",D75)))","v":1.71}]
[89401,"TUBO, PVC, SOLDÁVEL, DN 20MM - FORNECIMENTO E INSTALAÇÃO",7.26,7.63,{"$f":"IF('Planilha_M.O.'!$D$5=\"c/desoneração\",C76,(IF('Planilha_M.O.'!$D$5=\"s/desoneração\",D76)))","v":7.63}]
[90586,"VIBRADOR DE IMERSÃO, DIÂMETRO DE PONTEIRA 45 mm, MOTOR ELÉTRICO TRIFÁSICO POTÊNCIA DE 2 CV - CHP DIURNO",1.79,1.79,{"$f":"IF('Planilha_M.O.'!$D$5=\"c/desoneração\",C77,(IF('Planilha_M.O.'!$D$5=\"s/desoneração\",D77)))","v":1.79}]
[90587,"VIBRADOR DE IMERSÃO, DIÂMETRO DE PONTEIRA 45 mm MOTOR ELÉTRICO TRIFÁSICO POTÊNCIA DE 2 CV - CHI DIURNO",0.39,0.39,{"$f":"IF('Planilha_M.O.'!$D$5=\"c/desoneração\",C78,(IF('Planilha_M.O.'!$D$5=\"s/desoneração\",D78)))","v":0.39}]

{"sheet":"Planilha_M.O.","index":5,"n_rows":42,"n_cols":6,"rows_kept":42,"cut":false,"hidden":false,"merged":[[40,4,40,5],[41,4,41,5],[4,0,4,1],[4,4,4,5],[5,0,5,5],[37,4,37,5],[6,4,7,4],[17,4,17,5],[29,4,29,5],[28,4,28,5],[36,4,36,5],[35,4,35,5],[34,4,34,5],[33,4,33,5],[32,4,32,5],[21,4,21,5],[31,4,31,5],[30,4,30,5],[18,4,18,5],[20,4,20,5],[27,4,27,5],[26,4,26,5],[25,4,25,5],[24,4,24,5],[23,4,23,5],[39,4,39,5],[38,4,38,5],[22,4,22,5],[2,0,2,5],[0,0,0,5],[1,0,1,5],[6,0,7,1],[6,5,7,5],[16,4,16,5],[9,0,15,1],[9,2,15,2],[9,3,15,3],[3,0,3,5],[8,0,8,5],[9,4,15,5],[19,4,19,5]]}
["PLANILHA MÃO-DE-OBRA"]
[]
[{"$f":"CONCATENATE(\"Data Base SINAPI: \",$E$17)","v":"Data Base SINAPI: JUNHO / 2021"}]
[]
[null,null,"SELECIONAR:","s/desoneração"]
[]
[{"$f":"D5","v":"s/desoneração"},null,"Leis Sociais Horistas:",{"$f":"IF($D$5=\"c/desoneração\",'Encargos Sociais'!C42,'Encargos Sociais'!E42)","v":1.111},"BDI=",{"$f":"IF($D$5=\"c/desoneração\",\"28,21%\",\"22,15%\")","v":"22,15%"}]
[null,null,"Leis Sociais Mensalistas:",{"$f":"IF($D$5=\"c/desoneração\",'Encargos Sociais'!D42,'Encargos Sociais'!F42)","v":0.69159999999999999}]
[]
[{"$f":"+E17","v":"JUNHO / 2021"},null,"Vem da aba Comp.SINAPI c_des.","Vem da aba Comp.SINAPI s_des."," Valor utilizado"]
[]
[]
[]
[]
[]
[]
["Código","Composição","Custo unitário (c/desoneração)","Custo unitário (s/desoneração)","JUNHO / 2021"]
[88316,"Servente",15.35,17.11,{"$f":"IF($D$5=\"c/desoneração\",C18,(IF($D$5=\"s/desoneração\",D18)))","v":17.11}]
[88238,"Ajudante de armador",14.11,15.67,15.67]
[88239,"Ajudante de carpinteiro",15.31,17.059999999999999,17.059999999999999]
[88253,"Auxiliar de topógrafo",11.98,13.69,13.69]
[88248,"Auxiliar de encanador",13.98,15.58,15.58]
[88251,"Auxiliar de serralheiro",14.83,16.489999999999998,16.489999999999998]
[88309,"Pedreiro",18.48,20.71,20.71]
[88310,"Pintor",19.48,21.7,21.7]
[88262,"Carpinteiro",18.28,20.5,20.5]
[88260,"Calceteiro",17.309999999999999,19.37,19.37]
[88323,"Telhadista",18.64,20.93,20.93]
[88245,"Armador",18.38,20.6,20.6]
[88315,"Serralheiro",18.38,20.6,20.6]
[88441,"Jardineiro",17.850000000000001,20,20]
[88267,"Encanador",18.149999999999999,20.39,20.39]
[88281,"Motorista de caminhão",19.59,22.14,22.14]
[88377,"Operador de betoneira",18.37,20.74,20.74]
[88297,"Operador de máq. e equip.",21.02,23.8,23.8]
[88298,"Operador de martelete",20.02,22.65,22.65]
[93572,"Encarregado (mês)",6799.05,7828.88,7828.88]
[90778,"Engenheiro Civil de Obra",92.87,107.35,107.35]
[90781,"Topógrafo",27.62,31.8,{"$f":"IF($D$5=\"c/desoneração\",C39,(IF($D$5=\"s/desoneração\",D39)))","v":31.8}]
[88326,"VIGIA NOTURNO COM ENCARGOS COMPLEMENTARES",19.920000000000002,22.41,{"$f":"IF($D$5=\"c/desoneração\",C40,(IF($D$5=\"s/desoneração\",D40)))","v":22.41}]
[88264,"ELETRICISTA COM ENCARGOS COMPLEMENTARES",20.11,22.61,{"$f":"IF($D$5=\"c/desoneração\",C41,(IF($D$5=\"s/desoneração\",D41)))","v":22.61}]
[88247,"AUXILIAR DE ELETRICISTA COM ENCARGOS COMPLEMENTARES",15.41,17.170000000000002,{"$f":"IF($D$5=\"c/desoneração\",C42,(IF($D$5=\"s/desoneração\",D42)))","v":17.170000000000002}]

{"sheet":"Planilha Cotações","index":6,"n_rows":158,"n_cols":9,"rows_kept":158,"cut":false,"hidden":false,"merged":[[37,10,37,11],[38,10,38,11],[107,10,107,11],[108,10,108,11],[135,10,135,11],[137,10,137,11],[136,10,136,11],[9,0,9,2],[10,0,10,2],[106,0,106,2],[106,8,108,8],[96,0,96,2],[96,8,98,8],[97,0,97,2],[98,0,98,2],[101,0,101,2],[113,10,113,11],[23,10,23,11],[24,10,24,11],[25,10,25,11],[26,10,26,11],[18,10,18,11],[19,10,19,11],[20,10,20,11],[35,10,35,11],[36,10,36,11],[106,10,106,11],[117,0,117,2],[118,0,118,2],[113,0,113,2],[111,0,111,2],[121,0,121,2],[112,10,112,11],[121,8,123,8],[122,0,122,2],[123,0,123,2],[116,0,116,2],[116,8,118,8],[111,10,111,11],[108,0,108,2],[107,0,107,2],[111,8,113,8],[112,0,112,2],[91,0,91,2],[91,8,93,8],[92,0,92,2],[93,0,93,2],[53,0,53,2],[126,10,126,11],[127,10,127,11],[128,10,128,11],[126,0,126,2],[126,8,128,8],[127,0,127,2],[128,0,128,2],[66,8,68,8],[71,8,73,8],[76,0,76,2],[76,8,78,8],[77,0,77,2],[78,0,78,2],[101,8,103,8],[102,0,102,2],[103,0,103,2],[81,0,81,2],[81,8,83,8],[82,0,82,2],[83,0,83,2],[86,0,86,2],[86,8,88,8],[87,0,87,2],[88,0,88,2],[0,0,0,8],[1,0,1,8],[2,0,2,8],[29,8,32,8],[32,0,32,2],[29,0,29,2],[26,0,26,2],[30,0,30,2],[31,0,31,2],[13,0,13,2],[13,8,15,8],[14,0,14,2],[15,0,15,2],[18,0,18,2],[18,8,20,8],[19,0,19,2],[20,0,20,2],[23,8,26,8],[8,0,8,2],[8,8,10,8],[3,1,3,8],[157,0,157,2],[52,0,52,2],[140,0,140,2],[144,0,144,2],[148,0,148,2],[46,0,46,2],[46,8,48,8],[51,0,51,2],[51,8,53,8],[131,0,131,2],[56,0,56,2],[57,0,57,2],[58,0,58,2],[61,0,61,2],[62,0,62,2],[63,0,63,2],[66,0,66,2],[67,0,67,2],[68,0,68,2],[71,0,71,2],[72,0,72,2],[73,0,73,2],[56,8,58,8],[61,8,63,8],[47,0,47,2],[48,0,48,2],[42,0,42,2],[43,0,43,2],[152,0,152,2],[152,8,154,8],[135,0,135,2],[135,8,137,8],[136,0,136,2],[137,0,137,2],[153,0,153,2],[154,0,154,2],[35,0,35,2],[38,0,38,2],[35,8,38,8],[36,0,36,2],[37,0,37,2],[23,0,23,2],[24,0,24,2],[25,0,25,2],[41,0,41,2],[41,8,43,8]]}
["PLANILHA DE COTAÇÕES DE INSUMOS"]
["Data das Cotações: Junho2021"]
[]
["OBJETO:",{"$f":"+PO!$B$9","v":"Obras de Aquisição e Instalação de Academias de Ginástica ao ar livre na Praça Professor Emílio Mabilde Rípole (155/02), Praça Irene Elisalde Stricher (145/10) e Praça José Mariano de Freitas Beck (164/09)."}]
["DATA:",{"$f":"IF(PO!$B$10=\"\",\"\",PO!$B$10)","v":"2021-08-10"}]
["ART nº:",{"$f":"IF(PO!$B$11=\"\",\"\",PO!$B$11)","v":""}]
[]
[16,"CAIBRO CEDRINHO 5 x 7 cm","m","CNPJ","Telefone","Contato","Data","Valor","Valor Média"]
[{"$f":"+Cotações!$D$7","v":"Mondai Madeiras"},null,null,"01.434.693/0001-93","3587-1643","Anderson R.","2021-06-15",20,{"$f":"Cotações!M11","v":22.2}]
[{"$f":"+Cotações!$F$7","v":"Cunha Madeiras"},null,null,"14.071.368/0001-55","3364-2778","Fábio","2021-06-15",24.4]
["SCHREINER MADEIRA",null,null,"16.701.304/0001-16","41-3543-1316","Carol","2021-07-07",41.25]
[]
[{"$f":"+Cotações!A34","v":44},"Tábua itaúba lixada e aplainada 3,5x19x1,80","pç","CNPJ","Telefone","Contato","Data","Valor","Valor Mediana"]
[{"$f":"+Cotações!$D$7","v":"Mondai Madeiras"},null,null,"01.434.693/0001-93","3587-1643","Anderson R.","2021-06-15",{"$f":"+Cotações!D34","v":130.5},{"$f":"Cotações!N34","v":140.80000000000001}]
[{"$f":"+Cotações!$F$7","v":"Cunha Madeiras"},null,null,"14.071.368/0001-55","3364-2778","Fábio","2021-06-15",{"$f":"+Cotações!F34","v":200}]
["SCHREINER MADEIRA",null,null,"16.701.304/0001-16","41-3543-1316","Carol","2021-07-07",{"$f":"+Cotações!H34","v":140.80000000000001}]
[]
[{"$f":"+Cotações!A35","v":45},"Tábua itaúba lixada e aplainada 3,5x19x2,00","pç","CNPJ","Telefone","Contato","Data","Valor","Valor Mediana"]
[{"$f":"+Cotações!$D$7","v":"Mondai Madeiras"},null,null,"01.434.693/0001-93","3587-1643","Anderson R.","2021-06-15",{"$f":"+Cotações!D35","v":145},{"$f":"Cotações!N35","v":145}]
[{"$f":"+Cotações!$F$7","v":"Cunha Madeiras"},null,null,"14.071.368/0001-55","3364-2778","Fábio","2021-06-15",{"$f":"+Cotações!F35","v":200}]
["SCHREINER MADEIRA",null,null,"16.701.304/0001-16","41-3543-1316","Carol","2021-07-07",{"$f":"+Cotações!H35","v":140.80000000000001}]
[]
[{"$f":"+Cotações!A43","v":50},"Parafuso francês zincado 5/16\" x 2 1/2\" c/ porca","un","CNPJ","Telefone","Contato","Data","Valor","Valor Média"]
[{"$f":"+Cotações!$D$40","v":"SL Parafusos Ltda"},null,null,"06.046.959/0001-44",{"$f":"+Cotações!$E$40","v":"3411-9800"},"Carina","2021-06-30",{"$f":"+Cotações!D43","v":1.39},{"$f":"Cotações!M43","v":1.06}]
[{"$f":"+Cotações!$F$40","v":"Guido A. Jacobus"},null,null,"92.690.106/0001-82",{"$f":"+Cotações!$G$40","v":"3024-1200"},"Jéferson","2021-07-21",{"$f":"+Cotações!F43","v":0.44}]
[{"$f":"+Cotações!$H$40","v":"Central de Parafusos"},null,null,"91.526.467/0001-25",{"$f":"+Cotações!$I$40","v":"3341-9353"},"Alexandre","2021-06-15",{"$f":"+Cotações!H43","v":1.17}]
[{"$f":"+Cotações!$J$40","v":"Brasil dos Parafusos"},null,null,"10.878.757/0001-36",{"$f":"+Cotações!$K$40","v":"3326-1946"},"Marta Lopes","2021-06-17",{"$f":"+Cotações!J43","v":1.24}]
[]
[{"$f":"+Cotações!A44","v":51},"Parafuso francês zincado 5/16\" x 4\" c/ porca","un","CNPJ","Telefone","Contato","Data","Valor","Valor Média"]
[{"$f":"+Cotações!$D$40","v":"SL Parafusos Ltda"},null,null,"06.046.959/0001-44",{"$f":"+Cotações!$E$40","v":"3411-9800"},"Carina","2021-06-30",{"$f":"+Cotações!D44","v":1.91},{"$f":"Cotações!M44","v":1.47}]
[{"$f":"+Cotações!$F$40","v":"Guido A. Jacobus"},null,null,"92.690.106/0001-82",{"$f":"+Cotações!$G$40","v":"3024-1200"},"Jéferson","2021-07-21",{"$f":"+Cotações!F44","v":0.61}]
[{"$f":"+Cotações!$H$40","v":"Central de Parafusos"},null,null,"91.526.467/0001-25",{"$f":"+Cotações!$I$40","v":"3341-9353"},"Alexandre","2021-06-15",{"$f":"+Cotações!H44","v":1.65}]
[{"$f":"+Cotações!$J$40","v":"Brasil dos Parafusos"},null,null,"10.878.757/0001-36",{"$f":"+Cotações!$K$40","v":"3326-1946"},"Marta Lopes","2021-06-17",{"$f":"+Cotações!J44","v":1.72}]
[]
[{"$f":"+Cotações!A51","v":58},"Parafuso sextavado aço zincado 1/4\" x 2\" c/ porca","un","CNPJ","Telefone","Contato","Data","Valor","Valor Média"]
[{"$f":"+Cotações!$D$40","v":"SL Parafusos Ltda"},null,null,"06.046.959/0001-44",{"$f":"+Cotações!$E$40","v":"3411-9800"},"Carina","2021-06-30",{"$f":"+Cotações!D51","v":0.84650000000000003},{"$f":"Cotações!M51","v":0.59}]
[{"$f":"+Cotações!$F$40","v":"Guido A. Jacobus"},null,null,"92.690.106/0001-82",{"$f":"+Cotações!$G$40","v":"3024-1200"},"Jéferson","2021-07-21",{"$f":"+Cotações!F51","v":0.24}]
[{"$f":"+Cotações!$H$40","v":"Central de Parafusos"},null,null,"91.526.467/0001-25",{"$f":"+Cotações!$I$40","v":"3341-9353"},"Alexandre","2021-06-15",{"$f":"+Cotações!H51","v":0.6}]
[{"$f":"+Cotações!$J$40","v":"Brasil dos Parafusos"},null,null,"10.878.757/0001-36",{"$f":"+Cotações!$K$40","v":"3326-1946"},"Marta Lopes","2021-06-17",{"$f":"+Cotações!J51","v":0.68}]
[]
[{"$f":"+Cotações!A85","v":82},"Abdominal Simples","un","CNPJ","Telefone","Contato","Data","Valor","Valor Média"]
[{"$f":"+Cotações!$D$84","v":"Ziober"},null,null,"08.374.053/0001-84",{"$f":"+Cotações!$E$84","v":"44 3029-4410"},"Solaine Teline","2021-08-05",{"$f":"Cotações!D85","v":5610},{"$f":"Cotações!N85","v":4690}]
[{"$f":"+Cotações!$F$84","v":"Milla Equip. Met."},null,null,"10.555.495/0001-79",{"$f":"+Cotações!$G$84","v":"19 3363-1051"},"Tatiana Demétrio","2021-08-03",{"$f":"+Cotações!F85","v":4510}]
[{"$f":"+Cotações!$H$84","v":"Flex"},null,null,"13.898.616/0001-73",{"$f":"+Cotações!$I$84","v":"17 3223-2766"},"Fernanda","2021-08-02",{"$f":"+Cotações!H85","v":4690}]
[]
[{"$f":"+Cotações!A86","v":83},"Adução e abdução de pernas duplo","un","CNPJ","Telefone","Contato","Data","Valor","Valor Média"]
[{"$f":"+Cotações!$D$84","v":"Ziober"},null,null,"08.374.053/0001-84",{"$f":"+Cotações!$E$84","v":"44 3029-4410"},"Solaine Teline","2021-08-05",{"$f":"+Cotações!D86","v":11490},{"$f":"Cotações!N86","v":9150}]
[{"$f":"+Cotações!$F$84","v":"Milla Equip. Met."},null,null,"10.555.495/0001-79",{"$f":"+Cotações!$G$84","v":"19 3363-1051"},"Tatiana Demétrio","2021-08-03",{"$f":"+Cotações!F86","v":9150}]
[{"$f":"+Cotações!$H$84","v":"Flex"},null,null,"13.898.616/0001-73",{"$f":"+Cotações!$I$84","v":"17 3223-2766"},"Fernanda","2021-08-02",{"$f":"+Cotações!H86","v":6940}]
[]
[{"$f":"+Cotações!A87","v":84},"Esqui triplo conjugado","un","CNPJ","Telefone","Contato","Data","Valor","Valor Média"]
[{"$f":"+Cotações!$D$84","v":"Ziober"},null,null,"08.374.053/0001-84",{"$f":"+Cotações!$E$84","v":"44 3029-4410"},"Solaine Teline","2021-08-05",{"$f":"+Cotações!D87","v":18000},{"$f":"Cotações!M87","v":16140}]
[{"$f":"+Cotações!$F$84","v":"Milla Equip. Met."},null,null,"10.555.495/0001-79",{"$f":"+Cotações!$G$84","v":"19 3363-1051"},"Tatiana Demétrio","2021-08-03",{"$f":"+Cotações!F87","v":21430}]
[{"$f":"+Cotações!$H$84","v":"Flex"},null,null,"13.898.616/0001-73",{"$f":"+Cotações!$I$84","v":"17 3223-2766"},"Fernanda","2021-08-02",{"$f":"+Cotações!H87","v":8990}]
[]
[{"$f":"+Cotações!A88","v":85},"Jogo de barras","un","CNPJ","Telefone","Contato","Data","Valor","Valor Média"]
[{"$f":"+Cotações!$D$84","v":"Ziober"},null,null,"08.374.053/0001-84",{"$f":"+Cotações!$E$84","v":"44 3029-4410"},"Solaine Teline","2021-08-05",{"$f":"+Cotações!D88","v":9600},{"$f":"Cotações!M88","v":9359.33}]
[{"$f":"+Cotações!$F$84","v":"Milla Equip. Met."},null,null,"10.555.495/0001-79",{"$f":"+Cotações!$G$84","v":"19 3363-1051"},"Tatiana Demétrio","2021-08-03",{"$f":"+Cotações!F88","v":11778}]
[{"$f":"+Cotações!$H$84","v":"Flex"},null,null,"13.898.616/0001-73",{"$f":"+Cotações!$I$84","v":"17 3223-2766"},"Fernanda","2021-08-02",{"$f":"+Cotações!H88","v":6700}]
[]
[{"$f":"+Cotações!A89","v":86},"Multiexercitador conjugado 6 funções","un","CNPJ","Telefone","Contato","Data","Valor","Valor Média"]
[{"$f":"+Cotações!$D$84","v":"Ziober"},null,null,"08.374.053/0001-84",{"$f":"+Cotações!$E$84","v":"44 3029-4410"},"Solaine Teline","2021-08-05",{"$f":"+Cotações!D89","v":22200},{"$f":"Cotações!M89","v":16191.33}]
[{"$f":"+Cotações!$F$84","v":"Milla Equip. Met."},null,null,"10.555.495/0001-79",{"$f":"+Cotações!$G$84","v":"19 3363-1051"},"Tatiana Demétrio","2021-08-03",{"$f":"+Cotações!F89","v":17184}]
[{"$f":"+Cotações!$H$84","v":"Flex"},null,null,"13.898.616/0001-73",{"$f":"+Cotações!$I$84","v":"17 3223-2766"},"Fernanda","2021-08-02",{"$f":"+Cotações!H89","v":9190}]
[]
[{"$f":"+Cotações!A90","v":87},"Peitoral duplo","un","CNPJ","Telefone","Contato","Data","Valor","Valor Mediana"]
[{"$f":"+Cotações!$D$84","v":"Ziober"},null,null,"08.374.053/0001-84",{"$f":"+Cotações!$E$84","v":"44 3029-4410"},"Solaine Teline","2021-08-05",{"$f":"+Cotações!D90","v":14220},{"$f":"+Insumos!G44","v":9790}]
[{"$f":"+Cotações!$F$84","v":"Milla Equip. Met."},null,null,"10.555.495/0001-79",{"$f":"+Cotações!$G$84","v":"19 3363-1051"},"Tatiana Demétrio","2021-08-03",{"$f":"+Cotações!F90","v":9790}]
[{"$f":"+Cotações!$H$84","v":"Flex"},null,null,"13.898.616/0001-73",{"$f":"+Cotações!$I$84","v":"17 3223-2766"},"Fernanda","2021-08-02",{"$f":"+Cotações!H90","v":7700}]
[]
[{"$f":"+Cotações!A91","v":88},"Placa orientativa (ATI)","un","CNPJ","Telefone","Contato","Data","Valor","Valor Média"]
[{"$f":"+Cotações!$D$84","v":"Ziober"},null,null,"08.374.053/0001-84",{"$f":"+Cotações!$E$84","v":"44 3029-4410"},"Solaine Teline","2021-08-05",{"$f":"+Cotações!D91","v":8130},{"$f":"Cotações!M91","v":7695.33}]
[{"$f":"+Cotações!$F$84","v":"Milla Equip. Met."},null,null,"10.555.495/0001-79",{"$f":"+Cotações!$G$84","v":"19 3363-1051"},"Tatiana Demétrio","2021-08-03",{"$f":"+Cotações!F91","v":9966}]
[{"$f":"+Cotações!$H$84","v":"Flex"},null,null,"13.898.616/0001-73",{"$f":"+Cotações!$I$84","v":"17 3223-2766"},"Fernanda","2021-08-02",{"$f":"+Cotações!H91","v":4990}]
[]
[{"$f":"+Cotações!A92","v":89},"Pressão de pernas triplo conjugado","un","CNPJ","Telefone","Contato","Data","Valor","Valor Média"]
[{"$f":"+Cotações!$D$84","v":"Ziober"},null,null,"08.374.053/0001-84",{"$f":"+Cotações!$E$84","v":"44 3029-4410"},"Solaine Teline","2021-08-05",{"$f":"+Cotações!D92","v":10860},{"$f":"Cotações!M92","v":9472}]
[{"$f":"+Cotações!$F$84","v":"Milla Equip. Met."},null,null,"10.555.495/0001-79",{"$f":"+Cotações!$G$84","v":"19 3363-1051"},"Tatiana Demétrio","2021-08-03",{"$f":"+Cotações!F92","v":10706}]
[{"$f":"+Cotações!$H$84","v":"Flex"},null,null,"13.898.616/0001-73",{"$f":"+Cotações!$I$84","v":"17 3223-2766"},"Fernanda","2021-08-02",{"$f":"+Cotações!H92","v":6850}]
[]
[{"$f":"+Cotações!A93","v":90},"Puxador duplo","un","CNPJ","Telefone","Contato","Data","Valor","Valor Mediana"]
[{"$f":"+Cotações!$D$84","v":"Ziober"},null,null,"08.374.053/0001-84",{"$f":"+Cotações!$E$84","v":"44 3029-4410"},"Solaine Teline","2021-08-05",{"$f":"+Cotações!D93","v":14220},{"$f":"+Insumos!G47","v":10428}]
[{"$f":"+Cotações!$F$84","v":"Milla Equip. Met."},null,null,"10.555.495/0001-79",{"$f":"+Cotações!$G$84","v":"19 3363-1051"},"Tatiana Demétrio","2021-08-03",{"$f":"+Cotações!F93","v":10428}]
[{"$f":"+Cotações!$H$84","v":"Flex"},null,null,"13.898.616/0001-73",{"$f":"+Cotações!$I$84","v":"17 3223-2766"},"Fernanda","2021-08-02",{"$f":"+Cotações!H93","v":7690}]
[]
[{"$f":"+Cotações!A94","v":91},"Remada (APC)","un","CNPJ","Telefone","Contato","Data","Valor","Valor Mediana"]
[{"$f":"+Cotações!$D$84","v":"Ziober"},null,null,"08.374.053/0001-84",{"$f":"+Cotações!$E$84","v":"44 3029-4410"},"Solaine Teline","2021-08-05",{"$f":"+Cotações!D94","v":8340},{"$f":"Cotações!N94","v":5940}]
[{"$f":"+Cotações!$F$84","v":"Milla Equip. Met."},null,null,"10.555.495/0001-79",{"$f":"+Cotações!$G$84","v":"19 3363-1051"},"Tatiana Demétrio","2021-08-03",{"$f":"+Cotações!F94","v":5940}]
[{"$f":"+Cotações!$H$84","v":"Flex"},null,null,"13.898.616/0001-73",{"$f":"+Cotações!$I$84","v":"17 3223-2766"},"Fernanda","2021-08-02",{"$f":"+Cotações!H94","v":3890}]
[]
[{"$f":"+Cotações!A95","v":92},"Simulador de caminhada triplo conjugado","un","CNPJ","Telefone","Contato","Data","Valor","Valor Média"]
[{"$f":"+Cotações!$D$84","v":"Ziober"},null,null,"08.374.053/0001-84",{"$f":"+Cotações!$E$84","v":"44 3029-4410"},"Solaine Teline","2021-08-05",{"$f":"+Cotações!D95","v":16740},{"$f":"Cotações!M95","v":13224.66}]
[{"$f":"+Cotações!$F$84","v":"Milla Equip. Met."},null,null,"10.555.495/0001-79",{"$f":"+Cotações!$G$84","v":"19 3363-1051"},"Tatiana Demétrio","2021-08-03",{"$f":"+Cotações!F95","v":15134}]
[{"$f":"+Cotações!$H$84","v":"Flex"},null,null,"13.898.616/0001-73",{"$f":"+Cotações!$I$84","v":"17 3223-2766"},"Fernanda","2021-08-02",{"$f":"+Cotações!H95","v":7800}]
[]
[{"$f":"+Cotações!A96","v":93},"Simulador de remo","un","CNPJ","Telefone","Contato","Data","Valor","Valor Mediana"]
[{"$f":"+Cotações!$D$84","v":"Ziober"},null,null,"08.374.053/0001-84",{"$f":"+Cotações!$E$84","v":"44 3029-4410"},"Solaine Teline","2021-08-05",{"$f":"+Cotações!D96","v":6660},{"$f":"+Insumos!G50","v":5640}]
[{"$f":"+Cotações!$F$84","v":"Milla Equip. Met."},null,null,"10.555.495/0001-79",{"$f":"+Cotações!$G$84","v":"19 3363-1051"},"Tatiana Demétrio","2021-08-03",{"$f":"+Cotações!F96","v":5240}]
[{"$f":"+Cotações!$H$84","v":"Flex"},null,null,"13.898.616/0001-73",{"$f":"+Cotações!$I$84","v":"17 3223-2766"},"Fernanda","2021-08-02",{"$f":"+Cotações!H96","v":5640}]
[]
[{"$f":"+Cotações!A97","v":94},"Voador peitoral e voador dorsal (APC)","un","CNPJ","Telefone","Contato","Data","Valor","Valor Mediana"]
[{"$f":"+Cotações!$D$84","v":"Ziober"},null,null,"08.374.053/0001-84",{"$f":"+Cotações!$E$84","v":"44 3029-4410"},"Solaine Teline","2021-08-05",{"$f":"+Cotações!D97","v":13170},{"$f":"+Insumos!G51","v":6200}]
[{"$f":"+Cotações!$F$84","v":"Milla Equip. Met."},null,null,"10.555.495/0001-79",{"$f":"+Cotações!$G$84","v":"19 3363-1051"},"Tatiana Demétrio","2021-08-03",{"$f":"+Cotações!F97","v":6200}]
[{"$f":"+Cotações!$H$84","v":"Flex"},null,null,"13.898.616/0001-73",{"$f":"+Cotações!$I$84","v":"17 3223-2766"},"Fernanda","2021-08-02",{"$f":"+Cotações!H97","v":3890}]
[]
[{"$f":"+Cotações!A105","v":100},"Piso Podotátil 25 x 25 cm","un","CNPJ","Telefone","Contato","Data","Valor","Valor Mediana"]
[{"$f":"+Cotações!$D$103","v":"DPS"},null,null,"18.710.671/0001-01",{"$f":"+Cotações!$E$103","v":"3499-1536"},"Janaína Guim.","2021-06-15",{"$f":"+Cotações!D105","v":3.5},{"$f":"+Insumos!G155","v":3.5}]
[{"$f":"+Cotações!$F$103","v":"Incorevest"},null,null,"10.975.310/0001-85",{"$f":"+Cotações!$G$103","v":"3062-5119"},"Manoel","2021-06-15",{"$f":"+Cotações!F105","v":3.5}]
[{"$f":"+Cotações!J103","v":"RF Rede Pallet"},null,null,"27.657.284/0001-40",{"$f":"+Cotações!K103","v":"3059-7270"},"Débora","2021-01-21",{"$f":"+Cotações!J105","v":4.2}]
[]
[{"$f":"+Cotações!A115","v":106},"Microfibra de polipropileno","sc","CNPJ","Telefone","Contato","Data","Valor","Valor Mediana"]
[{"$f":"+Cotações!$D$114","v":"Construtec"},null,null,"02.062.999/0001-29",{"$f":"+Cotações!$E$114","v":"3012-2333"},"Eliandra","2021-06-15",{"$f":"+Cotações!D115","v":33},{"$f":"Cotações!N115","v":23.2}]
[{"$f":"+Cotações!$F$114","v":"Reis e Reis"},null,null,"00.320.025/0001-72",{"$f":"+Cotações!$G$114","v":"12 3966-9977"},"Romildo Mesquita","2021-03-31",21.65]
[{"$f":"+Cotações!$H$114","v":"TecMachine"},null,null,"10.913.018/0001-38",{"$f":"+Cotações!$I$114","v":"11 4643-4846"},"Noemi","2021-06-15",25]
[]
[{"$f":"+Cotações!A117","v":107},"Granilha para argamassa de alta resistência (Piso duro)","kg","CNPJ","Telefone","Contato","Data","Valor",{"$f":"IF(#REF!=\"NÃO\",\"Valor adotado\",\"Valor Atualizado\")","v":{"$error":"#REF!"}}]
[{"$f":"+Cotações!$D$116","v":"Mineração Peixoto"},null,null,"89.493.506/0001-93",{"$f":"+Cotações!$E$116","v":"51 3678-1020"},"Jean","2019-04-24",{"$f":"+Cotações!D117","v":0.74},{"$f":"+Insumos!#REF!","v":{"$error":"#REF!"}}]
[{"$f":"+Cotações!$F$116","v":"Grani Torre"},null,null,"49.042.302/0001-11",{"$f":"+Cotações!$G$116","v":"11 2246-1250"},"Tamara","2019-04-09",{"$f":"+Cotações!F117","v":0.65}]
[{"$f":"+Cotações!$H$116","v":"Polipiso"},null,null,"08.114.238/0001-50",{"$f":"+Cotações!$I$116","v":"99116-4697"},"Orivaldo","2019-04-09",{"$f":"+Cotações!H117","v":0.77}]
[]
[{"$f":"+Cotações!A119","v":108},"Fundo p/ galvanizado","l","CNPJ","Telefone","Contato","Data","Valor","Valor Média"]
[{"$f":"+Cotações!$D$118","v":"Constinta"},null,null,"06.102.585/0001-37",{"$f":"+Cotações!$E$118","v":"3341-6344"},"Ana Bárbara","2021-06-16",{"$f":"+Cotações!D119","v":35.270000000000003},{"$f":"+Insumos!G108","v":34.81}]
[{"$f":"+Cotações!$H$118","v":"Porto Cores"},null,null,"30.061.635/0001-60",{"$f":"+Cotações!$I$118","v":"3346-3339"},"Fabrício","2021-06-16",{"$f":"+Cotações!H119","v":37.22}]
[{"$f":"+Cotações!$J$118","v":"Aquarela Tintas"},null,null,"92.321.785/0004-65",{"$f":"+Cotações!$K$118","v":"3223-0133"},"Anderson","2021-06-16",{"$f":"+Cotações!J119","v":31.94}]
[]
[{"$f":"+Cotações!A121","v":109},"Manta Geotêxtil para cura do concreto","m²","CNPJ","Telefone","Contato","Data","Valor",{"$f":"IF(#REF!=\"NÃO\",\"Valor adotado\",\"Valor Atualizado\")","v":{"$error":"#REF!"}}]
[{"$f":"+Cotações!$D$120","v":"Drenamac"},null,null,"05.672.634/0001-04",{"$f":"+Cotações!$E$120","v":"3029-7593"},"Rafael","2019-04-11",{"$f":"+Cotações!D121","v":2.2000000000000002},{"$f":"+Insumos!#REF!","v":{"$error":"#REF!"}}]
[{"$f":"+Cotações!$F$120","v":"Drenotec"},null,null,"21.003.970/0002-00",{"$f":"+Cotações!$G$120","v":"3119-1244"},"Mary","2019-04-11",{"$f":"+Cotações!F121","v":2.5}]
[{"$f":"+Cotações!$H$120","v":"Geofoco"},null,null,"16.953.066/0001-36",{"$f":"+Cotações!$I$120","v":"0800-378-8500"},"Jéssica","2019-04-12",{"$f":"+Cotações!H121","v":2.1}]
[]
[{"$f":"+Cotações!A123","v":110},"Papeleira metálica basculante H-30","un","CNPJ","Telefone","Contato","Data","Valor","Valor *"]
[{"$f":"+Cotações!$D$122","v":"Prod Equipam. MB"},null,null,"00.929.345/0001-24",{"$f":"+Cotações!$E$122","v":"3377-2035"},"Jean","2021-06-17",900,{"$f":"+Insumos!G132","v":900}]
[null,"* Único fornecedor"]
[]
[{"$f":"+Cotações!A129","v":113},"Caçamba 4,00 m3","un","CNPJ","Telefone","Contato","Data","Valor","Valor Média"]
[{"$f":"+Cotações!$D$128","v":"Gaúcha"},null,null,"08.101.767/0001-19",{"$f":"+Cotações!$E$128","v":"3245-3500"},"Viviane","2021-06-14",{"$f":"+Cotações!D129","v":480},443.33]
[{"$f":"+Cotações!$F$128","v":"Pouco Entulho"},null,null," 25.215.615/0001-66",{"$f":"+Cotações!$G$128","v":"51 99859-2250"},"Luciana","2021-06-17",{"$f":"+Cotações!F129","v":400}]
[{"$f":"+Cotações!$H$128","v":"Tirentulho"},null,null,"05.551.367/0001-17",{"$f":"+Cotações!$I$128","v":"3475-2222"},"Francieli Bissolotti","2021-06-15",{"$f":"+Cotações!H129","v":450}]
[]
[{"$f":"+Cotações!A134","v":116},"Taxa instalação água DMAE","cj","CNPJ","Telefone","Contato","Data","Valor","Valor*"]
[{"$f":"+Cotações!$D$133","v":"DMAE"},null,null,"92.924.901/0001-98",{"$f":"+Cotações!$E$133","v":"3289-9537"},"Ricardo","2021-01-05",{"$f":"+Cotações!D134","v":465.36},{"$f":"Cotações!D134","v":465.36}]
[null,"*Tarifa municipal"]
[]
[{"$f":"+Cotações!A136","v":118},"Água tratada","m³","CNPJ","Telefone","Contato","Data","Valor","Valor*"]
[{"$f":"+Cotações!$D$133","v":"DMAE"},null,null,"92.924.901/0001-98",{"$f":"+Cotações!$E$133","v":"3289-9537"},"Ricardo","2021-01-05",{"$f":"+Cotações!D136","v":4.0199999999999996},{"$f":"Cotações!D136","v":4.0199999999999996}]
[null,"*Tarifa municipal"]
[]
[{"$f":"+Cotações!A137","v":119},"Esgoto cloacal","m³","CNPJ","Telefone","Contato","Data","Valor","Valor*"]
[{"$f":"+Cotações!$D$133","v":"DMAE"},null,null,"92.924.901/0001-98",{"$f":"+Cotações!$E$133","v":"3289-9537"},"Ricardo","2021-01-05",{"$f":"+Cotações!D137","v":3.2159999999999997},{"$f":"Cotações!D137","v":3.2159999999999997}]
[null,"*Tarifa municipal"]
[]
[{"$f":"+Cotações!A139","v":122},"Laje de Grês 90x45","un","CNPJ","Telefone","Contato","Data","Valor","Valor Média"]
[{"$f":"+Cotações!$D$138","v":"Rodrigo Paz"},null,null,"16.975.098/0001-32",{"$f":"+Cotações!$E$138","v":"3318-1010"},"Rodrigo","2021-03-31",{"$f":"+Cotações!D139","v":8},{"$f":"Cotações!N139","v":8}]
[{"$f":"+Cotações!$F$138","v":"Alicerce da Const"},null,null,"11.831.448/0001-73",{"$f":"+Cotações!$G$138","v":"3318-1010"},"Kassiele","2021-07-02",{"$f":"+Cotações!F139","v":14.9}]
[{"$f":"+Cotações!$H$138","v":"Maico Pedras"},null,null,"03.599.794/0001-40",{"$f":"+Cotações!$I$138","v":"99817-3559"},"Maico","2021-06-15",{"$f":"+Cotações!H139","v":6}]
[]
[{"$f":"+Cotações!A150","v":128},"ART","un","CNPJ","Telefone","Contato","Data","Valor","Valor Atual"]
[{"$f":"+Cotações!$D$149","v":"CREA-RS"},null,null,"92.695.790/0001-95","3320-2100","Site","2021-01-05",{"$f":"+Cotações!D150","v":226.5},{"$f":"+Insumos!G38","v":226}]

{"sheet":"Insumos","index":7,"n_rows":234,"n_cols":8,"rows_kept":234,"cut":false,"hidden":false,"merged":[[0,0,0,7],[2,0,2,7],[1,0,1,7],[3,0,3,7],[4,3,4,4],[233,3,233,4],[230,0,232,2],[233,0,233,2],[232,3,232,4],[230,3,230,4],[5,3,5,4],[5,0,5,1],[231,3,231,4],[6,0,6,5],[4,0,4,1],[5,5,5,7],[4,5,4,7]]}
["PLANILHA DE INSUMOS"]
[]
["Data Base SINAPI: JUNHO / 2021 - Data das Cotações: JULHO / 2021"]
[]
["L. S. Horistas:",null,{"$f":"+'Planilha_M.O.'!$D$7","v":1.111},"Selecionar"]
["L. S. Mensalistas:",null,{"$f":"+'Planilha_M.O.'!$D$8","v":0.69159999999999999},"MEDIANA"]
[]
["Item","Código","Insumo","Un","Tipo","Origem","Valor","Observações"]
[1,43053,"Aço CA-25 8,0 mm","kg","MAT","SINAPI",11.51]
[{"$f":"+A9+1","v":2},43054,"Aço CA-25 10,0 mm","kg","MAT","SINAPI",12.89]
[{"$f":"+A10+1","v":3},43054,"Aço CA-25 12,5 mm","kg","MAT","SINAPI",12.89]
[{"$f":"+A11+1","v":4},43054,"Aço CA-25 16,0 mm","kg","MAT","SINAPI",12.89]
[{"$f":"+A12+1","v":5},43054,"Aço CA-25 20,0 mm","kg","MAT","SINAPI",12.89]
[{"$f":"+A13+1","v":6},34449,"Aço CA-50  1/4\" (6,3 mm) - 0,248 kg/m","kg","MAT","SINAPI",14.07]
[{"$f":"+A14+1","v":7},32,"Aço CA-50  1/4\" (6,3 mm) - 0,248 kg/m - Vergalhão","kg","MAT","SINAPI",12.65]
[8,33,"Aço CA-50 5/16\" (8,0 mm) - 0,393 kg/m - Vergalhão","kg","MAT","SINAPI",12.73]
[{"$f":"+A16+1","v":9},43058,"Aço CA-50  10 mm (3/8\") dobrado e cortado - 0,624 kg/m","kg","MAT","SINAPI",11.94]
[10,43058,"Aço CA-50  5/8\" (16 mm) - 1,570 kg/m","kg","MAT","SINAPI",11.94]
[11,43061,"Aço CA-60 4,2mm - 0,109 kg/m","kg","MAT","SINAPI",11.89]
[12,43059,"Aço CA-60 4,2mm - 0,109 kg/m - Vergalhão","kg","MAT","SINAPI",11.35]
[13,43061,"Aço CA-60 5,0 mm - 0,157 kg/m","kg","MAT","SINAPI",11.89]
[14,43062,"Aço CA-60 6,0 mm - 0,222 kg/m","kg","MAT","SINAPI",12.58]
[15,43059,"ACO CA-60, 4,2 MM, OU 5,0 MM, OU 6,0 MM, OU 7,0 MM, VERGALHAO","kg","MAT","SINAPI",11.35]
[16,122,"Adesivo Plástico para PVC, frasco com 850 g","un","MAT","SINAPI",83.11]
[{"$f":"+A24+1","v":17},10527,"Andaime metálico, tipo torre, largura de 1 a 1,5 m e altura de 1 m locação","mxmês","MAT","SINAPI",23.5]
[18,43131,"Arame Galvanizado 8 BWG (0,101 kg/m)","kg","MAT","SINAPI",27.77]
[19,43131,"Arame Galvanizado 10 BWG (0,0713 kg/m)","kg","MAT","SINAPI",27.77]
[20,43130,"Arame Galvanizado 12 BWG (0,048 kg / m)","kg","MAT","SINAPI",23.91]
[21,43132,"ARAME RECOZIDO 16 BWG, D = 1,65 MM (0,016 KG/M) OU 18 BWG, D = 1,25 MM (0,01 KG/M)","kg","MAT","SINAPI",25.83]
[22,366,"Areia fina","m³","MAT","SINAPI",65]
[23,367,"Areia grossa","m³","MAT","SINAPI",60]
[24,370,"Areia média","m³","MAT","SINAPI",63.5]
[25,1381,"Argamassa Colante AC-I","kg","MAT","SINAPI",0.5]
[26,38546,"ARGAMASSA USINADA AUTOADENSAVEL E AUTONIVELANTE PARA CONTRAPISO, INCLUI BOMBEAMENTO","m³","MAT","SINAPI",376.44]
[27,6081,"Argila ou Barro para aterro ou reaterro","m³","MAT","SINAPI",31.59]
[28,1094,"ARMAÇÃO VERTICAL C/HASTE E CONTRA-PINO, EM CHAPA DE FG 3/16\", C/1 ESTRIBO","un","MAT","SINAPI",13.98]
[29,11267,"ARRUELA LISA, DE LATÃO POLIDO, DIÂMETRO NOMINAL 5/8\", DIÂMETRO DO FURO = 17 mm","un","MAT","SINAPI",0.8]
[30,{"$f":"+Cotações!A150","v":128},"ART","un","MAT","Cotação",{"$f":"TRUNC((IF($D$6=\"MÉDIA\",Cotações!M150,Cotações!N150)))","v":226}]
[31,{"$f":"+Cotações!A85","v":82},"(ATI) Abdominal","un","MAT","Cotação",{"$f":"Cotações!M85","v":4936.66}]
[32,{"$f":"+Cotações!A86","v":83},"(ATI) Adução e abdução de pernas duplo","un","MAT","Cotação",{"$f":"Cotações!M86","v":9193.33}]
[33,{"$f":"+Cotações!A87","v":84},"(ATI) Esqui triplo conjugado","un","MAT","Cotação",{"$f":"Cotações!M87","v":16140}]
[34,{"$f":"+Cotações!A88","v":85},"(ATI) Jogo de barras","un","MAT","Cotação",{"$f":"Cotações!M88","v":9359.33}]
[35,{"$f":"+Cotações!A89","v":86},"(ATI) Multiexercitador conjugado 6 funções","un","MAT","Cotação",{"$f":"Cotações!M89","v":16191.33}]
[36,{"$f":"+Cotações!A90","v":87},"(ATI) Peitoral duplo","un","MAT","Cotação",{"$f":"Cotações!N90","v":9790}]
[37,{"$f":"+Cotações!A91","v":88},"(ATI) Placa orientativa","un","MAT","Cotação",{"$f":"Cotações!M91","v":7695.33}]
[38,{"$f":"+Cotações!A92","v":89},"(ATI) Pressão de pernas triplo conjugado","un","MAT","Cotação",{"$f":"Cotações!M92","v":9472}]
[39,{"$f":"+Cotações!A93","v":90},"(ATI) Puxador duplo","un","MAT","Cotação",{"$f":"TRUNC((IF($D$6=\"MÉDIA\",Cotações!M93,Cotações!N93)))","v":10428}]
[40,{"$f":"+Cotações!A94","v":91},"(APC) Remada","un","MAT","Cotação",{"$f":"Cotações!N94","v":5940}]
[41,{"$f":"+Cotações!A95","v":92},"(ATI) Simulador de caminhada triplo conjugado","un","MAT","Cotação",{"$f":"Cotações!M95","v":13224.66}]
[42,{"$f":"+Cotações!A96","v":93},"(ATI) Simulador de remo","un","MAT","Cotação",{"$f":"TRUNC((IF($D$6=\"MÉDIA\",Cotações!M96,Cotações!N96)))","v":5640}]
[43,{"$f":"+Cotações!A97","v":94},"(APC) Voador peitoral e voador dorsal","un","MAT","Cotação",{"$f":"Cotações!N97","v":6200}]
[44,546,"Barra de ferro chata, retangular (qualquer bitola)","kg","MAT","SINAPI",9.8699999999999992]
[45,563,"Barra ferro chato 1 1/2\" x 3/8\"","m","MAT","SINAPI",28.31]
[46,547,"Barra ferro chato 2\" x 3/8\"","kg","MAT","SINAPI",37.78]
[47,{"$f":"+Cotações!A99","v":95},"Basalto irregular","m²","MAT","Cotação",{"$f":"Cotações!N99","v":60}]
[48,{"$f":"+Cotações!A100","v":96},"Basalto  irregular meio retalhão","m²","MAT","Cotação",{"$f":"TRUNC((IF($D$6=\"MÉDIA\",Cotações!M100,Cotações!N100)))","v":115}]
[49,{"$f":"+Cotações!A101","v":97},"Basalto regular talhado","m²","MAT","Cotação",{"$f":"Cotações!N101","v":87.5}]
[50,{"$f":"+Cotações!A102","v":98},"Basalto regular serrado","m²","MAT","Cotação",{"$f":"TRUNC((IF($D$6=\"MÉDIA\",Cotações!M102,Cotações!N102)))","v":115}]
[51,36155,"Bloco concreto tipo holandês cor natural - 6 cm - 35 MPa","m²","MAT","SINAPI",31.66]
[52,38783,"BLOCO CERAMICO DE VEDACAO COM FUROS NA HORIZONTAL, 11,5 X 19 X 19 CM - 4,5 MPA (NBR 15270)","un","MAT","SINAPI",0.96]
[53,20086,"Bucha de redução de PVC, longa 50 x 40 mm, esgoto predial","un","MAT","SINAPI",2.79]
[54,4375,"Bucha nylon S-6 4,2 x 38","un","MAT","SINAPI",0.16]
[55,4376,"Bucha nylon S-8 4,8 x 45","un","MAT","SINAPI",0.31]
[56,11950,"BUCHA NYLON S/ABA S6, C/PARAFUSO DE 4,2 x 40 mm EM AÇO ZINCADO C/ROSCA SOBERBA","un","MAT","SINAPI",0.37]
[57,41954,"Cabo de aço galvanizado, diâmetro 9,53 mm","kg","MAT","SINAPI",75.64]
[58,{"$f":"+Cotações!A129","v":113},"Caçamba 4,00 m³","un","MAT","Cotação",{"$f":"Cotações!M129","v":443.33}]
[59,4400,"CAIBRO NAO APARELHADO, *6 X 8* CM, EM MACARANDUBA, ANGELIM OU EQUIVALENTE DA REGIAO - BRUTA","m","MAT","SINAPI",16.87]
[60,4430,"Caibro de madeira não aparelhada 5 x 6 cm","m","MAT","SINAPI",10.6]
[61,34643,"CAIXA INSPEÇÃO EM POLIETILENO PARA ATERRAMENTO E PÁRA RAIOS DIÂMETRO = 300 mm","un","MAT","SINAPI",20.079999999999998]
[62,39809,"CAIXA P/MEDIDOR POLIFÁSICO, EM POLICARBONATO/TERMOPLÁSTICO, P/1 DISJUNTOR","un","MAT","SINAPI",138.18]
[63,25963,"CALCARIO DOLOMITICO A (POSTO PEDREIRA/FORNECEDOR, SEM FRETE)","kg","MAT","SINAPI",0.08]
[{"$f":"+A71+1","v":64},4777,"Cantoneira aço (abas iguais) qualquer bitola, espessura entre 1/8\" e 1/4\"","kg","MAT","SINAPI",10.65]
[{"$f":"+A72+1","v":65},4777,"Cantoneira ferro 1 1/4\" x 3/16\"","kg","MAT","SINAPI",10.65]
[66,4777,"Cantoneira ferro 1 1/2\" x 1/4\"","kg","MAT","SINAPI",10.65]
[67,11046,"CHAPA DE ACO GALVANIZADA BITOLA GSG 18, E = 1,25 MM (10,00 KG/M2)","kg","MAT","SINAPI",15.77]
[68,11049,"CHAPA DE ACO GALVANIZADA BITOLA GSG 22, E = 0,80 MM (6,40 KG/M2)","kg","MAT","SINAPI",16.43]
[69,11051,"CHAPA DE ACO GALVANIZADA BITOLA GSG 26, E = 0,50 MM (4,00 KG/M2)","kg","MAT","SINAPI",17.25]
[70,1355,"Chapa compensado resinado 14 mm","m²","MAT","SINAPI",28.72]
[71,1347,"Chapa de madeira compensada plastificada 12 mm","m²","MAT","SINAPI",27.6]
[72,1342,"Chapa compensado plastificado 14 mm","m²","MAT","SINAPI",71.14]
[73,1333,"Chapa de aço 1/2\"","kg","MAT","SINAPI",12.53]
[74,1330,"Chapa de aço 1/4\"","kg","MAT","SINAPI",12.41]
[75,34353,"CIMENTO COLA AC-2","kg","MAT","SINAPI",0.98]
[76,1379,"Cimento Portland CP-II 32","kg","MAT","SINAPI",0.65]
[77,1527,"Concreto usinado bombeável, fck=25 MPa, slump = 100 +/- 20 mm, inclui serviço de bombeamento","m³","MAT","SINAPI",384.28]
[78,34498,"Cone de sinalização em PVC flexível, h=70/76 cm","un","MAT","SINAPI",114.77]
[79,11864,"CONECTOR METÁLICO TIPO PARAFUSO FENDIDO (SPLIT BOLT), PARA CABOS ATÉ 95 mm2","un","MAT","SINAPI",29.18]
[80,{"$f":"+Cotações!A76","v":76},"Corrente aço galvanizado 5 mm elo longo 22 x 45 mm","kg","MAT","Cotação",{"$f":"Cotações!M76","v":23.08}]
[81,{"$f":"+Cotações!A144","v":125},"Cuba inox p/bebedouro 38 cm","un","MAT","Cotação",{"$f":"Cotações!M144","v":189.7}]
[82,1970,"Curva PVC longa 90 esgoto predial 100 mm","un","MAT","SINAPI",55.87]
[83,2692,"Desmoldante p/formas de madeira","l","MAT","SINAPI",4.46]
[{"$f":"+A91+1","v":84},25931,"DISCO DE CORTE DIAMANTADO SEGMENTADO DIAMETRO DE 180 MM PARA ESMERILHADEIRA 7 \"","un","MAT","SINAPI",92.37]
[85,2421,"Dobradiça ferro galvanizado 4\" x 3\"","un","MAT","SINAPI",23.91]
[86,11002,"ELETRODO REVESTIDO AWS - E6013, DIAMETRO IGUAL A 2,50 MM","kg","MAT","SINAPI",41.2]
[{"$f":"A94+1","v":87},2705,"ENERGIA ELÉTRICA ATÉ 2000 kWh INDUSTRIAL, SEM DEMANDA","kWh","MAT","SINAPI",0.91]
[{"$f":"A95+1","v":88},6141,"ENGATE/RABICHO FLEXIVEL PLASTICO (PVC OU ABS) BRANCO 1/2 \" X 30 CM","un","MAT","SINAPI",4.91]
[89,39017,"Espaçador circular em plástico, 4,2 a 12,5 mm","m","MAT","SINAPI",0.13]
[90,10886,"EXTINTOR DE INCENDIO PORTATIL COM CARGA DE AGUA PRESSURIZADA DE 10 L, CLASSE A","un","MAT","SINAPI",183.75]
[91,10891,"EXTINTOR DE INCENDIO PORTATIL COM CARGA DE PO QUIMICO SECO (PQS) DE 4 KG, CLASSE BC","un","MAT","SINAPI",177.69]
[92,38125,"Fertilizante orgânico composto, classe A","kg","MAT","SINAPI",1.33]
[93,25951,"FERTILIZANTE NPK - 10:10:10","kg","MAT","SINAPI",2.25]
[94,12815,"Fita crepe rolo 25 mm x 50 m","un","MAT","SINAPI",7.28]
[95,14153,"FITA METÁLICA PERFURADA, L = 18 mm, ROLO DE 30 m, CARGA RECOMENDADA = 30 kgf","un","MAT","SINAPI",52.81]
[96,3148,"Fita veda rosca em rolos de 18 mm x 50 m","un","MAT","SINAPI",18.399999999999999]
[97,42015,"Fita zebrada","m","MAT","SINAPI",1.1200000000000001]
[98,{"$f":"+Cotações!A83","v":81},"Fradinho em ferro fundido","un","MAT","Cotação",{"$f":"Cotações!M83","v":314}]
[99,7307,"Fundo anticorrosivo tipo zarcão","l","MAT","SINAPI",29.63]
[{"$f":"+A107+1","v":100},{"$f":"+Cotações!A119","v":108},"Fundo p/galvanizado","l","MAT","Cotação",{"$f":"Cotações!M119","v":34.81}]
[101,6086,"Fundo sintético nivelador branco fosco","gl","MAT","SINAPI",90.88]
[102,4011,"GEOTEXTIL NAO TECIDO AGULHADO DE FILAMENTOS CONTINUOS 100%","m²","MAT","SINAPI",6.75]
[103,3322,"Grama catarina (Grama São Carlos)","m²","MAT","SINAPI",20.45]
[104,{"$f":"+Cotações!A12","v":20},"Guia cedrinho 2,5 x 10 cm","m","MAT","Cotação",{"$f":"Cotações!N12","v":14.37}]
[105,{"$f":"+Cotações!A13","v":22},"Guia cedrinho 2,5 x 20 cm","m","MAT","Cotação",{"$f":"Cotações!N13","v":28.75}]
[106,3398,"ISOLADOR DE PORCELANA, TIPO ROLDANA, DIMENSÕES DE 72 x 72 mm","un","MAT","SINAPI",4.7699999999999996]
[107,3505,"Joelho PVC roscável 90⁰ 3/4\"","un","MAT","SINAPI",4.6399999999999997]
[108,{"$f":"+Cotações!A139","v":122},"Laje de grês 90 x 45 cm","un","MAT","Cotação",{"$f":"Cotações!M139","v":9.6300000000000008}]
[109,{"$f":"+Cotações!A104","v":99},"Lajota concreto","m²","MAT","Cotação",{"$f":"Cotações!N104","v":32.9}]
[110,{"$f":"+Cotações!A37","v":46},"Laminado melamínico fosco esp = 2,8 mm","m²","MAT","Cotação",{"$f":"Cotações!N37","v":32.25}]
[111,3768,"Lixa p/ferro","fl","MAT","SINAPI",3.37]
[112,3767,"Lixa p/madeira","fl","MAT","SINAPI",0.79]
[113," 89.50.09","BANHEIRO QUIMICO 2 MANUT. 2 ROLOS PAPEL HIGIENICO","mês","MAT","SUDECAP",680]
[114,3777,"LONA PLASTICA PESADA PRETA, E = 150 MICRA","m²","MAT","SINAPI",1.47]
[115,4011,"Manta Bidim RT-10","m²","MAT","SINAPI",5.29]
[116,3288,"Meia cana cedrinho 2,5 x 2,5 cm","m","MAT","SINAPI",4.29]
[117,4059,"Meio-fio pré-moldado, comp. 1 m, 30 x 15/12 cm (h x l1/l2)","m","MAT","SINAPI",22.86]
[118,{"$f":"+Cotações!A115","v":106},"Microfibra de polipropileno","sc","MAT","Cotação",{"$f":"Cotações!N115","v":23.2}]
[119,4107,"Mourão de concreto reto, 10 x 10 cm, h= 2,30 m","un","MAT","SINAPI",43.99]
[120,36797,"Mourão de concreto curvo, 10 x 10 cm, h= 2,60 m + curva de 0,40 m","un","MAT","SINAPI",46.66]
[121,4211,"Nipel PVC roscável 3/4\"","un","MAT","SINAPI",1.93]
[122,7252,"LOCACAO DE NIVEL OPTICO, COM PRECISAO DE 0,7 MM, AUMENTO DE 32X","un","MAT","SINAPI",2.0299999999999998]
[{"$f":"+A129+1","v":122},4227,"Óleo lubrificante para motores","l","MAT","SINAPI",1.93]
[{"$f":"+A131+1","v":123},{"$f":"+Cotações!A123","v":110},"Papeleira externa metálica H-30","un","MAT","Cotação",{"$f":"TRUNC((IF($D$6=\"MÉDIA\",Cotações!M123,Cotações!N123)))","v":900}]
[124,{"$f":"+Cotações!A41","v":48},"Parafuso aço inox 1/4\" x 3\" c/porca","un","MAT","Cotação",{"$f":"Cotações!M41","v":2.0299999999999998}]
[125,{"$f":"+Cotações!A42","v":49},"Parafuso francês zincado 5/16\" x 2\" c/porca","un","MAT","Cotação",{"$f":"Cotações!M42","v":0.91}]
[126,{"$f":"+Cotações!A43","v":50},"Parafuso francês zincado 5/16\" x 2 1/2\" c/porca","un","MAT","Cotação",{"$f":"Cotações!M43","v":1.06}]
[127,{"$f":"+Cotações!A44","v":51},"Parafuso francês zincado 5/16\" x 4\" c/porca","un","MAT","Cotação",{"$f":"Cotações!M44","v":1.47}]
[128,{"$f":"+Cotações!A45","v":52},"Parafuso francês zincado 5/16\" x 5\" c/porca","un","MAT","Cotação",{"$f":"Cotações!M45","v":1.74}]
[129,{"$f":"+Cotações!A46","v":53},"Parafuso inox auto atarraxante 4,8 x 70","un","MAT","Cotação",{"$f":"Cotações!N46","v":1.01}]
[{"$f":"+A138+1","v":130},{"$f":"+Cotações!A47","v":54},"Parafuso inox auto atarraxante 4,8 x 100","un","MAT","Cotação",{"$f":"Cotações!M47","v":2.52}]
[{"$f":"+A139+1","v":131},4346,"PARAFUSO FERRO POLIDO, SEXTAVADO, D=5/8\", C/PORCA E ARRUELA DE PRESSÃO MÉDIA","un","MAT","SINAPI",6.93]
[132,4356,"Parafuso rosca soberba 4,8 x 45 mm","un","MAT","SINAPI",0.16]
[{"$f":"+A141+1","v":133},4332,"Parafuso sextavado aço zincado 3/8\"x 2\"","un","MAT","SINAPI",0.68]
[134,{"$f":"+Cotações!A48","v":55},"Parafuso sextavado aço zincado 1/2\" x 1 1/2\"","un","MAT","Cotação",{"$f":"Cotações!M48","v":1.7}]
[135,{"$f":"+Cotações!A49","v":56},"Parafuso sextavado aço zincado 1/2\" x 3 1/2\"","un","MAT","Cotação",{"$f":"Cotações!M49","v":3.38}]
[136,{"$f":"+Cotações!A51","v":58},"Parafuso sextavado aço zincado c/porca 1/4\" x 2\"","un","MAT","Cotação",{"$f":"Cotações!M51","v":0.59}]
[137,4385,"Paralelepípedo granítico ou basáltico","un","MAT","SINAPI",1.52]
[138,4813,"PLACA DE OBRA (PARA CONSTRUCAO CIVIL) EM CHAPA GALVANIZADA *N. 22*","un","MAT","SINAPI",225]
[139,4720,"Pedra britada nº 0","m³","MAT","SINAPI",63.85]
[140,4721,"Pedra britada nº 1","m³","MAT","SINAPI",55.3]
[141,4718,"PEDRA BRITADA N. 2 (19 A 38 MM) POSTO PEDREIRA/FORNECEDOR, SEM FRETE","m³","MAT","SINAPI",55.6]
[142,{"$f":"+Cotações!A142","v":124},"Pedra de alicerce 20 x 20 x 20 cm","un","MAT","Cotação",{"$f":"Cotações!M142","v":5.25}]
[143,{"$f":"+Cotações!A140","v":123},"Pedra de grês 43 x 21 x 12 cm","un","MAT","Cotação",{"$f":"Cotações!M140","v":2.09}]
[144,4708,"PEDRA PORTUGUESA OU PETIT PAVE, BRANCA OU PRETA","m²","MAT","SINAPI",217.56]
[145,37395,"PINO DE ACO COM FURO, HASTE = 27 MM (ACAO DIRETA)","m","MAT","SINAPI",38.39]
[146,{"$f":"+Cotações!A105","v":100},"Piso podotátil 25x25 cm","un","MAT","Cotação",{"$f":"Cotações!N105","v":3.5}]
[147,{"$f":"+Cotações!A127","v":112},"Placa de granito","un","MAT","Cotação",{"$f":"Cotações!M127","v":697.5}]
[148,4813,"PLACA DE OBRA (PARA CONSTRUCAO CIVIL) EM CHAPA GALVANIZADA *N. 22*, ADESIVADA, DE *2,0 X 1,125* M","m²","MAT","SINAPI",225]
[149,4741,"Pó de pedra","m³","MAT","SINAPI",52.24]
[150,2745,"PONTALETE ROLIÇO SEM TRATAMENTO, D = 8 A 11 CM, H = 3 M, EM EUCALIPTO OU EQUIVALENTE DA REGIAO - BRUTA (PARA ESCORAMENTO)","m","MAT","SINAPI",3.39]
[151,4491,"PONTALETE EM PINUS 7,5 x 7,5 cm","m","MAT","SINAPI",4.07]
[152,4339,"Porca sextavada aço zincado 1/2\"","un","MAT","SINAPI",0.34]
[153,4342,"Porca sextavada aço zincado 3/8\"","un","MAT","SINAPI",0.14000000000000001]
[154,39997,"PORCA ZINCADA, SEXTAVADA, DIÂMETRO 1/4\"","un","MAT","SINAPI",0.2]
[155,20247,"Prego de aço 15 x 15 c/cabeça","kg","MAT","SINAPI",22.47]
[156,5074,"Prego de aço 15 x 18 c/cabeça","kg","MAT","SINAPI",22.74]
[157,5075,"PREGO DE AÇO 18 x 30 C/CABEÇA","kg","MAT","SINAPI",21.11]
[158,5068,"PREGO DE ACO POLIDO COM CABECA 17 X 21 (2 X 11)","kg","MAT","SINAPI",21.11]
[159,5073,"Prego de aço 17 x 24 c/cabeça","kg","MAT","SINAPI",20.68]
[{"$f":"+A168+1","v":160},40304,"Prego de aço 17 x 27 c/cabeça dupla","kg","MAT","SINAPI",25.05]
[161,5061,"PREGO DE AÇO 18 x 27 C/CABEÇA","kg","MAT","SINAPI",20.75]
[162,39027,"Prego de aço 19 x 36 c/cabeça","kg","MAT","SINAPI",20.27]
[163,5044,"POSTE DE CONCRETO CIRCULAR, 200 kg, H = 9 m","un","MAT","SINAPI",920.7]
[164,20043,"REDUÇÃO EXCÊNTRICA PVC P/ ESGOTO PREDIAL 100 x 50 mm","un","MAT","SINAPI",8.94]
[165,6016,"REGISTRO GAVETA BRUTO EM LATÃO FORJADO, BITOLA 3/4\"","un","MAT","SINAPI",32.79]
[166,{"$f":"+Cotações!A107","v":101},"Saibro rosa - posto obra","m³","MAT","Cotação",{"$f":"Cotações!M107","v":59}]
[167,{"$f":"+Cotações!A8","v":27},"Sarrafo cedrinho 2,5 x 2,5 cm","m","MAT","Cotação",{"$f":"Cotações!N8","v":4.5999999999999996}]
[168,{"$f":"+Cotações!A9","v":28},"Sarrafo cedrinho 2,5 x 5,0 cm","m","MAT","Cotação",{"$f":"Cotações!N9","v":7.5}]
[169,4417,"Sarrafo de madeira não aparelhada 2,5x7 cm","m","MAT","SINAPI",32.79]
[170,4460,"Sarrafo não aparelhado 2,5x10 cm","m","MAT","SINAPI",7.48]
[171,4512," SARRAFO DE MADEIRA NAO APARELHADA 2,5 X 5 CM (1 X 2 \") PINUS, MISTA OU EQUIVALENTE DA REGIAO","m","MAT","SINAPI",0.98]
[172,4517,"Sarrafo pinus 2,5 x 7,5 cm","m","MAT","SINAPI",1.53]
[173,5318,"Solvente Diluente a base de aguarrás","l","MAT","SINAPI",17.98]
[174,6193,"Tábua de madeira não aparelhada cedrinho 2,5 x 20 cm","m","MAT","SINAPI",14.98]
[175,6189,"Tábua de madeira não aparelhada cedrinho 2,5 x 30 cm","m","MAT","SINAPI",21.86]
[176,{"$f":"+Cotações!$A$154","v":130},"Tabuleiro p/mesa de damas 40 x 40 cm","un","MAT","Cotação",{"$f":"TRUNC((IF($D$6=\"MÉDIA\",Cotações!M154,Cotações!N154)))","v":950},"VALOR ATUALIZADO"]
[177,1163,"CAP OU TAMPAO DE FERRO GALVANIZADO, COM ROSCA BSP, DE 3/4\"","un","MAT","SINAPI",5.43]
[178,1164,"Tampão de ferro galvanizado de 1 1/4\"","un","MAT","SINAPI",12.08]
[179,1165,"Tampão de ferro galvanizado de 1 1/2\"","un","MAT","SINAPI",14.92]
[180,1166,"Tampão de ferro galvanizado de 2\"","un","MAT","SINAPI",21.55]
[181,1169,"Tampão de ferro galvanizado de 2 1/2\"","un","MAT","SINAPI",41.16]
[182,1168,"Tampão de ferro galvanizado de 3\"","un","MAT","SINAPI",55.4]
[183,34558,"TELA DE ACO SOLDADA GALVANIZADA/ZINCADA PARA ALVENARIA, FIO D = *1,20 A 1,70* MM, MALHA 15 X 15 MM, (C X L) *50 X 10,5* CM","m²","MAT","SINAPI",5.76]
[184,37411,"TELA DE ACO SOLDADA GALVANIZADA/ZINCADA PARA ALVENARIA, FIO D = *1,24 MM, MALHA 25 X 25 MM","m²","MAT","SINAPI",32.79]
[185,37524,"TELA PLASTICA LARANJA, TIPO TAPUME PARA SINALIZACAO, MALHA RETANGULAR, ROLO 1.20 X 50 M (L X C)","m","MAT","SINAPI",2.06]
[186,7155,"Tela de aço soldada CA-60 4,2 mm 10 x 10 cm (Q-138)","m²","MAT","SINAPI",35.270000000000003]
[187,7158,"TELA DE ARAME GALVANIZADA QUADRANGULAR / LOSANGULAR, FIO 2,77 MM (12 BWG), MALHA 5 X 5 CM, H = 2 M","m²","MAT","SINAPI",23.48]
[188,21141,"Tela de aço soldada CA-60 4,2 mm 15 x 15 cm (Q-92)","m²","MAT","SINAPI",24.18]
[189,7156,"Tela de aço soldada CA-60 5,0 mm 10 x 10 cm (Q-196)","m²","MAT","SINAPI",51.7]
[190,7258,"TIJOLO CERAMICO MACICO *5 X 10 X 20* CM","un","MAT","SINAPI",0.62]
[191,10617,"Tijolo cerâmico refratário 6,3 x 11,4 x 22,9 cm","un","MAT","SINAPI",5.05]
[192,34401,"TIJOLO CERÂMICO LAMINADO 5,5 x 11 x 23 cm","un","MAT","SINAPI",1.71]
[193,7311,"TINTA ESMALTE SINTETICO PREMIUM ACETINADO","l","MAT","SINAPI",28.37]
[194,7348,"Tinta acrílica premium para piso","l","MAT","SINAPI",17.12]
[195,7292,"Tinta esmalte sintético brilhante","l","MAT","SINAPI",27.61]
[196,7293,"Tinta grafite","l","MAT","SINAPI",30.39]
[197,35693,"TINTA LÁTEX ACRÍLICA ECONÔMICA, COR BRANCA","l","MAT","SINAPI",11.78]
[198,21009,"Tubo aço galvanizado c/costura 3/4\", 2,25 mm","m","MAT","SINAPI",30.9]
[199,21010,"Tubo aço galvanizado c/costura 1\", 2,65 mm","m","MAT","SINAPI",41.49]
[200,21011,"Tubo aço galvanizado c/costura 1 1/4\", 2,65 mm","m","MAT","SINAPI",60.47]
[201,21012,"Tubo aço galvanizado c/costura 1 1/2\", 3,00 mm","m","MAT","SINAPI",77.03]
[202,21013,"Tubo aço galvanizado c/costura 2\", 3,00 mm","m","MAT","SINAPI",87.2]
[203,21014,"Tubo aço galvanizado c/costura 2 1/2\", 3,35 mm","m","MAT","SINAPI",140.66]
[204,21015,"Tubo aço galvanizado c/costura 3\", 3,35 mm","m","MAT","SINAPI",140.18]
[205,21016,"Tubo aço galvanizado c/costura 4\", 3,75 mm","m","MAT","SINAPI",203.16]
[206,7745,"Tubo PA-1 PB 400 mm","m","MAT","SINAPI",78.55]
[207,9833,"Tubo PVC, flexível, corrugado, perfurado, DN 110 mm, para drenagem","m","MAT","SINAPI",9.51]
[{"$f":"+A216+1","v":208},9837,"Tubo PVC p/esgoto predial 75 mm","m","MAT","SINAPI",15.63]
[209,9836,"Tubo PVC p/esgoto predial 100 mm","m","MAT","SINAPI",17.64]
[210,9868,"TUBO PVC SOLDÁVEL 25 mm","m","MAT","SINAPI",4.91]
[211,9869,"TUBO PVC SOLDÁVEL 32mm","m","MAT","SINAPI",11.02]
[212,9859,"TUBO PVC ROSCÁVEL 3/4\"","m","MAT","SINAPI",13.24]
[213,20065,"Tubo PVC p/esgoto predial 150 mm","m","MAT","SINAPI",45.13]
[214,41930,"Tubo coletor de esgoto PVC, JEI, DN 200 mm","m","MAT","SINAPI",142.47]
[215,{"$f":"+Cotações!A125","v":111},"Válvula de mictório anti-vandalismo alta pressão","un","MAT","Cotação",{"$f":"Cotações!N125","v":413.9}]
[216,10478,"VERNIZ POLIURETANO BRILHANTE PARA MADEIRA, COM FILTRO SOLAR, USO INTERNO E EXTERNO","l","MAT","SINAPI",30.97]
[217,39996,"VERGALHÃO ZINCADO ROSCA TOTAL, 1/4 \" (6,3 mm)","m","MAT","SINAPI",5.38]
[218,4481,"VIGA NAO APARELHADA *8 X 16* CM EM MACARANDUBA, ANGELIM OU EQUIVALENTE DA REGIAO - BRUTA","m","MAT","SINAPI",43.33]
[219,35272,"VIGA NAO APARELHADA *6 X 20* CM, EM MACARANDUBA, ANGELIM OU EQUIVALENTE DA REGIAO","m","MAT","SINAPI",40.479999999999997]
[]
[]
["Totais",null,null,"SINAPI",null,{"$f":"+COUNTIF($F$9:$F$229,\"SINAPI\")","v":170}]
[null,null,null,"SUDECAP",null,1]
[null,null,null,"Cotação",null,{"$f":"+COUNTIF($F$9:$F$229,\"Cotação\")","v":49}]
["Total Final",{"$nulls":4},{"$f":"F231+F233+F232","v":220}]

{"sheet":"Cotações","index":8,"n_rows":154,"n_cols":14,"rows_kept":154,"cut":false,"hidden":false,"merged":[[6,9,6,10],[11,9,11,10],[10,5,10,6],[10,7,10,8],[14,5,14,6],[14,7,14,8],[12,7,12,8],[15,3,15,4],[12,9,12,10],[15,7,15,8],[11,3,11,4],[16,3,16,4],[17,3,17,4],[12,3,12,4],[13,9,13,10],[11,7,11,8],[11,5,11,6],[12,5,12,6],[14,3,14,4],[17,5,17,6],[77,11,77,13],[74,11,74,13],[67,9,67,10],[76,9,76,10],[61,9,61,10],[58,9,58,10],[57,9,57,10],[63,12,63,13],[64,12,64,13],[65,12,65,13],[68,11,68,13],[71,11,71,13],[62,11,62,13],[71,0,71,2],[60,0,60,2],[44,3,44,4],[35,9,35,10],[37,9,37,10],[64,9,64,10],[65,9,65,10],[70,5,70,6],[51,5,51,6],[53,7,53,8],[81,7,81,8],[79,7,79,8],[79,5,79,6],[79,3,79,4],[46,9,46,10],[23,7,23,8],[22,7,22,8],[21,7,21,8],[20,7,20,8],[20,5,20,6],[22,5,22,6],[21,5,21,6],[30,3,30,4],[27,3,27,4],[28,5,28,6],[26,3,26,4],[24,3,24,4],[21,3,21,4],[21,9,21,10],[20,9,20,10],[20,3,20,4],[13,11,13,13],[24,9,24,10],[63,9,63,10],[14,9,14,10],[17,9,17,10],[28,9,28,10],[86,7,86,8],[18,7,18,8],[16,7,16,8],[17,7,17,8],[83,11,83,13],[81,9,81,10],[83,9,83,10],[81,11,81,13],[82,9,82,10],[80,9,80,10],[75,9,75,10],[73,9,73,10],[54,7,54,8],[50,7,50,8],[26,7,26,8],[19,7,19,8],[52,11,52,13],[35,11,35,13],[105,5,105,6],[104,5,104,6],[114,5,114,6],[112,5,112,6],[106,3,106,4],[108,3,108,4],[108,5,108,6],[110,3,110,4],[109,3,109,4],[132,0,132,2],[113,11,113,13],[106,9,106,10],[110,9,110,10],[105,9,105,10],[109,9,109,10],[111,11,111,13],[112,9,112,10],[115,11,115,13],[116,9,116,10],[107,11,107,13],[122,5,122,6],[122,3,122,4],[120,5,120,6],[120,3,120,4],[116,3,116,4],[122,7,122,8],[111,0,111,2],[125,0,125,2],[113,0,113,2],[115,0,115,2],[117,0,117,2],[126,9,126,10],[108,7,108,8],[25,3,25,4],[26,5,26,6],[19,5,19,6],[28,3,28,4],[29,3,29,4],[18,3,18,4],[23,5,23,6],[16,5,16,6],[15,5,15,6],[18,5,18,6],[19,3,19,4],[40,9,40,10],[30,5,30,6],[33,5,33,6],[38,7,38,8],[38,5,38,6],[34,7,34,8],[33,7,33,8],[43,7,43,8],[41,5,41,6],[30,7,30,8],[0,0,0,13],[4,0,4,13],[2,10,2,12],[5,9,5,10],[41,9,41,10],[38,9,38,10],[36,9,36,10],[34,9,34,10],[16,9,16,10],[15,9,15,10],[29,9,29,10],[33,9,33,10],[32,9,32,10],[30,9,30,10],[31,9,31,10],[32,7,32,8],[13,0,13,2],[23,3,23,4],[22,3,22,4],[19,9,19,10],[18,9,18,10],[23,9,23,10],[27,5,27,6],[29,5,29,6],[37,11,37,13],[63,7,63,8],[45,5,45,6],[56,5,56,6],[6,0,6,2],[8,9,8,10],[8,7,8,8],[7,3,7,4],[6,11,6,13],[7,9,7,10],[7,7,7,8],[7,5,7,6],[8,5,8,6],[8,3,8,4],[9,11,9,13],[10,3,10,4],[44,7,44,8],[25,7,25,8],[24,7,24,8],[24,5,24,6],[25,5,25,6],[25,9,25,10],[22,9,22,10],[27,9,27,10],[49,7,49,8],[57,5,57,6],[101,7,101,8],[87,7,87,8],[60,11,60,13],[26,9,26,10],[40,5,40,6],[66,11,66,13],[42,9,42,10],[47,9,47,10],[44,9,44,10],[43,9,43,10],[52,9,52,10],[45,9,45,10],[51,9,51,10],[50,9,50,10],[49,9,49,10],[48,9,48,10],[28,7,28,8],[29,7,29,8],[31,7,31,8],[42,7,42,8],[27,7,27,8],[39,11,39,13],[53,9,53,10],[54,9,54,10],[55,9,55,10],[60,9,60,10],[59,9,59,10],[56,9,56,10],[66,9,66,10],[101,9,101,10],[72,9,72,10],[70,9,70,10],[69,9,69,10],[94,9,94,10],[95,9,95,10],[100,9,100,10],[99,9,99,10],[98,9,98,10],[96,9,96,10],[78,9,78,10],[97,0,97,2],[105,0,105,2],[85,7,85,8],[97,11,97,13],[80,7,80,8],[80,5,80,6],[121,11,121,13],[92,3,92,4],[94,7,94,8],[92,7,92,8],[93,5,93,6],[93,3,93,4],[94,3,94,4],[91,3,91,4],[91,5,91,6],[90,3,90,4],[118,9,118,10],[104,9,104,10],[103,9,103,10],[115,9,115,10],[114,9,114,10],[101,5,101,6],[100,5,100,6],[99,7,99,8],[117,5,117,6],[83,0,83,2],[82,5,82,6],[90,5,90,6],[112,3,112,4],[130,3,130,4],[129,0,129,2],[85,5,85,6],[87,5,87,6],[101,3,101,4],[85,3,85,4],[87,3,87,4],[92,5,92,6],[94,5,94,6],[118,5,118,6],[89,3,89,4],[119,0,119,2],[121,0,121,2],[123,0,123,2],[127,0,127,2],[106,5,106,6],[121,5,121,6],[110,5,110,6],[114,3,114,4],[52,0,52,2],[62,0,62,2],[68,0,68,2],[73,3,73,4],[67,5,67,6],[77,0,77,2],[64,3,64,4],[65,3,65,4],[69,3,69,4],[58,5,58,6],[59,5,59,6],[59,3,59,4],[55,3,55,4],[63,3,63,4],[62,3,62,10],[61,7,61,8],[56,7,56,8],[66,0,66,2],[57,3,57,4],[70,3,70,4],[73,7,73,8],[67,7,67,8],[72,5,72,6],[69,7,69,8],[31,3,31,4],[33,3,33,4],[38,3,38,4],[36,3,36,4],[34,5,34,6],[49,3,49,4],[53,3,53,4],[49,5,49,6],[54,5,54,6],[53,5,53,6],[50,5,50,6],[51,3,51,4],[48,3,48,4],[54,3,54,4],[32,3,32,4],[34,3,34,4],[32,5,32,6],[42,5,42,6],[31,5,31,6],[48,5,48,6],[35,0,35,2],[47,7,47,8],[51,7,51,8],[50,3,50,4],[36,5,36,6],[36,7,36,8],[37,0,37,2],[39,0,39,2],[41,3,41,4],[43,5,43,6],[44,5,44,6],[47,5,47,6],[46,5,46,6],[46,3,46,4],[41,7,41,8],[40,7,40,8],[45,7,45,8],[48,7,48,8],[46,7,46,8],[42,3,42,4],[43,3,43,4],[40,3,40,4],[45,3,45,4],[47,3,47,4],[148,11,148,13],[148,5,148,6],[148,7,148,8],[148,9,148,10],[147,5,147,6],[147,7,147,8],[147,9,147,10],[146,9,146,10],[135,7,135,8],[135,9,135,10],[135,5,135,6],[143,5,143,6],[143,9,143,10],[136,5,136,6],[136,7,136,8],[142,11,142,13],[140,11,140,13],[137,11,137,13],[98,5,98,6],[96,5,96,6],[98,7,98,8],[95,5,95,6],[133,5,133,6],[137,0,137,2],[140,0,140,2],[142,0,142,2],[124,9,124,10],[120,9,120,10],[119,9,119,10],[134,3,134,4],[126,3,126,4],[124,3,124,4],[131,3,131,4],[136,3,136,4],[130,5,130,6],[133,3,133,4],[121,9,121,10],[132,9,132,10],[123,9,123,10],[107,0,107,2],[124,5,124,6],[131,5,131,6],[103,3,103,4],[95,3,95,4],[100,3,100,4],[99,5,99,6],[133,7,133,8],[114,7,114,8],[112,7,112,8],[131,7,131,8],[128,7,128,8],[126,7,126,8],[109,5,109,6],[118,3,118,4],[103,7,103,8],[124,7,124,8],[120,7,120,8],[110,7,110,8],[121,7,121,8],[118,7,118,8],[109,7,109,8],[95,7,95,8],[99,3,99,4],[96,3,96,4],[96,7,96,8],[98,3,98,4],[86,3,86,4],[88,3,88,4],[69,5,69,6],[63,5,63,6],[88,5,88,6],[89,5,89,6],[86,9,86,10],[86,5,86,6],[67,3,67,4],[76,5,76,6],[84,5,84,6],[78,5,78,6],[72,7,72,8],[70,7,70,8],[79,9,79,10],[80,3,80,4],[75,7,75,8],[64,5,64,6],[88,7,88,8],[84,7,84,8],[84,3,84,4],[72,3,72,4],[82,3,82,4],[82,7,82,8],[55,5,55,6],[65,7,65,8],[64,7,64,8],[78,7,78,8],[76,7,76,8],[56,3,56,4],[61,5,61,6],[78,3,78,4],[75,3,75,4],[65,5,65,6],[75,5,75,6],[59,7,59,8],[58,3,58,4],[61,3,61,4],[55,7,55,8],[58,7,58,8],[57,7,57,8],[73,5,73,6],[76,3,76,4],[153,7,153,8],[153,9,153,10],[150,0,150,2],[153,3,153,4],[153,5,153,6],[74,0,74,2],[81,0,81,2],[144,0,144,2],[141,3,141,4],[151,7,151,8],[128,3,128,4],[138,3,138,4],[140,7,140,8],[138,5,138,6],[139,3,139,4],[128,5,128,6],[135,3,135,4],[147,3,147,4],[149,3,149,4],[141,7,141,8],[143,7,143,8],[89,7,89,8],[104,3,104,4],[103,5,103,6],[152,0,152,2],[152,11,152,13],[151,3,151,4],[151,5,151,6],[151,9,151,10],[146,0,146,2],[139,5,139,6],[148,0,148,2],[149,5,149,6],[143,3,143,4],[145,3,145,4],[145,7,145,8],[145,9,145,10],[144,11,144,13],[145,5,145,6],[150,5,150,6],[150,7,150,8],[150,9,150,10],[150,11,150,13],[149,9,149,10],[149,7,149,8],[146,11,146,13],[146,5,146,6],[146,7,146,8],[9,0,9,2],[9,9,9,10],[136,9,136,10],[126,5,126,6],[141,9,141,10],[139,9,139,10],[138,9,138,10],[141,5,141,6],[139,7,139,8],[140,9,140,10],[138,7,138,8],[132,5,132,6],[130,7,130,8],[108,9,108,10],[127,9,127,10],[133,9,133,10],[131,9,131,10],[130,9,130,10],[137,9,137,10],[122,9,122,10],[102,0,102,2],[116,7,116,8],[116,5,116,6],[100,7,100,8],[125,11,125,13],[123,11,123,13],[84,11,96,11],[132,7,132,8],[127,11,127,13],[93,7,93,8],[84,9,84,10],[128,9,128,10],[119,11,119,13],[117,11,117,13],[102,11,102,13],[90,7,90,8],[91,7,91,8],[129,11,129,13],[105,7,105,8],[106,7,106,8],[104,7,104,8],[105,11,105,13],[113,9,113,10]]}
["COTAÇÕES DE INSUMOS"]
[]
["*Na célula comentário com o nome do fornecedor, e-mail e data da cotação.",{"$nulls":9},"Data Cotações:",null,null,"Junho / 2021"]
[]
[]
["Código","Insumo","un","Fornecedor 1","Fone","Fornecedor 2","Fone","Fornecedor 3","Fone","Reserva",null,"Observações","Média","Mediana"]
[null,null,null,"Mondai Madeiras","3587-1643","Cunha Madeiras","3364-2778","Madereira Guarujá","3246-5955"]
[27,"Sarrafo cedrinho 2,5 x 2,5 cm","m",4,null,4.9000000000000004,null,4.5999999999999996,{"$nulls":4},{"$f":"TRUNC((AVERAGE(D8,F8,H8)),2)","v":4.5},{"$f":"TRUNC((MEDIAN(D8:I8)),2)","v":4.5999999999999996}]
[{"$f":"+A8+1","v":28},"Sarrafo cedrinho 2,5 x 5,0 cm","m",7.5,null,8.1,null,6.2,{"$nulls":4},{"$f":"TRUNC((AVERAGE(D9,F9,H9)),2)","v":7.26},{"$f":"TRUNC((MEDIAN(D9:I9)),2)","v":7.5}]
[null,null,null,"Mondai Madeiras","3587-1643","Cunha Madeiras","3364-2778","Schreiner Madeiras","41-3543-1316"]
[{"$f":"+A9+1","v":29},"CAIBRO CEDRINHO 5 x 7 cm","m",20,null,24.4,null,41.25,{"$nulls":4},{"$f":"TRUNC((AVERAGE(D11,F11)),2)","v":22.2},{"$f":"TRUNC((MEDIAN(D11:I11)),2)","v":24.4}]
[20,"Guia cedrinho 2,5 x 10 cm","m",12.5,null,16.3,null,14.37,{"$nulls":4},{"$f":"TRUNC((AVERAGE(D12,F12,H12)),2)","v":14.39},{"$f":"TRUNC((MEDIAN(D12:I12)),2)","v":14.37}]
[22,"Guia cedrinho 2,5 x 20 cm","m",25,null,32.5,null,28.75,{"$nulls":4},{"$f":"TRUNC((AVERAGE(D13,F13,H13)),2)","v":28.75},{"$f":"TRUNC((MEDIAN(D13:I13)),2)","v":28.75}]
[null,null,null,"Mad. Guarujá","(51) 3246-5944","Cunha Madeiras","3364-2778","Schreiner Madeiras","(47) 991164445"]
[25,"Tábua itaúba lixada e aplainada 2,5x20x5,50","pç",245,null,343.8,null,246.4,null,null,null,"Bitolas das tábuas brutas:",{"$f":"TRUNC((AVERAGE(D15,F15,H15)),2)","v":278.39999999999998},{"$f":"TRUNC((MEDIAN(D15:I15)),2)","v":246.4}]
[26,"Tábua itaúba lixada e aplainada 3x22x3,00","pç",267,null,375,null,264,null,null,null,"Esp.: 2,5 , 4 , 5 , 8 , 10 , 15 cm",{"$f":"TRUNC((AVERAGE(D16,F16,H16)),2)","v":302},{"$f":"TRUNC((MEDIAN(D16:I16)),2)","v":267}]
[{"$f":"+A16+1","v":27},"Tábua itaúba lixada e aplainada 3x22x4,00","pç",356,null,500,null,352,null,null,null,"Larg.: 5, 7, 10, 15, 20, 25, 30 cm",{"$f":"TRUNC((AVERAGE(D17,F17,H17)),2)","v":402.66},{"$f":"TRUNC((MEDIAN(D17:I17)),2)","v":356}]
[28,"Tábua itaúba lixada e aplainada 3x22x4,50","pç",401,null,562.5,null,396,null,null,null,"Comp.: 1, 1,5 , 2, 2,5 , 3, 3,5 , 4, 4,5 , 5, 5,5 m",453.16,401]
[29,"Tábua itaúba lixada e aplainada 3x30x3,00","pç",321,null,450,null,325.60000000000002,{"$nulls":4},365.53,{"$f":"TRUNC((MEDIAN(D19:I19)),2)","v":325.60000000000002}]
[30,"Tábua itaúba lixada e aplainada 3,5x15x5,50","pç",295,null,412.5,null,290.39999999999998,{"$nulls":4},332.63,295]
[31,"Tábua itaúba lixada e aplainada 3,5x25x2,00","pç",223,null,250,null,176,null,null,null," ",216.33,223]
[32,"Tábua itaúba lixada e aplainada 4x10x4,00","pç",142.55000000000001,null,200,null,140.80000000000001,{"$nulls":4},161.11000000000001,142.55000000000001]
[33,"Tábua itaúba lixada e aplainada 4x10x5,50","pç",196,null,275,null,193.6,{"$nulls":4},221.53,196]
[34,"Tábua itaúba lixada e aplainada 4x30x3,00","pç",321,null,450,null,325.60000000000002,{"$nulls":4},365.53,325.60000000000002]
[35,"Tábua itaúba lixada e aplainada 4x30x4,00","pç",430,null,600,null,431.2,{"$nulls":4},487.06,431.2]
[36,"Tábua itaúba lixada e aplainada 4x30x4,50","pç",485,null,675,null,484,{"$nulls":4},548,485]
[{"$f":"+A26+1","v":37},"Sarrafo itaúba 2,5x5","m",13.3,null,15,null,11,{"$nulls":4},13.1,13.3]
[38,"Caibro itaúba 5x5","m",26.7,null,24,null,26.4,{"$nulls":4},25.7,26.4]
[39,"Caibro itaúba 5x7","m",33.5,null,36,null,35.200000000000003,{"$nulls":4},34.9,35.200000000000003]
[40,"Caibro itaúba 5x10","m",45,null,48,null,44,{"$nulls":4},45.66,45]
[41,"Tábua itaúba 4x15","m",55,null,72,null,52.8,{"$nulls":4},59.93,55]
[42,"Tábua itaúba 4x25","m",112,null,120,null,88,{"$nulls":4},106.66,112]
[43,"Tábua itaúba 4x30","m",107,null,144,null,105.6,{"$nulls":4},118.86,107]
[44,"Tábua itaúba lixada e aplainada 3,5x19x1,80","pç",130.5,null,200,null,140.80000000000001,{"$nulls":4},157.1,140.80000000000001]
[45,"Tábua itaúba lixada e aplainada 3,5x19x2,00","pç",145,null,200,null,140.80000000000001,{"$nulls":4},161.93,145]
[null,null,null,"Delei Madeiras","3395-1868","Madelei","3373-8888","Cofel","3222-2255"]
[{"$f":"+A35+1","v":46},"Laminado melamínico texturizado chapa 1,25 x 3,08 m esp=0,8 mm","m²",25.71,null,32.25,null,40.26,null,null,null,"Dividir o valor pela área da chapa (3,85 m²)",{"$f":"TRUNC((AVERAGE(D37,F37,H37)),2)","v":32.74},{"$f":"TRUNC((MEDIAN(D37:K37)),2)","v":32.25}]
[null,null,null,"Mariani","3403-2222","Flosul","51 3681-0100","MSA","3556-3711"]
[{"$f":"+A37+1","v":47},"Tora eucalipto tratada d=20 cm","m",57,null,28.41,null,30.1,null,null,null,"Total=frete/m+tora  (frete/ 99 m (cancha de bocha))",{"$f":"TRUNC((AVERAGE(F39,H39)),2)","v":29.25},{"$f":"TRUNC((MEDIAN(D39:K39)),2)","v":30.1}]
[null,null,null,"SL Parafusos Ltda","3411-9800","Guido A. Jacobus","3024-1200","Central de Parafusos","3341-9353","Brasil dos Parafusos","3326-1946"]
[{"$f":"+A39+1","v":48},"Parafuso aço inox 1/4\" x 3\" c/porca","un",{"$f":"1.71","v":1.71},null,3.18,null,0.85,null,2.4,null,"Acrescentar o valor da porca quando vier separado (R$ ___)",{"$f":"TRUNC((AVERAGE(D41,F41,H41,J41)),2)","v":2.0299999999999998},{"$f":"TRUNC((MEDIAN(D41:K41)),2)","v":2.0499999999999998}]
[49,"Parafuso francês zincado 5/16\" x 2\" c/porca","un",1.2,null,0.38,null,1,null,1.0900000000000001,null,null,{"$f":"TRUNC((AVERAGE(D42,F42,H42,J42)),2)","v":0.91},{"$f":"TRUNC((MEDIAN(D42:K42)),2)","v":1.04}]
[50,"Parafuso francês zincado 5/16\" x 2 1/2\" c/ porca","un",1.39,null,0.44,null,1.17,null,1.24,null,null,{"$f":"TRUNC((AVERAGE(D43,F43,H43,J43)),2)","v":1.06},{"$f":"TRUNC((MEDIAN(D43:K43)),4)","v":1.2050000000000001}]
[51,"Parafuso francês zincado 5/16\" x 4\" c/ porca","un",1.91,null,0.61,null,1.65,null,1.72,null,null,1.47,1.68]
[52,"Parafuso francês zincado 5/16\" x 5\" c/porca","un",2.25,null,0.71,null,2,null,2.0099999999999998,null,null,1.74,2]
[53,"Parafuso inox auto atarraxante 4,8 x 70 cabeça chata","un",0.88,null,0.62,null,1.88,null,1.1399999999999999,null,null,1.1299999999999999,1.01]
[54,"Parafuso inox auto atarraxante 4,8 x 100 cabeça chata","un",2.3199999999999998,null,"-",null,"-",null,2.73,null,null,{"$f":"TRUNC((AVERAGE(D47,F47,H47,J47)),2)","v":2.52},2.52]
[55,"Parafuso sextavado aço zincado 1/2\" x 1 1/2\"","un",{"$f":"1.96","v":1.96},null,0.7,null,2.2000000000000002,null,1.97,null,null,1.7,1.96]
[56,"Parafuso sextavado aço zincado 1/2\" x 3 1/2\"","un",4.4800000000000004,null,1.46,null,4,null,3.6,null,null,3.38,3.8]
[57,"Parafuso sextavado aço zincado 1/2\" x 8\"","un",10.66,null,3.33,null,"-",null,9.8800000000000008,null,null,7.95,9.8800000000000008]
[58,"Parafuso sextavado aço zincado 1/4\" x 2\" c/ porca","un",{"$f":"0.52+32.65/100","v":0.84650000000000003},null,0.24,null,0.6,null,0.68,null,"Acrescentar o valor da porca quando vier separado (R$ ___)",0.59,{"$f":"TRUNC((MEDIAN(D51:K51)),4)","v":0.64}]
[59,"Parafuso sextavado rosca soberba 1/4\" x 30 mm","un",0.42,null,0.13,null,0.4,null,0.38,null,null,0.33,0.39]
[null,null,null,"Gerdau","3373-2500","Arcelor Mittal","2121-7777","Sidersul","3041-6565"]
[{"$f":"+A52+1","v":60},"Barra ferro chato 7/8\" x 1/8\"","kg",4.63,null,4.1399999999999997,null,4.96,{"$nulls":4},{"$f":"TRUNC((AVERAGE(D54,F54,H54)),2)","v":4.57},{"$f":"TRUNC((MEDIAN(D54:I54)),2)","v":4.63}]
[61,"Barra ferro chato 7/8\" x 1/4\"","kg",4.67,null,4.3499999999999996,null,4.96,{"$nulls":4},4.66,4.67]
[62,"Barra ferro chato 1 1/4\" x 1/4\"","kg",4.67,null,4.1399999999999997,null,4.96,{"$nulls":4},4.59,4.67]
[63,"Barra ferro chato 2\" x 1/8\"","kg",5.21,null,4.83,null,4.96,{"$nulls":4},5,4.96]
[64,"Chapa aço 1/2\"","kg",4.1399999999999997,null,5.08,null,4.95,{"$nulls":4},4.72,4.95]
[65,"Chapa aço 1/4\"","kg",4.1399999999999997,null,5.08,null,4.95,{"$nulls":4},4.72,4.95]
[66,"Chapa aço 3/16\"","kg",4.1399999999999997,null,5.08,null,4.95,{"$nulls":4},4.72,4.95]
[null,null,null,"Redinox","3020-0707","Steel Sul","3059-8744","Galeazi","4042-8322"]
[{"$f":"+A60+1","v":67},"Chapa aço inox e=1,00 mm (AISI 304)","m²",156,null,164.5,null,199.62,{"$nulls":4},{"$f":"TRUNC((AVERAGE(D62,F62,H62)),2)","v":173.37},{"$f":"TRUNC((MEDIAN(D62:K62)),2)","v":164.5}]
[null,null,null,"Chapas aço + galvanização"]
[{"$f":"+A62+1","v":68},"Chapa galvanizada 1/2\"","kg",{"$nulls":8},"Insumo 71 + galvanização/kg (R$ 2,30)",{"$f":"TRUNC(IF(Cotações!M58<Cotações!N58,Cotações!M58,Cotações!N58)+((IF(Cotações!$M$68<Cotações!$N$68,Cotações!$M$68,Cotações!$N$68))),2)","v":7.12}]
[{"$f":"+A64+1","v":69},"Chapa galvanizada 1/4\"","kg",{"$nulls":8},"Insumo 72 + galvanização/kg (R$ 2,30)",{"$f":"TRUNC(IF(Cotações!M59<Cotações!N59,Cotações!M59,Cotações!N59)+((IF(Cotações!$M$68<Cotações!$N$68,Cotações!$M$68,Cotações!$N$68))),2)","v":7.12}]
[{"$f":"+A65+1","v":70},"Chapa galvanizada 3/16\"","kg",{"$nulls":8},"Insumo 73 + galvanização/kg (R$ 2,30)",{"$f":"TRUNC(IF(Cotações!M60<Cotações!N60,Cotações!M60,Cotações!N60)+((IF(Cotações!$M$68<Cotações!$N$68,Cotações!$M$68,Cotações!$N$68))),2)","v":7.12}]
[null,null,null,"Beretta","3479-2222","ATN","3470-0000","Bento Sul","54 3453-5053"]
[{"$f":"+A66+1","v":71},"Processo de Galvanização","kg",2.5,null,2.5,null,2.2000000000000002,null,null,null,"preço por kg de chapa + 10% relativo ao peso total após galvanização",{"$f":"TRUNC((AVERAGE(D68,F68,H68)),2)","v":2.4},{"$f":"TRUNC((MEDIAN(D68:K68)),2)","v":2.5}]
[null,null,null,"Sulfer","3470-4004","Scharlau","3091-1525","Global Aço","3470-3522","Imp. Americana","3337-4611"]
[{"$f":"+A68+1","v":72},"Cumeeira galvalume ondulada 0,50 mm","un",28.6,null,29.34,null,30,null,23.6,null,"Cumeeira com 1 m de comprimento",{"$f":"TRUNC((AVERAGE(D70,F70,H70,J70)),2)","v":27.88},{"$f":"TRUNC((MEDIAN(D70:K70)),2)","v":28.97}]
[73,"Telha galvalume ondulada 0,50 mm x 1,03 m x 1 m","m",34.9,null,26.3,null,30,null,23.6,null,null,{"$f":"TRUNC((AVERAGE(D71,F71,H71,J71)),2)","v":28.7},{"$f":"TRUNC((MEDIAN(D71:K71)),2)","v":28.15}]
[null,null,null,"Sulfer","3470-4004","Aço Tubo","2126-9400","Açoduto","3058-5353","Ipiranga","3303-2100"]
[{"$f":"+A71+1","v":74},"Tubo aço carbono 6\" e=6,35 mm (NBR 6591)","m","-",null,206.34,null,182.35,null,150.15,null,"tubo condutor",{"$f":"TRUNC((AVERAGE(F73,H73,J73)),2)","v":179.61},{"$f":"TRUNC((MEDIAN(D73:K73)),2)","v":182.35}]
[75,"Tubo ferro preto quadrado 7x7 cm esp=3,00 mm","m",73.709999999999994,null,"-",null,56,null,40.6,null,"tubo / 6,00 m",{"$f":"TRUNC((AVERAGE(D74,H74,J74)),2)","v":56.77},{"$f":"TRUNC((MEDIAN(D74:K74)),2)","v":56}]
[null,null,null,"FG","3358-1213",null,null,"CPM Representações",null,"RAV Correntes","54-3019-1436"]
[{"$f":"+A74+1","v":76},"Corrente aço galvanizado d=5 mm elo longo 22x45 mm","kg",23.6,null,null,null,22.23,null,23.43,null,"Na próxima atualização utilizar elo curto e=6 mm 22x40 mm",{"$f":"TRUNC((AVERAGE(D76,H76,J76)),2)","v":23.08},{"$f":"TRUNC((MEDIAN(D76:K76)),2)","v":23.43}]
[77,"Disco de Corte MR832 - 7\" - Norton uso geral","un",22.9,null,26.34,null,16.5,{"$nulls":4},{"$f":"TRUNC((AVERAGE(D77,F77)),2)","v":24.62},{"$f":"TRUNC((MEDIAN(D77:K77)),2)","v":22.9}]
[null,null,null,"Telas Caxias","3364-1688","Rio Branco","3466-8095","Renovar","3342-7711","Sul Tela","3372-1475"]
[{"$f":"+A77+1","v":78},"Esticador de arame","un",5,null,"-",null,5,null,7,null,null,{"$f":"TRUNC((AVERAGE(D79,F79,H79,J79)),2)","v":5.66},{"$f":"TRUNC((MEDIAN(D79:K79)),2)","v":5}]
[{"$f":"+A79+1","v":79},"Tela arame galvanizado 5x5 cm fio 12 BWG","m²",22,null,21,null,26.5,null,28.6,null,null,{"$f":"TRUNC((AVERAGE(D80,F80,H80,J80)),2)","v":24.52},{"$f":"TRUNC((MEDIAN(D80:K80)),2)","v":24.25}]
[{"$f":"+A80+1","v":80},"Tela arame galvanizado 4x4 cm fio 10 BWG","m²",33,null,49,null,63,null,"-",null,null,{"$f":"TRUNC((AVERAGE(D81,F81,H81)),2)","v":48.33},{"$f":"TRUNC((MEDIAN(D81:K81)),2)","v":49}]
[null,null,null,"Fundição Silva Três Rios","(24) 2255-3130","Fundição Zenah","(54) 3228-5669"]
[{"$f":"+A81+1","v":81},"Fradinho em ferro fundido","un",314,null,600,{"$nulls":6},{"$f":"TRUNC((AVERAGE(D83)),2)","v":314},{"$f":"TRUNC((MEDIAN(D83:K83)),2)","v":457}]
[null,null,null,"Ziober","44 3029-4410","Milla Equip. Met.","19 3363-1051","Flex","17 3223-2766"]
[{"$f":"+A83+1","v":82},"Abdominal Simples","un",5610,null,4510,null,4690,null,null,null,"Galvanizados",{"$f":"TRUNC((AVERAGE(D85,F85:I85)),2)","v":4936.66},{"$f":"TRUNC((MEDIAN(D85:I85)),2)","v":4690}]
[{"$f":"+A85+1","v":83},"Adução e abdução de pernas duplo","un",11490,null,9150,null,6940,{"$nulls":4},{"$f":"TRUNC((AVERAGE(D86,F86:I86)),2)","v":9193.33},{"$f":"TRUNC((MEDIAN(D86:I86)),2)","v":9150}]
[84,"Esqui triplo conjugado","un",18000,null,21430,null,8990,{"$nulls":4},16140,18000]
[85,"Jogo de barras","un",9600,null,11778,null,6700,{"$nulls":4},9359.33,9600]
[86,"Multiexercitador conjugado 6 funções","un",22200,null,17184,null,9190,{"$nulls":4},16191.33,17184]
[87,"Peitoral duplo","un",14220,null,9790,null,7700,{"$nulls":4},10570,9790]
[88,"Placa orientativa (ATI)","un",8130,null,9966,null,4990,{"$nulls":4},7695.33,8130]
[89,"Pressão de pernas triplo conjugado","un",10860,null,10706,null,6850,{"$nulls":4},9472,10706]
[90,"Puxador duplo","un",14220,null,10428,null,7690,{"$nulls":4},10779.33,10428]
[91,"Remada (APC)","un",8340,null,5940,null,3890,{"$nulls":4},6056.66,5940]
[92,"Simulador de caminhada triplo conjugado","un",16740,null,15134,null,7800,{"$nulls":4},13224.66,15134]
[93,"Simulador de remo","un",6660,null,5240,null,5640,{"$nulls":4},5846.66,5640]
[{"$f":"+A96+1","v":94},"Voador peitoral e voador dorsal (APC)","un",13170,null,6200,null,3890,{"$nulls":4},7753.33,6200]
[null,null,null,"Shopping de Pedras","3249-1111","Eládio","3328-5858","São Cristóvão","54 3477-1305","Coloretti","54 3477-1369"]
[{"$f":"+A97+1","v":95},"Basalto Irregular","m²",60,null,50,null,97,null,60,null,null,{"$f":"TRUNC((AVERAGE(D99,F99,H99,J99)),2)","v":66.75},{"$f":"TRUNC((MEDIAN(D99:K99)),2)","v":60}]
[{"$f":"+A99+1","v":96},"Basalto Irregular meio retalhão","m²",110,null,150,null,107,null,120,null,null,{"$f":"TRUNC((AVERAGE(D100,F100,H100,J100)),2)","v":121.75},{"$f":"TRUNC((MEDIAN(D100:K100)),2)","v":115}]
[{"$f":"+A100+1","v":97},"Basalto Regular talhado",{"$f":"C100","v":"m²"},95,null,110,null,77,null,80,null,null,90.5,87.5]
[{"$f":"+A101+1","v":98},"Basalto Regular serrado ","m²",110,null,120,null,163,null,98,null,null,122.75,115]
[null,null,null,"DPS","3499-1536","Incorevest","3062-5119",null,null,"RF Rede Pallet","3059-7270"]
[{"$f":"+A102+1","v":99},"Lajota de concreto 45x45cm esp.=2,5cm","m²",32.9,null,52,null,null,null,25.9,null,null,{"$f":"TRUNC((AVERAGE(D104,F104,J104)),2)","v":36.93},{"$f":"TRUNC((MEDIAN(D104:K104)),2)","v":32.9}]
[{"$f":"+A104+1","v":100},"Piso Podotátil 25 x 25 cm","un",3.5,null,3.5,null,null,null,4.2,null,null,{"$f":"TRUNC((AVERAGE(D105,F105,J105)),2)","v":3.73},{"$f":"TRUNC((MEDIAN(D105:K105)),2)","v":3.5}]
[null,null,null,"Simil - Maquitel","3403-3232"]
[{"$f":"+A105+1","v":101},"Saibro rosa - posto obra","m³",59,{"$nulls":7},"Fazer média dos fretes (Centro, Ipanema, Sarandi)",{"$f":"TRUNC((AVERAGE(D107)),2)","v":59},59]
[null,null,null,"Rossatto","3250-5076","Jardins da Aldeia","3488-6251","Gramados Vargas","3367-2625","Canoas Garden","3472-4931"]
[{"$f":"+A107+1","v":102},"Composto Orgânico","m³",180,null,130,null,120,null,160,null,null,{"$f":"TRUNC((AVERAGE(D109,F109,H109,J109)),2)","v":147.5},145]
[{"$f":"+A109+1","v":103},"Grama catarina (Axonopus compressus)","m²",9.5,null,12,null,8,null,12,null,null,{"$f":"TRUNC((AVERAGE(D110,F110,H110,J110)),2)","v":10.37},10.75]
[{"$f":"+A110+1","v":104},"Grama de campo ( 1ª qualidade)",{"$f":"C110","v":"m²"},"-",null,6,null,6,null,6.5,null,null,{"$f":"TRUNC((AVERAGE(F111,H111,J111)),2)","v":6.16},6]
[null,null,null,"Sulcopy","2103-4660","Impacto","3334-9900","Sul10","4061-1001","Pino","3012-9090"]
[{"$f":"+A111+1","v":105},"Placa em lona impressa c/ 6 m²","m²",80,null,50,null,70,null,51.75,null,"Solicitar valor de placa com 6,00 m/2 (Dividir valor por 6)",{"$f":"TRUNC((AVERAGE(D113,F113,H113,J113)),2)","v":62.93},60.87]
[null,null,null,"Construtec","3012-2333","Reis e Reis","12 3966-9977","TecMachine","11 4643-4846"]
[{"$f":"+A113+1","v":106},"Microfibra de polipropileno (sc 600 g)","sc",33,null,21.65,null,23.2,null,null,null,"Saco de 600 g (600 g/m³ de concreto)",{"$f":"TRUNC((AVERAGE(D115,F115,H115)),2)","v":25.95},23.2]
[null,null,null,"Mineração Peixoto","51 3678-1020","Grani Torre","11 2246-1250","Polipiso","99116-4697"]
[{"$f":"+A115+1","v":107},"Argamassa de alta resistência (Piso duro)","kg",0.74,null,0.65,null,0.77,null,null,null,"Frete para 1800,00 kg",{"$f":"TRUNC((AVERAGE(D117,F117,H117)),2)","v":0.72},0.74]
[null,null,null,"Constinta","3341-6344",null,null,"Porto Cores","3346-3339","Aquarela Tintas","3223-0133"]
[{"$f":"+A117+1","v":108},"Fundo p/ galvanizado","l",35.270000000000003,null,null,null,37.22,null,31.94,null,null,{"$f":"TRUNC((AVERAGE(D119,H119,J119)),2)","v":34.81},{"$f":"TRUNC((MEDIAN(D119,H119,J119)),2)","v":35.270000000000003}]
[null,null,null,"Drenamac","3029-7593","Drenotec","3119-1244","Geofoco","0800-378-8500"]
[{"$f":"+A119+1","v":109},"Manta Geotêxtil para cura do concreto","m²",2.2000000000000002,null,2.5,null,2.1,null,null,null,"Bidim CC-10",{"$f":"TRUNC((AVERAGE(D121,F121,H121)),2)","v":2.2599999999999998},{"$f":"TRUNC((MEDIAN(D121:K121)),2)","v":2.2000000000000002}]
[null,null,null,"Prod Equipam. MB","3377-2035"]
[{"$f":"+A121+1","v":110},"Papeleira metálica basculante H-30","un",900,{"$nulls":8},{"$f":"TRUNC((AVERAGE(D123)),2)","v":900},900]
[null,null,null,"Elevato","3349-0200","SIA","3375-3800","Mil Torneiras","3371-3200"]
[{"$f":"+A123+1","v":111},"Válvula de mictório anti-vandalismo alta pressão Docol","un",557.80999999999995,null,362.1,null,413.9,{"$nulls":4},{"$f":"TRUNC((AVERAGE(D125,F125,H125)),2)","v":444.6},413.9]
[null,null,null,"Lourenço Mármores","3217-1323","De Grandi","3307-7724","Bello","3217-5900","Belotto","3541-5521"]
[{"$f":"+A125+1","v":112},"Placa de granito","un",550,null,650,null,840,null,750,null,null,{"$f":"TRUNC((AVERAGE(D127,F127,H127,J127)),2)","v":697.5},700]
[null,null,null,"Gaúcha","3245-3500","Pouco Entulho","51 99859-2250","Tirentulho","3475-2222"]
[{"$f":"+A127+1","v":113},"Caçamba 4,00 m3","un",480,null,400,null,450,null,null,null,"Média Centro com Zona Sul               caliça e terra",{"$f":"TRUNC((AVERAGE(D129,F129,H129)),2)","v":443.33},450]
[null,null,null,"Transguga","3337-6060","Britas do Sul","3245-2093","Areia Norte","3340-9032","Balinha","3434-0059"]
[{"$f":"+A129+1","v":114},"Areia Peneirada - posto obra","m³",65,null,90,null,65,null,70,null,null,{"$f":"TRUNC((AVERAGE(D131,F131,H131,J131)),2)","v":72.5},{"$f":"TRUNC((MEDIAN(D131:K131)),2)","v":67.5}]
[{"$f":"+A131+1","v":115},"Brita 1 ou 2 - posto obra","m³",65,null,75,null,65,null,65,null,null,{"$f":"TRUNC((AVERAGE(D132,F132,H132,J132)),2)","v":67.5},65]
[null,null,null,"DMAE","3289-9537"]
[{"$f":"+A132+1","v":116},"Taxa instalação água DMAE","cj",465.36,{"$nulls":7},"Engª Ana",{"$f":"TRUNC((AVERAGE(D134)),2)","v":465.36},465.36]
[{"$f":"+A134+1","v":117},"Taxa instalação esgoto DMAE","cj",300.94,{"$nulls":8},{"$f":"TRUNC((AVERAGE(D135)),2)","v":300.94},300.94]
[{"$f":"+A135+1","v":118},"Água tratada","m³",4.0199999999999996,{"$nulls":8},{"$f":"TRUNC((AVERAGE(D136)),2)","v":4.0199999999999996},4.0199999999999996]
[{"$f":"+A136+1","v":119},"Esgoto cloacal","m³",{"$f":"0.8*D136","v":3.2159999999999997},{"$nulls":8},{"$f":"TRUNC((AVERAGE(D137)),2)","v":3.21},3.21]
[null,null,null,"Rodrigo Paz","3318-1010","Alicerce da Const","3318-1010","Maico Pedras","99817-3559"]
[122,"Laje de Grês 90x45","un",8,null,14.9,null,6,{"$nulls":4},{"$f":"TRUNC((AVERAGE(D139,F139,H139)),2)","v":9.6300000000000008},{"$f":"TRUNC((MEDIAN(D139:I139)),2)","v":8}]
[{"$f":"+A139+1","v":123},"Pedra de Grês 43x21x12","un",1.9,null,2.2000000000000002,null,2.2799999999999998,null,2,null,null,{"$f":"TRUNC((AVERAGE(D140,F140,H140,J140)),2)","v":2.09},{"$f":"TRUNC((MEDIAN(D140:K140)),2)","v":2.1}]
[null,null,null,"Ponte Pedras","11 4485-3034","Balinha","3434-0059"]
[{"$f":"+A140+1","v":124},"Pedra de Alicerce","un",6,null,4.5,{"$nulls":6},{"$f":"TRUNC((AVERAGE(D142,F142)),2)","v":5.25},{"$f":"TRUNC((MEDIAN(D142:G142)),2)","v":5.25}]
[null,null,null,"Supreme","3012-9962","Via Inox","3275-1111","Magazine do Inox","3060-2074","Stilo Elevato","3333-8200"]
[{"$f":"+A142+1","v":125},"Cuba Inox polida d=38 cm c/válvula 3 1/2\"","un",249,null,169.9,null,150.19999999999999,null,301.02999999999997,null,null,{"$f":"TRUNC((AVERAGE(D144,F144,H144)),2)","v":189.7},{"$f":"TRUNC((MEDIAN(D144:K144)),2)","v":209.45}]
[null,null,null,"RZ","3212-7911","Copyserv","3212-1612","DWG","3022-7978","MI Digital","3574-8012"]
[{"$f":"+A144+1","v":126},"Plotagem","m²",11.89,null,12,null,10.7,null,10.58,null,"PB, Papel sulfite, gramatura",{"$f":"TRUNC((AVERAGE(D146,F146,H146,J146)),2)","v":11.29},{"$f":"TRUNC((MEDIAN(D146:K146)),2)","v":11.29}]
[null,null,null,"Sinduscon","Site"]
[{"$f":"+A146+1","v":127},"CUB-RS R 16-N","un",1477.13,{"$nulls":8},{"$f":"TRUNC((AVERAGE(D148)),2)","v":1477.13},{"$f":"TRUNC((MEDIAN(D148:K148)),2)","v":1477.13}]
[null,null,null,"CREA-RS","Site"]
[{"$f":"+A148+1","v":128},"ART","un",226.5,{"$nulls":8},{"$f":"TRUNC((AVERAGE(D150)),2)","v":226.5},{"$f":"TRUNC((MEDIAN(D150:K150)),2)","v":226.5}]
[null,null,null,"PMPA","Site"]
[{"$f":"+A150+1","v":129},"UFM","un",4.1771000000000003,{"$nulls":8},{"$f":"TRUNC((AVERAGE(D152)),2)","v":4.17},{"$f":"TRUNC((MEDIAN(D152:K152)),2)","v":4.17}]
[null,null,null,"Casa do Granito","3233-0052","La Pietra","3334-6544","Bonapedras","3012-4393","AGPetrea","3126-3792"]
[{"$f":"+A152+1","v":130},"Tabuleiro damas","un",1500,null,320,null,1601.8,null,400,null,null,{"$f":"TRUNC((AVERAGE(D154,F154,H154,J154)),2)","v":955.45},{"$f":"TRUNC((MEDIAN(D154:K154)),2)","v":950}]

{"sheet":"BDI","index":9,"n_rows":41,"n_cols":6,"rows_kept":41,"cut":false,"hidden":false,"merged":[[43,0,43,3],[41,0,41,3],[40,0,40,5],[32,0,36,5],[37,0,37,3],[31,0,31,3],[30,0,30,3],[29,0,29,3],[28,0,28,3],[42,0,42,3],[5,1,5,5],[11,0,11,2],[12,0,12,2],[10,0,10,3],[16,0,16,2],[9,0,9,2],[13,0,13,2],[14,0,14,2],[15,0,15,2],[12,3,12,5],[16,3,16,5],[15,3,15,5],[14,3,14,5],[13,3,13,5],[27,0,27,3],[23,3,23,5],[22,3,22,5],[25,0,25,5],[17,0,17,2],[24,0,24,3],[23,0,23,2],[18,0,18,2],[19,0,19,2],[20,0,20,2],[22,0,22,2],[26,0,26,3],[21,0,21,2],[17,3,17,5],[47,0,47,3],[38,0,38,5],[0,0,0,5],[2,0,2,5],[9,3,9,5],[8,1,8,5],[7,1,7,5],[6,1,6,5],[4,1,4,5],[1,0,1,3],[3,0,3,3],[11,3,11,5],[21,3,21,5],[20,3,20,5],[19,3,19,5],[18,3,18,5]]}
["Composição do BDI"]
[]
["*Conforme Decreto nº 19.224, de 25 de novembro de 2015 (PMPA)"]
[]
["TOMADOR:","PREFEITURA MUNICIPAL DE PORTO ALEGRE"]
["Nº CONTRATO:"]
["OBJETO:",{"$f":"+PO!B9","v":"Obras de Aquisição e Instalação de Academias de Ginástica ao ar livre na Praça Professor Emílio Mabilde Rípole (155/02), Praça Irene Elisalde Stricher (145/10) e Praça José Mariano de Freitas Beck (164/09)."}]
["DATA:",{"$f":"IF(PO!$B$10=\"\",\"\",PO!$B$10)","v":"2021-08-10"},{"$f":"IF(PO!$C$10=\"\",\"\",PO!$C$10)","v":""},{"$f":"IF(PO!$C$10=\"\",\"\",PO!$C$10)","v":""},{"$f":"IF(PO!$C$10=\"\",\"\",PO!$C$10)","v":""},{"$f":"IF(PO!$C$10=\"\",\"\",PO!$C$10)","v":""}]
["ART:",{"$f":"IF(PO!$B$11=\"\",\"\",PO!$B$11)","v":""}]
["CONTRIBUIÇÃO PREVIDENCIÁRIA:",null,null,{"$f":"IF('Planilha_M.O.'!$D$5=\"c/desoneração\",\"Orçamento COM DESONERAÇÃO (Lei 13.161/2015)\",\"Orçamento SEM DESONERAÇÃO (Lei 13.161/2015)\")","v":"Orçamento SEM DESONERAÇÃO (Lei 13.161/2015)"}]
[]
["TIPO DE OBRA",null,null,"Contratação de obras e serviços de INFRAESTRUTURA, incluindo pavimentação, iluminação pública, praças, saneamento, sistemas de água, esgoto cloacal e pluvial e seus respectivos serviços de conservação e manutenção"]
["Parcelas"]
["(AC) - Administração Central",null,null,4.03]
["(S) + (G) - Seguro e Garantia",null,null,0.65]
["(R) - Risco",null,null,1.33]
["(DF) - Despesas Financeiras",null,null,1.52]
["(L) - Lucro",null,null,8]
["(I1) - PIS",null,null,0.65]
["(I2) - COFINS",null,null,3]
["(I3) - ISSQN",null,null,1.2]
["(I4) - Contrib. Previdenciária",null,null,4.5]
["BDI Calculado, incluindo I4 - com desoneração",null,null,0.28210000000000002]
["BDI Calculado, desconsiderando I4 - sem desoneração",null,null,0.2215]
[]
["Os valores de BDI foram calculados com o emprego da fórmula abaixo (Acórdão 2622/2013 - TCU):"]
[]
[]
[]
[]
[]
[]
["Declaro para os devidos fins que, conforme legislação tributária municipal, a base de cálculo para o ISS das atividades Pavimentação, Iluminação Pública, Praças, Saneamento, Sistemas de água, Esgoto Cloacal e Pluvial e seus respectivos serviços de conservação e manutenção é de 30%, com a respectiva alíquota de 4%."]
[]
[]
[]
[]
[]
["Declaro para os devidos fins que o detalhamento de encargos sociais atende ao estabelecido no SINAPI/RS de"]
[null,null,{"$f":"CONCATENATE('Planilha_M.O.'!$E$17,\",\")","v":"JUNHO / 2021,"},null,"sendo utilizada a opção de mão-de-obra horista e mensalista",{"$f":"IF('Planilha_M.O.'!$D$5=\"c/desoneração\",\"com desoneração,\",\"sem desoneração,\")","v":"sem desoneração,"}]
["e que esta é a alternativa mais adequada para a Administração Pública."]

{"sheet":"Quadro_Comparativo","index":10,"n_rows":18,"n_cols":2,"rows_kept":18,"cut":false,"hidden":false,"merged":[]}
[]
[]
[]
[]
[]
["Obras de Aquisição e Instalação de Academias de Ginástica ao ar livre na Praça Professor "]
["Emílio Mabilde Rípole (155/02), Praça Irene Elisalde Stricher (145/10) e Praça José Mariano "]
["de Freitas Beck (164/09)."]
[]
["QUADRO COMPARATIVO"]
[]
[null,"VALOR"]
["ORCAMENTO COM DESONERAÇÃO BDI 28,21%",459296.16]
[]
["ORCAMENTO SEM DESONERAÇÃO BDI 22,15%",{"$f":"PO!L163","v":451445.02999999985}]
[]
["O ORÇAMENTO MAIS VANTAJOSO PARA O MUNICÍPIO PMPA FOI O SEM DESONERAÇÃO"]
["DA FOLHA DE PAGAMENTO."]

{"sheet":"Encargos Sociais","index":11,"n_rows":42,"n_cols":6,"rows_kept":42,"cut":false,"hidden":false,"merged":[[41,0,41,1],[0,0,0,5],[4,0,4,5],[5,2,5,3],[5,4,5,5],[5,0,6,0],[5,1,6,1],[1,0,1,5],[30,0,30,5],[18,0,18,5],[7,0,7,5],[3,0,3,5],[37,0,37,5],[2,3,2,4]]}
["Composição dos Encargos Sociais"]
[]
[null,null,null,"Mês de referência:",null,"JUNHO/21"]
[]
["ENCARGOS SOCIAIS SOBRE A MÃO-DE-OBRA"]
["Código","Descrição","Com Desoneração",null,"Sem Desoneração"]
[null,null,"Horista","Mensalista","Horista","Mensalista"]
["GRUPO A"]
["A1","INSS",0,0,0.2,0.2]
["A2","SESI",1.4999999999999999E-2,1.4999999999999999E-2,1.4999999999999999E-2,1.4999999999999999E-2]
["A3","SENAI",0.01,0.01,0.01,0.01]
["A4","INCRA",2E-3,2E-3,2E-3,2E-3]
["A5","SEBRAE",6.0000000000000001E-3,6.0000000000000001E-3,6.0000000000000001E-3,6.0000000000000001E-3]
["A6","Salário Educação",2.5000000000000001E-2,2.5000000000000001E-2,2.5000000000000001E-2,2.5000000000000001E-2]
["A7","Seguro Contra Acidentes de Trabalho",0.03,0.03,0.03,0.03]
["A8","FGTS",0.08,0.08,0.08,0.08]
["A9","SECONCI",0,0,0,0]
["A","Total",{"$f":"SUM(C9:C17)","v":0.16799999999999998},{"$f":"SUM(D9:D17)","v":0.16799999999999998},0.36800000000000005,0.36800000000000005]
["GRUPO B"]
["B1","Repouso Semanal Remunerado",0.17929999999999999,0,0.17929999999999999,0]
["B2","Feriados",4.24E-2,0,4.24E-2,0]
["B3","Auxílio - Enfermidade",1.2500000000000001E-2,9.1000000000000004E-3,1.2500000000000001E-2,9.1000000000000004E-3]
["B4","13º Salário",0.1077,8.3299999999999999E-2,0.1077,8.3299999999999999E-2]
["B5","Licença Paternidade",6.9999999999999999E-4,5.9999999999999995E-4,6.9999999999999999E-4,5.9999999999999995E-4]
["B6","Faltas Justificadas",7.1999999999999998E-3,5.5999999999999999E-3,7.1999999999999998E-3,5.5999999999999999E-3]
["B7","Dias de Chuvas",1.5299999999999999E-2,0,1.5299999999999999E-2,0]
["B8","Auxílio Acidente de Trabalho",1.1000000000000001E-3,8.9999999999999998E-4,1.1000000000000001E-3,8.9999999999999998E-4]
["B9","Férias Gozadas",7.3999999999999996E-2,5.7200000000000001E-2,7.3999999999999996E-2,5.7200000000000001E-2]
["B10","Salário Maternidade",2.9999999999999997E-4,2.9999999999999997E-4,2.9999999999999997E-4,2.9999999999999997E-4]
["B","Total",{"$f":"SUM(C20:C29)","v":0.44049999999999995},{"$f":"SUM(D20:D29)","v":0.157},0.44049999999999995,0.157]
["GRUPO C"]
["C1","Aviso Prévio Indenizado",4.2799999999999998E-2,3.32E-2,4.2799999999999998E-2,3.32E-2]
["C2","Aviso Prévio Trabalhado",1E-3,8.0000000000000004E-4,1E-3,8.0000000000000004E-4]
["C3","Férias Indenizadas",5.2900000000000003E-2,4.0899999999999999E-2,5.2900000000000003E-2,4.0899999999999999E-2]
["C4","Depósito Rescisão Sem Justa Causa",3.6299999999999999E-2,2.81E-2,3.6299999999999999E-2,2.81E-2]
["C5","Indenização Adicional",3.5999999999999999E-3,2.8E-3,3.5999999999999999E-3,2.8E-3]
["C","Total",{"$f":"SUM(C32:C36)","v":0.1366},{"$f":"SUM(D32:D36)","v":0.10579999999999999},0.1366,0.10579999999999999]
["GRUPO D"]
["D1","Reincidência de Grupo A sobre Grupo B",{"$f":"ROUND((C18*C30),4)","v":7.3999999999999996E-2},{"$f":"ROUND((D18*D30),4)","v":2.64E-2},0.16209999999999999,5.7799999999999997E-2]
["D2","Reincidência de Grupo A sobre Aviso Prévio Trabalhado e Reincidência do FGTS sobre Aviso Prévio Indenizado",{"$f":"ROUND(((C18*C33)+(C16*C32)),4)","v":3.5999999999999999E-3},{"$f":"ROUND(((D18*D33)+(D16*D32)),4)","v":2.8E-3},3.8E-3,3.0000000000000001E-3]
["D","Total",{"$f":"SUM(C39:C40)","v":7.7600000000000002E-2},{"$f":"SUM(D39:D40)","v":2.92E-2},0.16589999999999999,6.08E-2]
["TOTAL (A+B+C+D)",null,{"$f":"+C18+C30+C37+C41+0.0001","v":0.82279999999999986},{"$f":"+D18+D30+D37+D41","v":0.45999999999999996},1.111,0.69159999999999999]

{"sheet":"Curva ABC","index":12,"n_rows":100,"n_cols":6,"rows_kept":100,"cut":false,"hidden":false,"merged":[[9,5,10,5],[2,1,2,5],[0,0,0,5],[9,0,10,0],[9,1,10,1],[9,2,10,2],[9,3,10,3],[9,4,10,4]]}
["CURVA ABC"]
[]
["OBJETO:",{"$f":"+PO!$B$9","v":"Obras de Aquisição e Instalação de Academias de Ginástica ao ar livre na Praça Professor Emílio Mabilde Rípole (155/02), Praça Irene Elisalde Stricher (145/10) e Praça José Mariano de Freitas Beck (164/09)."}]
["DATA:",{"$f":"IF(PO!$B$10=\"\",\"\",PO!$B$10)","v":"2021-08-10"},{"$f":"+PO!B3:L3","v":0}]
["ART nº:",{"$f":"IF(PO!$B$11=\"\",\"\",PO!$B$11)","v":""}]
[null,null,null,"A=70% DO VALOR DO ORÇAMENTO"]
[null,null,null,"B=20% DO VALOR DO ORÇAMENTO"]
[null,null,null,"C=10% DO VALOR DO ORÇAMENTO"]
[]
["ITEM","DESCRIÇÃO DAS ATIVIDADES","VALOR DO SERVIÇO","%","% Acumulado","ABC"]
[]
[]
["3.1","ADMINISTRAÇÃO LOCAL",{"$f":"PO!L29","v":24761.29},{"$f":"C13/$C$100","v":5.484895913019576E-2},{"$f":"E12+D13","v":5.484895913019576E-2},{"$f":"IF(OR(E13<0.71,D13>0.71),\"A\",(IF(OR(E13<0.91,D13>0.21),\"B\",\"C\")))","v":"A"}]
["11.1","ADMINISTRAÇÃO LOCAL",{"$f":"PO!L79","v":24761.29},5.484895913019576E-2,0.10969791826039152,"A"]
["19.1","ADMINISTRAÇÃO LOCAL",{"$f":"PO!L127","v":24761.29},5.484895913019576E-2,0.16454687739058727,"A"]
["15.5","MULTIEXERCITADOR CONJUGADO 6 FUNÇÕES - GALVANIZADO",{"$f":"PO!L99","v":18444.18},4.0855871200974343E-2,0.2054027485915616,"A"]
["7.5","ESQUI TRIPLO CONJUGADO - GALVANIZADO",{"$f":"PO!L49","v":18380.59},4.0715012412474667E-2,0.24611776100403626,"A"]
["15.3","ESQUI TRIPLO CONJUGADO - GALVANIZADO",{"$f":"PO!L97","v":18380.59},4.0715012412474667E-2,0.28683277341651092,"A"]
["21.2","PISO CONCRETO ARMADO E= 10 cm - ACADEMIA AO AR LIVRE",{"$f":"PO!L135","v":15439.45},3.4200066395680552E-2,0.3210328398121915,"A"]
["7.4","SIMULADOR DE CAMINHADA TRIPLO CONJUGADO - GALVANIZADO",{"$f":"PO!L48","v":15065.84},3.3372479479949084E-2,0.35440531929214059,"A"]
["15.2","SIMULADOR DE CAMINHADA TRIPLO CONJUGADO - GALVANIZADO",{"$f":"PO!L96","v":15065.84},3.3372479479949084E-2,0.38777779877208968,"A"]
["24.3","SIMULADOR DE CAMINHADA TRIPLO CONJUGADO - GALVANIZADO",{"$f":"PO!L149","v":15065.84},3.3372479479949084E-2,0.42115027825203877,"A"]
["5.2","PISO CONCRETO ARMADO E= 10 cm - ACADEMIA AO AR LIVRE",{"$f":"PO!L37","v":13723.96},3.0400068863312105E-2,0.45155034711535086,"A"]
["13.2","PISO CONCRETO ARMADO E= 10 cm - ACADEMIA AO AR LIVRE",{"$f":"PO!L87","v":11831},2.6206955916648365E-2,0.4777573030319992,"A"]
["24.2","JOGO DE BARRAS - GALVANIZADO",{"$f":"PO!L148","v":10945.66},2.4245831214489168E-2,0.50200313424648835,"A"]
["7.7","PRESSÃO DE PERNAS TRIPLO CONJUGADO - GALVANIZADO",{"$f":"PO!L51","v":10857.79},2.4051189576724325E-2,0.52605432382321271,"A"]
["24.5","PRESSÃO DE PERNAS TRIPLO CONJUGADO - GALVANIZADO",{"$f":"PO!L151","v":10857.79},2.4051189576724325E-2,0.55010551339993707,"A"]
["7.6","ADUÇÃO E ABDUÇÃO DE PERNAS DUPLO - GALVANIZADO",{"$f":"PO!L50","v":10491.68},2.3240215979340829E-2,0.57334572937927786,"A"]
["15.4","ADUÇÃO E ABDUÇÃO DE PERNAS DUPLO - GALVANIZADO",{"$f":"PO!L98","v":10491.68},2.3240215979340829E-2,0.59658594535861864,"A"]
["24.4","ADUÇÃO E ABDUÇÃO DE PERNAS DUPLO - GALVANIZADO",{"$f":"PO!L150","v":10491.68},2.3240215979340829E-2,0.61982616133795942,"A"]
["2.1","TAPUME EM CHAPA DE COMPENSADO RESINADO (L=9,90m; C=15,40m e H=2,20M)",{"$f":"PO!L19","v":9187.23},2.0350716896805794E-2,0.64017687823476521,"A"]
["7.1","PLACA ORIENTATIVA - GALVANIZADA",{"$f":"PO!L45","v":8910.19},1.9737043068122823E-2,0.65991392130288806,"A"]
["15.1","PLACA ORIENTATIVA - GALVANIZADA",{"$f":"PO!L95","v":8910.19},1.9737043068122823E-2,0.67965096437101091,"A"]
["24.1","PLACA ORIENTATIVA - GALVANIZADA",{"$f":"PO!L147","v":8910.19},1.9737043068122823E-2,0.69938800743913376,"A"]
["7.10","VOADOR PEITORAL E VOADOR DORSAL - GALVANIZADO",{"$f":"PO!L54","v":7137.53},1.581040774776056E-2,0.71519841518689431,"B"]
["15.8","VOADOR PEITORAL E VOADOR DORSAL - GALVANIZADO",{"$f":"PO!L102","v":7137.53},1.581040774776056E-2,0.73100882293465486,"B"]
["24.9","VOADOR PEITORAL E VOADOR DORSAL - GALVANIZADO",{"$f":"PO!L155","v":7137.53},1.581040774776056E-2,0.7468192306824154,"B"]
["10.1","TAPUME EM CHAPA DE COMPENSADO RESINADO (L=7,70m; C=11,00m e H=2,20M)",{"$f":"PO!L68","v":6790.56},1.5041831338801093E-2,0.76186106202121651,"B"]
["18.1","TAPUME EM CHAPA DE COMPENSADO RESINADO (L=7,70m; C=11,00m e H=2,20M)",{"$f":"PO!L116","v":6790.56},1.5041831338801093E-2,0.77690289336001761,"B"]
["7.9","REMADA ESPECIAL PPNE - GALVANIZADA",{"$f":"PO!L53","v":6776.86},1.5011484343952129E-2,0.79191437770396977,"B"]
["15.7","REMADA ESPECIAL PPNE - GALVANIZADA",{"$f":"PO!L101","v":6776.86},1.5011484343952129E-2,0.80692586204792194,"B"]
["24.8","REMADA ESPECIAL PPNE - GALVANIZADA",{"$f":"PO!L154","v":6776.86},1.5011484343952129E-2,0.8219373463918741,"B"]
["7.8","SIMULADOR DE REMO - GALVANIZADO",{"$f":"PO!L52","v":6442.09},1.426993226617203E-2,0.83620727865804612,"B"]
["15.6","SIMULADOR DE REMO - GALVANIZADO",{"$f":"PO!L100","v":6442.09},1.426993226617203E-2,0.85047721092421813,"B"]
["24.6","SIMULADOR DE REMO - GALVANIZADO",{"$f":"PO!L152","v":6442.09},{"$f":"C45/$C$100","v":1.426993226617203E-2},{"$f":"E44+D45","v":0.86474714319039014},{"$f":"IF(OR(E45<0.71,D45>0.71),\"A\",(IF(OR(E45<0.91,D45>0.21),\"B\",\"C\")))","v":"B"}]
["24.7","ABDOMINAL SIMPLES - GALVANIZADO",{"$f":"PO!L153","v":5701.11},1.2628580715574605E-2,0.87737572390596474,"B"]
["6.1","BANCO B (C/ ENCOSTO) - L=2,00 m - PADRÃO SMAM",{"$f":"PO!L41","v":3364.32},7.4523358912601161E-3,0.8848280597972249,"B"]
["14.1","BANCO B (C/ ENCOSTO) - L=2,00 m - PADRÃO SMAM",{"$f":"PO!L91","v":3364.32},7.4523358912601161E-3,0.89228039568848505,"B"]
["23.1","BANCO B (C/ ENCOSTO) - L=2,00 m - PADRÃO SMAM",{"$f":"PO!L143","v":3364.32},7.4523358912601161E-3,0.8997327315797452,"B"]
["2.4","INSTALAÇÃO PROVISÓRIA DE ENERGIA, AÉREA, BIFÁSICA, COM CAIXA DE EMBUTIR C/ POSTE H=9,00M",{"$f":"PO!L22","v":2979.99},6.6010030058366118E-3,0.90633373458558186,"B"]
["10.4","INSTALAÇÃO PROVISÓRIA DE ENERGIA, AÉREA, BIFÁSICA, COM CAIXA DE EMBUTIR C/ POSTE H=9,00M",{"$f":"PO!L71","v":2979.99},6.6010030058366118E-3,0.91293473759141852,"C"]
["18.4","INSTALAÇÃO PROVISÓRIA DE ENERGIA, AÉREA, BIFÁSICA, COM CAIXA DE EMBUTIR C/ POSTE H=9,00M",{"$f":"PO!L119","v":2979.99},6.6010030058366118E-3,0.91953574059725518,"C"]
["7.2","ESPALDAR PADRÃO SMAMS",{"$f":"PO!L46","v":2735.72},6.0599183027887134E-3,0.92559565890004392,"C"]
["10.7","SINALIZAÇÃO COM TELA PLÁSTICA LARANJA FIXADA EM CONE PLÁSTICO",{"$f":"PO!L74","v":1985.34},4.3977447265284983E-3,0.92999340362657246,"C"]
["18.7","SINALIZAÇÃO COM TELA PLÁSTICA LARANJA FIXADA EM CONE PLÁSTICO",{"$f":"PO!L122","v":1882.65},4.1702751717080594E-3,0.93416367879828055,"C"]
["7.3","PRANCHA DE ABDOMINAL PADRÃO SMAMS",{"$f":"PO!L47","v":1777.22},3.9367362179178267E-3,0.93810041501619834,"C"]
["8.1","PLANTIO DE GRAMA CATARINA COM COMPOSTO ORGANICO",{"$f":"PO!L57","v":1685.97},3.734607511350828E-3,0.94183502252754914,"C"]
["25.1","PLANTIO DE GRAMA CATARINA COM COMPOSTO ORGANICO",{"$f":"PO!L158","v":1685.97},3.734607511350828E-3,0.94556963003889993,"C"]
["20.2","ATERRO MANUAL C/MATERIAL IMPORTADO C/COMPACTAÇÃO MANUAL",{"$f":"PO!L131","v":1283.46},2.8430039422518397E-3,0.94841263398115172,"C"]
["6.2","LIXEIRA METÁLICA - V=30 LITROS INSTALADA",{"$f":"PO!L42","v":1251.74},2.772740681185481E-3,0.95118537466233721,"C"]
["14.2","LIXEIRA METÁLICA - V=30 LITROS INSTALADA",{"$f":"PO!L92","v":1251.74},2.772740681185481E-3,0.95395811534352271,"C"]
["23.2","LIXEIRA METÁLICA - V=30 LITROS INSTALADA",{"$f":"PO!L144","v":1251.74},2.772740681185481E-3,0.9567308560247082,"C"]
["4.2","ATERRO MANUAL C/MATERIAL IMPORTADO C/COMPACTAÇÃO MANUAL",{"$f":"PO!L33","v":1180.2},2.6142717752369541E-3,0.95934512779994519,"C"]
["22.1","RAMPA PPNE'S TIPO 1 - 1,80 m (ABA 1,50 m)",{"$f":"PO!L140","v":1119.3399999999999},2.4794602346159397E-3,0.96182458803456117,"C"]
["2.3","FRETE P/ BANHEIRO QUÍMICO LOCADO (IDA E VOLTA)",{"$f":"PO!L21","v":1085.48},2.4044566400476266E-3,0.96422904467460879,"C"]
["10.3","FRETE P/ BANHEIRO QUÍMICO LOCADO (IDA E VOLTA)",{"$f":"PO!L70","v":1085.48},2.4044566400476266E-3,0.96663350131465642,"C"]
["18.3","FRETE P/ BANHEIRO QUÍMICO LOCADO (IDA E VOLTA)",{"$f":"PO!L118","v":1085.48},2.4044566400476266E-3,0.96903795795470404,"C"]
["2.6","PLACA DE OBRA EM CHAPA GALVANIZADA",{"$f":"PO!L24","v":925.52},2.0501277863220688E-3,0.97108808574102612,"C"]
["10.6","PLACA DE OBRA EM CHAPA GALVANIZADA",{"$f":"PO!L73","v":925.52},2.0501277863220688E-3,0.97313821352734819,"C"]
["18.6","PLACA DE OBRA EM CHAPA GALVANIZADA",{"$f":"PO!L121","v":925.52},2.0501277863220688E-3,0.97518834131367027,"C"]
["2.5","INSTALAÇÃO PROVISÓRIA DE ÁGUA",{"$f":"PO!L23","v":897.15},1.9872851407844714E-3,0.97717562645445477,"C"]
["10.5","INSTALAÇÃO PROVISÓRIA DE ÁGUA",{"$f":"PO!L72","v":897.15},1.9872851407844714E-3,0.97916291159523927,"C"]
["18.5","INSTALAÇÃO PROVISÓRIA DE ÁGUA",{"$f":"PO!L120","v":897.15},1.9872851407844714E-3,0.98115019673602377,"C"]
["2.2","LOCAÇÃO DE BANHEIRO QUÍMICO",{"$f":"PO!L20","v":830.62},1.83991393149239E-3,0.98299011066751618,"C"]
["18.2","LOCAÇÃO DE BANHEIRO QUÍMICO",{"$f":"PO!L117","v":830.62},1.83991393149239E-3,0.98483002459900859,"C"]
["10.2","LOCAÇÃO DE BANHEIRO QUÍMICO",{"$f":"PO!L69","v":830.62},1.83991393149239E-3,0.986669938530501,"C"]
["20.1","MODELAGEM (MOVIMENTO DE TERRA ATÉ 15CM)",{"$f":"PO!L130","v":540.97},{"$f":"C77/$C$100","v":1.1983075768936917E-3},{"$f":"E76+D77","v":0.98786824610739465},{"$f":"IF(OR(E77<0.71,D77>0.71),\"A\",(IF(OR(E77<0.91,D77>0.21),\"B\",\"C\")))","v":"C"}]
["4.1","MODELAGEM (MOVIMENTO DE TERRA ATÉ 15CM)",{"$f":"PO!L32","v":497.07},1.1010642868302259E-3,0.98896931039422487,"C"]
["12.1","MODELAGEM (MOVIMENTO DE TERRA ATÉ 15CM)",{"$f":"PO!L82","v":454.3},1.0063240700645215E-3,0.98997563446428938,"C"]
["21.1","EXECUÇÃO DE PASSEIO (CALÇADA) OU PISO DE CONCRETO COM CONCRETO MOLDADO IN LOCO, FEITO EM OBRA, ACABAMENTO CONVENCIONAL, ESPESSURA 8 CM, ARMADO",{"$f":"PO!L134","v":420.81},9.3214006586804152E-4,0.99090777453015744,"C"]
["16.1","PLANTIO DE GRAMA CATARINA COM COMPOSTO ORGANICO",{"$f":"PO!L105","v":1771.12},3.9232240523281421E-3,0.99483099858248558,"C"]
["5.1","EXECUÇÃO DE PASSEIO (CALÇADA) OU PISO DE CONCRETO COM CONCRETO MOLDADO IN LOCO, FEITO EM OBRA, ACABAMENTO CONVENCIONAL, ESPESSURA 8 CM, ARMADO",{"$f":"PO!L36","v":315.60000000000002},6.9908843608268325E-4,0.99553008701856827,"C"]
["1.1","ART (ANOTAÇÃO DE RESPONSABILIDADE TÉCNICA PELA EXECUÇÃO TOTAL DO OBJETO)",{"$f":"PO!L16","v":276.05},6.1148087066104149E-4,0.99614156788922936,"C"]
["21.3","LAJE DE GRÊS ASSENTADA NA AREIA",{"$f":"PO!L136","v":270.95999999999998},6.0020596527555071E-4,0.99674177385450491,"C"]
["12.2","ATERRO MANUAL C/MATERIAL IMPORTADO C/COMPACTAÇÃO MANUAL",{"$f":"PO!L83","v":245.87},5.4462887762880005E-4,0.99728640273213376,"C"]
["9.2","DEMOLIÇÃO MESA E BANCOS DE CONCRETO C/REMOÇÃO DE ENTULHOS",{"$f":"PO!L65","v":205.18},4.5449608781826658E-4,0.99774089881995198,"C"]
["9.1","DEMOLIÇÃO CHURRASQUEIRA C/REMOÇÃO DE ENTULHOS",{"$f":"PO!L64","v":173.58},3.8449863984547575E-4,0.99812539745979745,"C"]
["13.1","EXECUÇÃO DE PASSEIO (CALÇADA) OU PISO DE CONCRETO COM CONCRETO MOLDADO IN LOCO, FEITO EM OBRA, ACABAMENTO CONVENCIONAL, ESPESSURA 8 CM, ARMADO",{"$f":"PO!L86","v":140.27000000000001},3.1071335528934721E-4,0.99843611081508676,"C"]
["13.3","PISO PODOTÁTIL 25x25 cm - E=2,5CM",{"$f":"PO!L88","v":135.16},2.9939414772159524E-4,0.99873550496280838,"C"]
["17.2","REMOÇÃO DE ENTULHOS COM CAÇAMBA 4M³",{"$f":"PO!L113","v":103.5},2.2926379320202062E-4,0.99896476875601037,"C"]
["5.3","PISO PODOTÁTIL 25x25 cm - E=2,5CM",{"$f":"PO!L38","v":101.37},2.2454561079119644E-4,0.99918931436680158,"C"]
["17.1","REMOÇÃO DE PASSEIOS - SEM REMOÇÃO DE ENTULHOS",{"$f":"PO!L112","v":69.3},1.5350706153526597E-4,0.99934282142833686,"C"]
["18.9","NIVELAMENTO",{"$f":"PO!L124","v":55.01},1.2185315230959568E-4,0.99946467458064647,"C"]
["21.4","PISO PODOTÁTIL 25x25 cm - E=2,5CM",{"$f":"PO!L137","v":50.68},1.122617298500329E-4,0.99957693631049649,"C"]
["2.8","NIVELAMENTO",{"$f":"PO!L26","v":50.55},1.119737656653347E-4,0.99968891007616179,"C"]
["10.9","NIVELAMENTO",{"$f":"PO!L76","v":46.2},1.0233804102351066E-4,0.99979124811718534,"C"]
["10.8","LOCAÇÃO DE OBRA",{"$f":"PO!L75","v":32.24},7.1415117805151166E-5,0.99986266323499051,"C"]
["18.8","LOCAÇÃO DE OBRA",{"$f":"PO!L123","v":31.62},7.0041750155052092E-5,0.99993270498514553,"C"]
["2.7","LOCAÇÃO DE OBRA",{"$f":"PO!L25","v":30.38},6.7295014854853972E-5,1.0000000000000004,"C"]
[null,"VALOR TOTAL PO",{"$f":"SUM(C13:C99)","v":451445.03}]