{"text_format":"2","workbook":"xlsx","n_sheets":13,"sheets":["PO","Cronograma","Composições","Memória_Cálculo","Composições Aux. SINAPI","Planilha_M.O.","Planilha Cotações","Insumos","Cotações","BDI","Quadro_Comparativo","Encargos Sociais","Curva ABC"],"not_rendered":{"charts":0,"images":3,"macros":0,"external_links":8,"defined_names":15,"comments":1,"pivot_tables":0},"unopened":[],"bounds":{"document_bytes":16777216,"sheet_cells":100000,"run_cost":"one","rows_first":2000,"rows_last":500,"rows_between":2000,"halvings":0,"cell_chars":16384,"cell_head_chars":4096},"cells_cut":0,"cells_raw":0,"read":"whole","date_system":"1900"}

{"sheet":"PO","index":0,"n_rows":156,"n_cols":15,"rows_kept":156,"cut":false,"hidden":false,"merged":[[148,1,148,10],[136,2,136,10],[133,2,133,10],[135,1,135,10],[141,2,141,10],[140,1,140,10],[152,0,153,0],[152,11,153,11],[151,1,151,10],[152,1,153,10],[149,2,149,10],[11,3,11,10],[10,3,10,10],[9,3,9,10],[11,0,11,2],[0,1,0,11],[8,1,8,2],[9,1,9,2],[10,1,10,2],[2,0,2,11],[1,0,1,11],[8,3,8,10],[7,0,7,11],[5,0,5,11],[3,0,3,11],[6,0,6,11],[4,9,4,10],[41,2,41,10],[17,1,17,10],[18,2,18,10],[28,1,28,10],[29,2,29,10],[31,1,31,10],[14,2,14,10],[32,2,32,10],[35,1,35,10],[36,2,36,10],[40,1,40,10],[59,0,60,0],[59,1,60,10],[44,1,44,10],[45,2,45,10],[55,1,55,10],[56,2,56,10],[58,1,58,10],[112,2,112,10],[116,2,116,10],[127,2,127,10],[63,2,63,10],[92,1,92,10],[93,2,93,10],[102,1,102,10],[110,0,110,11],[81,2,81,10],[84,1,84,10],[85,2,85,10],[88,1,88,10],[89,2,89,10],[132,1,132,10],[130,2,130,10],[115,1,115,10],[126,1,126,10],[129,1,129,10],[12,0,12,11],[61,0,61,11],[155,0,156,0],[155,1,156,10],[155,11,156,11],[103,2,103,10],[107,1,107,10],[108,0,109,0],[108,1,109,10],[108,11,109,11],[66,1,66,10],[67,2,67,10],[77,1,77,10],[78,2,78,10],[80,1,80,10],[59,11,60,11]]}
[]
["PLANILHA ORÇAMENTÁRIA"]
["LOCALIDADE SINAPI: PORTO ALEGRE/RS"]
[]
[{"$nulls":9},"DATA BASE SINAPI RS:",null,{"$f":"+Planilha_M.O.!$E$17","v":"JUNHO / 2021"}]
[]
[]
[]
["OBJETO:","Obras de Aquisição e Instalação de Academias de Ginástica ao ar livre na Praça Grêmio Futebol Portoalegrense (110/03), Praça Guia Lopes (118/08) e Praça Simões Lopes Neto (125/06)",null,{"$f":"CONCATENATE(\"Leis Sociais Horistas \",Planilha_M.O.!$D$5,\" (SINAPI)\")","v":"Leis Sociais Horistas s/desoneração (SINAPI)"},{"$nulls":7},{"$f":"+Planilha_M.O.!$D$7","v":1.111}]
["DATA:","2021-09-14",null,{"$f":"CONCATENATE(\"Leis Sociais Mensalistas \",Planilha_M.O.!$D$5,\" (SINAP)I\")","v":"Leis Sociais Mensalistas s/desoneração (SINAP)I"},{"$nulls":7},{"$f":"+Planilha_M.O.!$D$8","v":0.69159999999999999}]
["ART nº:",null,null,"BDI:",{"$nulls":7},{"$f":"+Planilha_M.O.!$F$7","v":"22,15%"}]
[null,null,null,"BDI diferenciado p/ Academia ar Livre:",{"$nulls":7},{"$f":"IF($L$11=\"28,21%\",19.35%,13.7%)","v":0.13699999999999998}]
["PRAÇA GRÊMIO FUTEBOL PORTOALEGRENSE (110/03)"]
["Composição","Item","Descrição","Quantidade","Un","Custo Unit.Mat.+Eq.","Custo Unit. M.O.","Custo Unit.","Preço Unit.Mat.+Eq.","Preço Unit. M.O.","Preço Unit.","Total"]
[null,1,"DESPESAS LEGAIS, LICENÇAS, TAXAS, CONTRIBUIÇÕES"]
["SMAMS 450","1.1","ART (ANOTAÇÃO DE RESPONSABILIDADE TÉCNICA PELA EXECUÇÃO TOTAL DO OBJETO)",1,"un",{"$f":"Composições!C68","v":226},{"$f":"+[1]Composições!C1026","v":0},{"$f":"+F16+G16","v":226},{"$f":"+K16-J16","v":276.05},{"$f":"+TRUNC((G16*(1+$L$11)),2)","v":0},{"$f":"Composições!F74","v":276.05},{"$f":"TRUNC((D16*K16),2)","v":276.05}]
["SMAMS 390","1.2","REMOÇÃO DE ENTULHOS COM CAÇAMBA 4M³",10.43,"m³",{"$f":"Composições!C13","v":110.83},{"$f":"Composições!C15","v":11.97},{"$f":"+F17+G17","v":122.8},{"$f":"+K17-J17","v":135.38},{"$f":"+TRUNC((G17*(1+$L$11)),2)","v":14.62},{"$f":"Composições!F21","v":150},{"$f":"TRUNC((D17*K17),2)","v":1564.5}]
[null,"TOTAL DE DESPESAS LEGAIS, LICENÇAS, TAXAS, CONTRIBUIÇÕES",{"$nulls":9},{"$f":"SUM(L16:L17)","v":1840.55}]
[null,2,"INSTALAÇÕES PROVISÓRIAS"]
["SMAMS 500","2.1","TAPUME EM CHAPA DE COMPENSADO RESINADO (L=10,00m; C=10,00m e H=2,20M)",88,"m²",{"$f":"Composições!C87","v":26.48},{"$f":"Composições!C92","v":41.089999999999996},{"$f":"+F20+G20","v":67.569999999999993},{"$f":"+K20-J20","v":32.3386},{"$f":"+TRUNC((G20*(1+$L$11)),4)","v":50.191400000000002},{"$f":"Composições!F98","v":82.53},{"$f":"TRUNC((D20*K20),2)","v":7262.64}]
["SMAMS 510","2.2","LOCAÇÃO DE BANHEIRO QUÍMICO",100,"%",{"$f":"Composições!C104","v":6.8},0,6.8,8.3062000000000005,{"$f":"+TRUNC((G21*(1+$L$11)),4)","v":0},{"$f":"Composições!F110","v":8.3062000000000005},830.62]
["SMAMS 520","2.3","FRETE P/ BANHEIRO QUÍMICO LOCADO (IDA E VOLTA)",1,"cj",{"$f":"Composições!C117","v":888.65},0,888.65,1085.48,{"$f":"+TRUNC((G22*(1+$L$11)),4)","v":0},{"$f":"Composições!F123","v":1085.48},1085.48]
["SMAMS 530","2.4","INSTALAÇÃO PROVISÓRIA DE ENERGIA, AÉREA, BIFÁSICA, COM CAIXA DE EMBUTIR C/ POSTE H=9,00M",1,"pt",{"$f":"Composições!C148","v":2353.6200000000003},{"$f":"Composições!C151","v":86},2439.6200000000003,2874.9410000000003,105.04900000000001,{"$f":"Composições!F158","v":2979.9900000000002},2979.99]
["SMAMS 535","2.5","INSTALAÇÃO PROVISÓRIA DE ÁGUA",1,"pt",{"$f":"Composições!C170","v":734.47},0,734.47,897.15000000000009,0,{"$f":"Composições!F176","v":897.15000000000009},897.15]
["SMAMS 542","2.6","PLACA DE OBRA EM CHAPA GALVANIZADA",2.5,"m²",{"$f":"Composições!C188","v":281.44},{"$f":"Composições!C193","v":21.639999999999997},{"$f":"+F25+G25","v":303.08},343.77679999999998,26.433199999999999,{"$f":"Composições!F199","v":370.21},925.52]
["SMAMS 552","2.7","SINALIZAÇÃO COM TELA PLÁSTICA LARANJA FIXADA EM CONE PLÁSTICO",54,"m",{"$f":"Composições!C206","v":22.339999999999996},{"$f":"Composições!C209","v":5.6899999999999995},{"$f":"+F26+G26","v":28.029999999999994},{"$f":"+K26-J26","v":27.279699999999998},{"$f":"+TRUNC((G26*(1+$L$11)),4)","v":6.9503000000000004},{"$f":"Composições!F215","v":34.229999999999997},{"$f":"TRUNC((D26*K26),2)","v":1848.42}]
["SINAPI C 99064","2.8","LOCAÇÃO DE OBRA",49,"m",{"$f":"Composições!C220","v":0.51},0,0.51,0.62,0,{"$f":"Composições!F226","v":0.62},30.38]
["SMAMS 565","2.9","NIVELAMENTO",152.44999999999999,"m²",{"$f":"Composições!C232","v":0.03},{"$f":"Composições!C236","v":0.22},0.25,3.999999999999998E-2,{"$f":"+TRUNC((G28*(1+$L$11)),2)","v":0.26},{"$f":"Composições!F242","v":0.3},45.73]
[null,"TOTAL DE INSTALAÇÕES PROVISÓRIAS",{"$nulls":9},{"$f":"SUM(L20:L28)","v":15905.929999999998}]
[null,3,"ADMINISTRAÇÃO LOCAL"]
["SMAMS 700","3.1","ADMINISTRAÇÃO LOCAL",100,"%",{"$f":"Composições!C268","v":202.7122},0,{"$f":"+F31+G31","v":202.7122},{"$f":"+K31-J31","v":247.6129},{"$f":"+TRUNC((G31*(1+$L$11)),4)","v":0},{"$f":"Composições!F274","v":247.6129},{"$f":"TRUNC((D31*K31),2)","v":24761.29}]
[null,"TOTAL DE ADMINISTRAÇÃO LOCAL",{"$nulls":9},{"$f":"SUM(L31)","v":24761.29}]
[null,4,"MOVIMENTO DE TERRA"]
["SMAMS 1002","4.1","MODELAGEM (MOVIMENTO DE TERRA ATÉ 15CM)",152.44999999999999,"m²",{"$f":"Composições!C325","v":0.08},{"$f":"Composições!C328","v":2.34},{"$f":"+F34+G34","v":2.42},{"$f":"+K34-J34","v":0.10000000000000009},{"$f":"+TRUNC((G34*(1+$L$11)),2)","v":2.85},{"$f":"Composições!F334","v":2.95},{"$f":"TRUNC((D34*K34),2)","v":449.72}]
["SMAMS 1010","4.2","ATERRO MANUAL C/MATERIAL IMPORTADO C/COMPACTAÇÃO MANUAL",9.9,"m³",{"$f":"Composições!C340","v":39.479999999999997},{"$f":"Composições!C342","v":41.04},80.52,48.219999999999992,50.13,{"$f":"Composições!F348","v":98.35},973.66]
[null,"TOTAL DE MOVIMENTO DE TERRA",{"$nulls":9},{"$f":"SUM(L34:L35)","v":1423.38}]
[null,5,"PAVIMENTAÇÃO"]
["SINAPI C 94994","5.1","EXECUÇÃO DE PASSEIO (CALÇADA) OU PISO DE CONCRETO COM CONCRETO USINADO, MOLDADO IN LOCO,  ACABAMENTO VASSOURADO, ESPESSURA 8 CM, ARMADO",4.2,"m²",{"$f":"Composições!C375","v":97.59},{"$f":"Composições!C379","v":17.25},{"$f":"+F38+G38","v":114.84},{"$f":"+K38-J38","v":119.20000000000002},{"$f":"+TRUNC((G38*(1+$L$11)),2)","v":21.07},{"$f":"Composições!F385","v":140.27000000000001},{"$f":"TRUNC((D38*K38),2)","v":589.13}]
["SMAMS 2023","5.2","PISO CONCRETO ARMADO E= 10 cm - ACADEMIA AO AR LIVRE",99,"m²",{"$f":"Composições!C404","v":81.759999999999991},{"$f":"Composições!C410","v":15.1},96.859999999999985,99.86999999999999,18.440000000000001,{"$f":"Composições!F416","v":118.30999999999999},11712.69]
["SMAMS 2070","5.3","PISO PODOTÁTIL 25x25 cm - E=2,0 cm",3,"m",{"$f":"Composições!C426","v":19.529999999999998},{"$f":"Composições!C429","v":8.14},27.669999999999998,23.85,9.94,{"$f":"Composições!F435","v":33.79},101.37]
[null,"TOTAL DE PAVIMENTAÇÃO",{"$nulls":9},{"$f":"SUM(L38:L40)","v":12403.19}]
[null,6,"MOBILIÁRIO URBANO"]
["SMAMS 2601","6.1","BANCO B (C/ ENCOSTO) - L=2,00 m - PADRÃO SMAMS",2,"un",{"$f":"Composições!C459","v":1021.8400000000001},{"$f":"Composições!C466","v":355.29},{"$f":"+F43+G43","v":1377.13},{"$f":"+K43-J43","v":1248.18},{"$f":"+TRUNC((G43*(1+$L$11)),2)","v":433.98},{"$f":"Composições!F472","v":1682.16},{"$f":"TRUNC((D43*K43),2)","v":3364.32}]
["SMAMS 2671","6.2","LIXEIRA METÁLICA - V=30 LITROS",1,"un",{"$f":"Composições!C497","v":971.95},{"$f":"Composições!C500","v":52.81},1024.76,1187.24,64.5,{"$f":"Composições!F506","v":1251.74},1251.74]
[null,"TOTAL DE EQUIPAMENTOS/MOBILIÁRIO URBANO",{"$nulls":9},{"$f":"SUM(L43:L44)","v":4616.0600000000004}]
[null,7,"ACADEMIA AO AR LIVRE GALVANIZADA"]
["SMAMS 3205","7.1","PLACA ORIENTATIVA - GALVANIZADA",1,"un",{"$f":"Composições!C616+Composições!C618","v":7782.09},{"$f":"Composições!C621","v":44.72},{"$f":"+F47+G47","v":7826.81},{"$f":"+K47-J47","v":8855.57},{"$f":"+TRUNC((G47*(1+$L$11)),2)","v":54.62},{"$f":"Composições!F628","v":8910.19},{"$f":"TRUNC((D47*K47),2)","v":8910.19}]
["SMAMS 3220","7.2","SIMULADOR DE CAMINHADA TRIPLO CONJUGADO - GALVANIZADO",1,"un",{"$f":"Composições!C653","v":13224.66},{"$f":"Composições!C656","v":24.08},13248.74,15036.43,29.41,{"$f":"Composições!F663","v":15065.84},15065.84]
["SMAMS 3010","7.3","APOIO DE MEMBROS SUPERIORES - EQUIPAMENTO PADRÃO SMAMS",1,"un",{"$f":"Composições!C542","v":637.61},{"$f":"Composições!C546","v":259.08000000000004},896.69,778.84000000000015,316.45999999999998,{"$f":"Composições!F552","v":1095.3000000000002},1095.3]
["SMAMS 3235","7.4","ADUÇÃO E ABDUÇÃO DE PERNAS DUPLO - GALVANIZADO",1,"un",{"$f":"Composições!C684+Composições!C686","v":9193.3799999999992},{"$f":"Composições!C689","v":28.77},9222.15,10456.539999999999,35.14,{"$f":"Composições!F696","v":10491.679999999998},10491.68]
["SMAMS 3212","7.5","JOGO DE BARRAS",1,"un",{"$f":"Composições!C635+Composições!C637","v":9532.86},{"$f":"Composições!C640","v":75.44},{"$f":"+F51+G51","v":9608.3000000000011},{"$f":"+K51-J51","v":10853.52},{"$f":"+TRUNC((G51*(1+$L$11)),2)","v":92.14},{"$f":"Composições!F647","v":10945.66},{"$f":"TRUNC((D51*K51),2)","v":10945.66}]
["SMAMS 3252","7.6","SIMULADOR DE REMO  - GALVANIZADO",1,"un",{"$f":"Composições!C720","v":5640},{"$f":"Composições!C723","v":24.08},5664.08,6412.68,29.41,{"$f":"Composições!F730","v":6442.09},6442.09]
["SMAMS 3025","7.7","ESPALDAR - EQUIPAMENTO PADRÃO SMAMS",1,"un",{"$f":"Composições!C519","v":1643.62},{"$f":"Composições!C523","v":596.02},{"$f":"+F53+G53","v":2239.64},{"$f":"+K53-J53","v":2007.6899999999998},{"$f":"+TRUNC((G53*(1+$L$11)),2)","v":728.03},{"$f":"Composições!F529","v":2735.72},{"$f":"TRUNC((D53*K53),2)","v":2735.72}]
["SMAMS 3276","7.8","REMADA ESPECIAL - GALVANIZADO",1,"un",{"$f":"Composições!C755","v":5940},{"$f":"Composições!C758","v":18.899999999999999},{"$f":"+F54+G54","v":5958.9},{"$f":"+K54-J54","v":6753.78},{"$f":"+TRUNC((G54*(1+$L$11)),2)","v":23.08},{"$f":"Composições!F765","v":6776.86},{"$f":"TRUNC((D54*K54),2)","v":6776.86}]
["SMAMS 3280","7.9","VOADOR PEITORAL E VOADOR DORSAL - GALVANIZADO",1,"un",{"$f":"Composições!C771+Composições!C773","v":6243.38},{"$f":"Composições!C776","v":28.77},6272.1500000000005,7102.3899999999994,35.14,{"$f":"Composições!F783","v":7137.53},7137.53]
[null,"TOTAL DE ACADEMIA AO AR LIVRE",{"$nulls":9},{"$f":"SUM(L47:L55)","v":69600.87}]
[null,8,"PLANTIO"]
["SINAPI C 4105","8.1","PLANTIO DE GRAMA CATARINA (SÃO MARCOS) COM COMPOSTO ORGÂNICO",48.5,"m²",{"$f":"Composições!C838","v":24.439999999999998},{"$f":"Composições!C841","v":3.45},{"$f":"+F58+G58","v":27.889999999999997},{"$f":"+K58-J58","v":29.849999999999994},{"$f":"+TRUNC((G58*(1+$L$11)),2)","v":4.21},{"$f":"Composições!F847","v":34.059999999999995},{"$f":"TRUNC((D58*K58),2)","v":1651.91}]
[null,"TOTAL DE PLANTIO",{"$nulls":9},{"$f":"SUM(L57:L58)","v":1651.91},null,null,{"$f":"N60-L60","v":2796.820000000007}]
[null,"SUBTOTAL PRAÇA GRÊMIO FUTEBOL PORTOALEGRENSE (1)",{"$nulls":9},{"$f":"SUM(L16:L59)/2","v":132203.18},null,135000]
[]
["PRAÇA GUIA LOPES (118/08)"]
["Composição","Item","Descrição","Quantidade","Un","Custo Unit.Mat.+Eq.","Custo Unit. M.O.","Custo Unit.","Preço Unit.Mat.+Eq.","Preço Unit. M.O.","Preço Unit.","Total"]
[null,9,"SERVIÇOS PRELIMINARES"]
["SMAMS 122","9.1","DEMOLIÇÃO DE MURETAS E CANTEIRO",10.31,"m³",{"$f":"Composições!C53","v":22.83},{"$f":"Composições!C56","v":0.37},{"$f":"+F65+G65","v":23.2},{"$f":"+K65-J65","v":27.88},{"$f":"+TRUNC((G65*(1+$L$11)),2)","v":0.45},{"$f":"Composições!F62","v":28.33},{"$f":"TRUNC((D65*K65),2)","v":292.08}]
["SMAMS 390","9.2","REMOÇÃO DE ENTULHOS COM CAÇAMBA 4M³",39.01,"m³",{"$f":"Composições!C13","v":110.83},{"$f":"Composições!C15","v":11.97},122.8,135.38,14.62,{"$f":"Composições!F21","v":150},5851.5]
[null,"TOTAL DE SERVIÇOS PRELIMINARES",{"$nulls":9},{"$f":"SUM(L65:L66)","v":6143.58}]
[null,10,"INSTALAÇÕES PROVISÓRIAS"]
["SMAMS 500","10.1","TAPUME EM CHAPA DE COMPENSADO RESINADO (L=10,00m; C=10,00m e H=2,20M)",88,"m²",{"$f":"Composições!C87","v":26.48},{"$f":"Composições!C92","v":41.089999999999996},{"$f":"+F69+G69","v":67.569999999999993},{"$f":"+K69-J69","v":32.3386},{"$f":"+TRUNC((G69*(1+$L$11)),4)","v":50.191400000000002},{"$f":"Composições!F98","v":82.53},{"$f":"TRUNC((D69*K69),2)","v":7262.64}]
["SMAMS 510","10.2","LOCAÇÃO DE BANHEIRO QUÍMICO",100,"%",{"$f":"Composições!C104","v":6.8},0,6.8,7.69,{"$f":"+TRUNC((G70*(1+$L$11)),4)","v":0},{"$f":"[2]Composições!F1116","v":7.69},769]
["SMAMS 520","10.3","FRETE P/ BANHEIRO QUÍMICO LOCADO (IDA E VOLTA)",1,"cj",{"$f":"Composições!C117","v":888.65},0,888.65,1085.48,{"$f":"+TRUNC((G71*(1+$L$11)),4)","v":0},{"$f":"Composições!F123","v":1085.48},1085.48]
["SMAMS 530","10.4","INSTALAÇÃO PROVISÓRIA DE ENERGIA, AÉREA, BIFÁSICA, COM CAIXA DE EMBUTIR C/ POSTE H=9,00M",1,"pt",{"$f":"Composições!C148","v":2353.6200000000003},{"$f":"Composições!C151","v":86},2439.6200000000003,2874.9410000000003,105.04900000000001,{"$f":"Composições!F158","v":2979.9900000000002},2979.99]
["SMAMS 535","10.5","INSTALAÇÃO PROVISÓRIA DE ÁGUA",1,"pt",{"$f":"Composições!C170","v":734.47},0,734.47,897.15000000000009,0,{"$f":"Composições!F176","v":897.15000000000009},897.15]
["SMAMS 542","10.6","PLACA DE OBRA EM CHAPA GALVANIZADA",2.5,"m²",{"$f":"Composições!C188","v":281.44},{"$f":"Composições!C193","v":21.639999999999997},{"$f":"+F74+G74","v":303.08},343.77679999999998,26.433199999999999,{"$f":"Composições!F199","v":370.21},925.52]
["SMAMS 552","10.7","SINALIZAÇÃO COM TELA PLÁSTICA LARANJA FIXADA EM CONE PLÁSTICO",49.4,"m",{"$f":"Composições!C206","v":22.339999999999996},{"$f":"Composições!C209","v":5.6899999999999995},{"$f":"+F75+G75","v":28.029999999999994},27.279699999999998,6.9503000000000004,{"$f":"Composições!F215","v":34.229999999999997},1690.96]
["SINAPI C 99064","10.8","LOCAÇÃO DE OBRA",65.2,"m",{"$f":"Composições!C220","v":0.51},0,0.51,0.62,0,{"$f":"Composições!F226","v":0.62},40.42]
["SMAMS 565","10.9","NIVELAMENTO",167.71,"m²",{"$f":"Composições!C232","v":0.03},{"$f":"Composições!C236","v":0.22},0.25,3.999999999999998E-2,{"$f":"+TRUNC((G77*(1+$L$11)),2)","v":0.26},{"$f":"Composições!F242","v":0.3},50.31]
[null,"TOTAL DE INSTALAÇÕES PROVISÓRIAS",{"$nulls":9},{"$f":"SUM(L69:L77)","v":15701.470000000001}]
[null,11,"ADMINISTRAÇÃO LOCAL"]
["SMAMS 700","11.1","ADMINISTRAÇÃO LOCAL",100,"%",0,{"$f":"Composições!C268","v":202.7122},{"$f":"+F80+G80","v":202.7122},{"$f":"+K80-J80","v":0},{"$f":"+TRUNC((G80*(1+$L$11)),4)","v":247.6129},{"$f":"Composições!F274","v":247.6129},{"$f":"TRUNC((D80*K80),2)","v":24761.29}]
[null,"TOTAL DE ADMINISTRAÇÃO LOCAL",{"$nulls":9},{"$f":"SUM(L80)","v":24761.29}]
[null,12,"MOVIMENTO DE TERRA"]
["SMAMS 1002","12.1","MODELAGEM (MOVIMENTO DE TERRA ATÉ 15CM)",167.71,"m²",{"$f":"Composições!C325","v":0.08},{"$f":"Composições!C328","v":2.34},{"$f":"+F83+G83","v":2.42},{"$f":"+K83-J83","v":0.10000000000000009},{"$f":"+TRUNC((G83*(1+$L$11)),2)","v":2.85},{"$f":"Composições!F334","v":2.95},{"$f":"TRUNC((D83*K83),2)","v":494.74}]
["SMAMS 1010","12.2","ATERRO MANUAL C/MATERIAL IMPORTADO C/COMPACTAÇÃO MANUAL",10.5,"m³",{"$f":"Composições!C340","v":39.479999999999997},{"$f":"Composições!C342","v":41.04},80.52,48.219999999999992,50.13,{"$f":"Composições!F348","v":98.35},1032.67]
[null,"TOTAL DE MOVIMENTO DE TERRA",{"$nulls":9},{"$f":"SUM(L83:L84)","v":1527.41}]
[null,13,"PAVIMENTAÇÃO"]
["SMAMS 2010","13.1","REPOSIÇÃO DE SAIBRO ROSA - COMPACTAÇÃO MECÂNICA - E= 6 CM",62.69,"m²",{"$f":"Composições!C358","v":7.2299999999999995},{"$f":"Composições!C360","v":4.2300000000000004},{"$f":"+F87+G87","v":11.46},{"$f":"+K87-J87","v":8.83},{"$f":"+TRUNC((G87*(1+$L$11)),2)","v":5.16},{"$f":"Composições!F366","v":13.99},{"$f":"TRUNC((D87*K87),2)","v":877.03}]
["SINAPI C 94994","13.2","PISO CONCRETO ARMADO E= 10 cm - ACADEMIA AO AR LIVRE",105.02,"m²",{"$f":"Composições!C404","v":81.759999999999991},{"$f":"Composições!C410","v":15.1},96.859999999999985,99.86999999999999,18.440000000000001,{"$f":"Composições!F416","v":118.30999999999999},12424.91]
[null,"TOTAL DE PAVIMENTAÇÃO",{"$nulls":9},{"$f":"SUM(L87:L88)","v":13301.94}]
[null,14,"MOBILIÁRIO URBANO"]
["SMAMS 2601","14.1","BANCO B (C/ ENCOSTO) - L=2,00 m - PADRÃO SMAM",1,"un",{"$f":"Composições!C459","v":1021.8400000000001},{"$f":"Composições!C466","v":355.29},{"$f":"+F91+G91","v":1377.13},{"$f":"+K91-J91","v":1248.18},{"$f":"+TRUNC((G91*(1+$L$11)),2)","v":433.98},{"$f":"Composições!F472","v":1682.16},{"$f":"TRUNC((D91*K91),2)","v":1682.16}]
["SMAMS 2071","14.2","LIXEIRA METÁLICA - V=30 LITROS INSTALADA",1,"un",{"$f":"Composições!C497","v":971.95},{"$f":"Composições!C500","v":52.81},1024.76,1187.24,64.5,{"$f":"Composições!F506","v":1251.74},1251.74]
[null,"TOTAL DE MOBILIÁRIO URBANO",{"$nulls":9},{"$f":"SUM(L91:L92)","v":2933.9}]
[null,15,"ACADEMIA AO AR LIVRE - GALVANIZADA"]
["SINAPI C 3205","15.1","PLACA ORIENTATIVA - GALVANIZADA",1,"un",{"$f":"Composições!C616+Composições!C618","v":7782.09},{"$f":"Composições!C621","v":44.72},{"$f":"+F95+G95","v":7826.81},{"$f":"+K95-J95","v":8855.57},{"$f":"+TRUNC((G95*(1+$L$11)),2)","v":54.62},{"$f":"Composições!F628","v":8910.19},{"$f":"TRUNC((D95*K95),2)","v":8910.19}]
["SINAPI C 3220","15.2","SIMULADOR DE CAMINHADA TRIPLO CONJUGADO - GALVANIZADO",1,"un",{"$f":"Composições!C653","v":13224.66},{"$f":"Composições!C656","v":24.08},13248.74,15036.43,29.41,{"$f":"Composições!F663","v":15065.84},15065.84]
["SINAPI C 3230","15.3","ESQUI TRIPLO CONJUGADO - GALVANIZADO",1,"un",{"$f":"Composições!C668","v":16140},{"$f":"Composições!C671","v":24.08},16164.08,18351.18,29.41,{"$f":"Composições!F678","v":18380.59},18380.59]
["SINAPI C 3235","15.4","ADUÇÃO E ABDUÇÃO DE PERNAS DUPLO - GALVANIZADO",1,"un",{"$f":"Composições!C684+Composições!C686","v":9193.3799999999992},{"$f":"Composições!C689","v":28.77},9222.15,10456.539999999999,35.14,{"$f":"Composições!F696","v":10491.679999999998},10491.68]
["SINAPI C 3240","15.5","PRESSÃO DE PERNAS TRIPLO CONJUGADO - GALVANIZADO",1,"un",{"$f":"Composições!C702+Composições!C704","v":9515.3799999999992},{"$f":"Composições!C707","v":28.77},{"$f":"+F99+G99","v":9544.15},{"$f":"+K99-J99","v":10822.65},{"$f":"+TRUNC((G99*(1+$L$11)),2)","v":35.14},{"$f":"Composições!F714","v":10857.789999999999},{"$f":"TRUNC((D99*K99),2)","v":10857.79}]
["SINAPI C 3252","15.6","SIMULADOR DE REMO - GALVANIZADO",1,"un",{"$f":"Composições!C720","v":5640},{"$f":"Composições!C723","v":24.08},5664.08,6412.68,29.41,{"$f":"Composições!F730","v":6442.09},6442.09]
["SINAPI C 3030","15.7","PRANCHA DE ABDOMINAIS PADRÃO SMAMS ",1,"un",{"$f":"Composições!C570","v":1135.76},{"$f":"Composições!C575","v":319.19},{"$f":"+F101+G101","v":1454.95},{"$f":"+K101-J101","v":1387.33},{"$f":"+TRUNC((G101*(1+$L$11)),2)","v":389.89},{"$f":"Composições!F581","v":1777.22},{"$f":"TRUNC((D101*K101),2)","v":1777.22}]
["SINAPI C 3280","15.8","VOADOR PEITORAL E VOADOR DORSAL - GALVANIZADO",1,"un",{"$f":"Composições!C771+Composições!C773","v":6243.38},{"$f":"Composições!C776","v":28.77},6272.1500000000005,7102.3899999999994,35.14,{"$f":"Composições!F783","v":7137.53},7137.53]
[null,"TOTAL DE ACADEMIA AO AR LIVRE",{"$nulls":9},{"$f":"SUM(L95:L102)","v":79062.929999999993}]
[null,16,"REVESTIMENTO / PINTURA"]
["SINAPI C 87897","16.1","CHAPISCO APLICADO EM ALVENARIA (SEM PRESENÇA DE VÃOS) E ESTRUTURAS DE CONCRETO DE FACHADA, COM EQUIPAMENTO DE PROJEÇÃO. ARGAMASSA TRAÇO 1:3 COM PREPARO EM BETONEIRA 400 L. AF_06/2014",8.41,"m²",{"$f":"Composições!C791","v":2.34},{"$f":"Composições!C794","v":2.62},{"$f":"+F105+G105","v":4.96},{"$f":"+K105-J105","v":2.8499999999999996},{"$f":"+TRUNC((G105*(1+$L$11)),2)","v":3.2},{"$f":"Composições!F800","v":6.05},{"$f":"TRUNC((D105*K105),2)","v":50.88}]
["SINAPI C 87794","16.2","EMBOÇO OU MASSA ÚNICA EM ARGAMASSA TRAÇO 1:2:8, PREPARO MANUAL, APLICADA MANUALMENTE EM PANOS CEGOS DE FACHADA (SEM PRESENÇA DE VÃOS), ESPESSURA DE 25 MM. AF_06/2014",8.41,"m²",{"$f":"Composições!C807","v":19.899999999999999},{"$f":"Composições!C810","v":15.12},35.019999999999996,24.309999999999995,18.46,{"$f":"Composições!F816","v":42.769999999999996},359.69]
["SINAPI C 88489","16.3","APLICAÇÃO MANUAL DE PINTURA COM TINTA LÁTEX ACRÍLICA EM PAREDES, DUAS DEMÃOS. AF_06/2014",24.03,"m²",{"$f":"Composições!C822","v":8.4700000000000006},{"$f":"Composições!C825","v":5.2299999999999995},{"$f":"+F107+G107","v":13.7},{"$f":"+K107-J107","v":10.350000000000001},{"$f":"+TRUNC((G107*(1+$L$11)),2)","v":6.38},{"$f":"Composições!F831","v":16.73},{"$f":"TRUNC((D107*K107),2)","v":402.02}]
[null,"TOTAL DE REVESTIMENTO / PINTURA",{"$nulls":9},{"$f":"SUM(L105:L107)","v":812.58999999999992}]
[null,"SUBTOTAL PRAÇA GUIA LOPES 118/08 (2)",{"$nulls":9},{"$f":"SUM(L65:L108)/2","v":144245.11000000002}]
[]
["PRAÇA SIMÕES LOPES NETO - 126/05"]
["Composição","Item","Descrição","Quantidade","Un","Custo Unit.Mat.+Eq.","Custo Unit. M.O.","Custo Unit.","Preço Unit.Mat.+Eq.","Preço Unit. M.O.","Preço Unit.","Total"]
[null,17,"SERVIÇOS PRELIMINARES"]
["SMAMS 101","17.1","REMOÇÃO BANCO S/ ENCOSTO - TIPO A",1,"un",{"$f":"Composições!C32","v":21.679999999999996},{"$f":"Composições!C35","v":28.669999999999998},{"$f":"+F114+G114","v":50.349999999999994},{"$f":"+K114-J114","v":26.47999999999999},{"$f":"+TRUNC((G114*(1+$L$11)),2)","v":35.020000000000003},{"$f":"Composições!F41","v":61.499999999999993},{"$f":"TRUNC((D114*K114),2)","v":61.5}]
["SMAMS 390","17.2","REMOÇÃO DE ENTULHOS COM CAÇAMBA 4M³",4.96,"m³",{"$f":"Composições!C13","v":110.83},{"$f":"Composições!C15","v":11.97},{"$f":"+F115+G115","v":122.8},{"$f":"+K115-J115","v":135.38},{"$f":"+TRUNC((G115*(1+$L$11)),2)","v":14.62},{"$f":"Composições!F21","v":150},{"$f":"TRUNC((D115*K115),2)","v":744}]
[null,"TOTAL DE SERVIÇOS PRELIMINARES",{"$nulls":9},{"$f":"SUM(L114:L115)","v":805.5}]
[null,18,"INSTALAÇÕES PROVISÓRIAS"]
["SMAMS 500","18.1","TAPUME EM CHAPA DE COMPENSADO RESINADO (L=10,00m; C=10,00m e H=2,20M)",88,"m²",{"$f":"Composições!C87","v":26.48},{"$f":"Composições!C92","v":41.089999999999996},{"$f":"+F118+G118","v":67.569999999999993},{"$f":"+K118-J118","v":32.3386},{"$f":"+TRUNC((G118*(1+$L$11)),4)","v":50.191400000000002},{"$f":"Composições!F98","v":82.53},{"$f":"TRUNC((D118*K118),2)","v":7262.64}]
[{"$f":"CONCATENATE(\"SMAMS \",Composições!A102)","v":"SMAMS 510"},"18.2","LOCAÇÃO DE BANHEIRO QUÍMICO",100,"%",{"$f":"Composições!C104","v":6.8},0,{"$f":"+F119+G119","v":6.8},{"$f":"+K119-J119","v":8.3062000000000005},{"$f":"+TRUNC((G119*(1+$L$11)),4)","v":0},{"$f":"Composições!F110","v":8.3062000000000005},{"$f":"TRUNC((D119*K119),2)","v":830.62}]
["SMAMS 520","18.3","FRETE P/ BANHEIRO QUÍMICO LOCADO (IDA E VOLTA)",1,"cj",{"$f":"Composições!C117","v":888.65},0,{"$f":"+F120+G120","v":888.65},{"$f":"+K120-J120","v":1085.48},{"$f":"+TRUNC((G120*(1+$L$11)),4)","v":0},{"$f":"Composições!F123","v":1085.48},{"$f":"TRUNC((D120*K120),2)","v":1085.48}]
["SMAMS 530","18.4","INSTALAÇÃO PROVISÓRIA DE ENERGIA, AÉREA, BIFÁSICA, COM CAIXA DE EMBUTIR C/ POSTE H=9,00M",1,"pt",{"$f":"Composições!C148","v":2353.6200000000003},{"$f":"Composições!C151","v":86},{"$f":"+F121+G121","v":2439.6200000000003},{"$f":"+K121-J121","v":2874.9410000000003},{"$f":"+TRUNC((G121*(1+$L$11)),4)","v":105.04900000000001},{"$f":"Composições!F158","v":2979.9900000000002},{"$f":"TRUNC((D121*K121),2)","v":2979.99}]
["SMAMS 535","18.5","INSTALAÇÃO PROVISÓRIA DE ÁGUA",1,"pt",{"$f":"Composições!C170","v":734.47},{"$f":"Composições!C152","v":0},{"$f":"+F122+G122","v":734.47},{"$f":"+K122-J122","v":897.15000000000009},{"$f":"+TRUNC((G122*(1+$L$11)),4)","v":0},{"$f":"Composições!F176","v":897.15000000000009},{"$f":"TRUNC((D122*K122),2)","v":897.15}]
["SMAMS 542","18.6","PLACA DE OBRA EM CHAPA GALVANIZADA",2.5,"m²",{"$f":"Composições!C188","v":281.44},{"$f":"Composições!C193","v":21.639999999999997},{"$f":"+F123+G123","v":303.08},{"$f":"+K123-J123","v":343.77679999999998},{"$f":"+TRUNC((G123*(1+$L$11)),4)","v":26.433199999999999},{"$f":"Composições!F199","v":370.21},{"$f":"TRUNC((D123*K123),2)","v":925.52}]
["SMAMS 552","18.7","SINALIZAÇÃO COM TELA PLÁSTICA LARANJA FIXADA EM CONE PLÁSTICO",23,"m",{"$f":"Composições!C206","v":22.339999999999996},{"$f":"Composições!C209","v":5.6899999999999995},{"$f":"+F124+G124","v":28.029999999999994},27.279699999999998,6.9503000000000004,{"$f":"Composições!F215","v":34.229999999999997},787.29]
["SINAPI C 99064","18.8","LOCAÇÃO DE OBRA",30,"m",0,{"$f":"Composições!C220","v":0.51},0.51,-2.9000000000000137E-3,0.62290000000000001,{"$f":"Composições!F226","v":0.62},18.600000000000001]
["SMAMS 565","18.9","NIVELAMENTO",71,"m²",{"$f":"Composições!C232","v":0.03},{"$f":"Composições!C236","v":0.22},0.25,3.999999999999998E-2,{"$f":"+TRUNC((G126*(1+$L$11)),2)","v":0.26},{"$f":"Composições!F242","v":0.3},21.3]
[null,"TOTAL DE INSTALAÇÕES PROVISÓRIAS",{"$nulls":9},{"$f":"SUM(L118:L126)","v":14808.589999999998}]
[null,19,"ADMINISTRAÇÃO LOCAL"]
["SMAMS 701","19.1","ADMINISTRAÇÃO LOCAL SIMÕES LOPES NETO",100,"%",0,{"$f":"Composições!C286","v":201.5342},{"$f":"+F129+G129","v":201.5342},{"$f":"+K129-J129","v":0},{"$f":"+TRUNC((G129*(1+$L$11)),4)","v":246.17400000000001},{"$f":"Composições!F292","v":246.17400000000001},{"$f":"TRUNC((D129*K129),2)","v":24617.4}]
[null,"TOTAL DE ADMINISTRAÇÃO LOCAL",{"$nulls":9},{"$f":"SUM(L129)","v":24617.4}]
[null,20,"MOVIMENTO DE TERRA"]
["SMAMS 1002","20.1","MODELAGEM (MOVIMENTO DE TERRA ATÉ 15CM)",71,"m²",{"$f":"Composições!C325","v":0.08},{"$f":"Composições!C328","v":2.34},{"$f":"+F132+G132","v":2.42},{"$f":"+K132-J132","v":0.10000000000000009},{"$f":"+TRUNC((G132*(1+$L$11)),2)","v":2.85},{"$f":"Composições!F334","v":2.95},{"$f":"TRUNC((D132*K132),2)","v":209.45}]
[null,"TOTAL DE MOVIMENTO DE TERRA",{"$nulls":9},{"$f":"SUM(L132:L132)","v":209.45}]
[null,21,"PAVIMENTAÇÃO"]
[{"$f":"CONCATENATE(\"SMAMS \",Composições!A389)","v":"SMAMS 2023"},"21.1","PISO CONCRETO ARMADO E= 10 cm - ACADEMIA AO AR LIVRE",50,"m²",{"$f":"+Composições!C404","v":81.759999999999991},{"$f":"Composições!C410","v":15.1},{"$f":"+F135+G135","v":96.859999999999985},{"$f":"+K135-J135","v":99.86999999999999},{"$f":"+TRUNC((G135*(1+$L$11)),2)","v":18.440000000000001},{"$f":"Composições!F416","v":118.30999999999999},{"$f":"TRUNC((D135*K135),2)","v":5915.5}]
[null,"TOTAL DE PAVIMENTAÇÃO",{"$nulls":9},{"$f":"SUM(L135:L135)","v":5915.5}]
[null,22,"MOBILIÁRIO URBANO"]
["SMAMS 2601","22.1","BANCO B (C/ ENCOSTO) - L=2,00 m - PADRÃO SMAM (NOVO)",1,"un",{"$f":"+Composições!C459","v":1021.8400000000001},{"$f":"+Composições!C466","v":355.29},{"$f":"+F138+G138","v":1377.13},{"$f":"+K138-J138","v":1248.18},{"$f":"+TRUNC((G138*(1+$L$11)),2)","v":433.98},{"$f":"+Composições!F472","v":1682.16},{"$f":"TRUNC((D138*K138),2)","v":1682.16}]
["SMAMS 3723","22.2","INSTALAÇÃO DE BANCO S/ENCOSTO TIPO A (EXISTENTE)",1,"un",{"$f":"Composições!C479","v":61.14},{"$f":"Composições!C482","v":36.619999999999997},97.759999999999991,74.680000000000007,44.73,{"$f":"Composições!F488","v":119.41},119.41]
["SMAMS 2671","22.3","LIXEIRA METÁLICA - V=30 LITROS INSTALADA",1,"un",{"$f":"+Composições!C497","v":971.95},{"$f":"+Composições!C500","v":52.81},1024.76,1187.24,64.5,{"$f":"+Composições!F506","v":1251.74},1251.74]
[null,"TOTAL DE EQUIPAMENTOS/MOBILIÁRIO URBANO",{"$nulls":9},{"$f":"SUM(L138:L140)","v":3053.3100000000004}]
[null,23,"ACADEMIA AO AR LIVRE - GALVANIZADA"]
["SMAMS 3205","23.1","PLACA ORIENTATIVA - GALVANIZADA",1,"un",{"$f":"+Composições!C616+Composições!C618","v":7782.09},{"$f":"+Composições!C621","v":44.72},{"$f":"+F143+G143","v":7826.81},{"$f":"+K143-J143","v":8855.57},{"$f":"+TRUNC((G143*(1+$L$11)),2)","v":54.62},{"$f":"+Composições!F628","v":8910.19},{"$f":"TRUNC((D143*K143),2)","v":8910.19}]
["SMAMS 3220","23.2","SIMULADOR DE CAMINHADA TRIPLO CONJUGADO - GALVANIZADO",1,"un",{"$f":"+Composições!C653","v":13224.66},{"$f":"+Composições!C656","v":24.08},13248.74,15036.43,29.41,{"$f":"+Composições!F663","v":15065.84},15065.84]
["SMAMS 3235","23.3","ADUÇÃO E ABDUÇÃO DE PERNAS DUPLO - GALVANIZADO",1,"un",{"$f":"+Composições!C684+Composições!C686","v":9193.3799999999992},{"$f":"+Composições!C689","v":28.77},9222.15,10456.539999999999,35.14,{"$f":"+Composições!F696","v":10491.679999999998},10491.68]
["SMAMS 3025","23.4","ESPALDAR - EQUIPAMENTO PADRÃO SMAMS",1,"un",{"$f":"Composições!C519","v":1643.62},{"$f":"Composições!C523","v":596.02},2239.64,2007.6899999999998,728.03,{"$f":"Composições!F529","v":2735.72},2735.72]
["SMAMS 3252","23.5","SIMULADOR DE REMO - GALVANIZADO",1,"un",{"$f":"+Composições!F719","v":5640},{"$f":"+Composições!C723","v":24.08},5664.08,6412.68,29.41,{"$f":"+Composições!F730","v":6442.09},6442.09]
["SMAMS 3276","23.6","REMADA ESPECIAL PPNE - GALVANIZADA",1,"un",{"$f":"+Composições!C755","v":5940},{"$f":"+Composições!C758","v":18.899999999999999},5958.9,6753.78,23.08,{"$f":"+Composições!F765","v":6776.86},6776.86]
[null,"TOTAL DE ACADEMIA AO AR LIVRE",{"$nulls":9},{"$f":"SUM(L143:L148)","v":50422.380000000005}]
[null,24,"PLANTIO"]
[{"$f":"CONCATENATE(\"SMAMS \",Composições!A835)","v":"SMAMS 4105"},"24.1","PLANTIO DE GRAMA CATARINA (SÃO MARCOS) COM COMPOSTO ORGÂNICO",21,"m²",{"$f":"+Composições!C838","v":24.439999999999998},{"$f":"+Composições!C841","v":3.45},{"$f":"+F151+G151","v":27.889999999999997},{"$f":"+K151-J151","v":29.849999999999994},{"$f":"+TRUNC((G151*(1+$L$11)),2)","v":4.21},{"$f":"+Composições!F847","v":34.059999999999995},{"$f":"TRUNC((D151*K151),2)","v":715.26}]
[null,"TOTAL DE PLANTIO",{"$nulls":9},{"$f":"SUM(L151:L151)","v":715.26}]
[null,"SUBTOTAL PRAÇA SIMÕES LOPES NETO (3)",{"$nulls":9},{"$f":"SUM(L114:L152)/2","v":100547.39}]
[]
[]
[null,"TOTAL OBRA (1) + (2) + (3)",{"$nulls":9},{"$f":"L153+L109+L60","v":376995.68}]

{"sheet":"Cronograma","index":1,"n_rows":120,"n_cols":31,"rows_kept":120,"cut":false,"hidden":false,"merged":[[1,28,5,30],[0,28,0,30],[3,2,3,8],[0,0,0,26],[6,5,6,6],[6,7,6,8],[6,9,6,10],[6,11,6,12],[6,13,6,14],[6,21,6,22],[6,23,6,24],[6,25,6,26],[6,15,6,16],[6,17,6,18],[6,19,6,20],[6,0,7,0],[2,1,2,8],[8,1,8,8],[46,1,46,8],[84,1,84,8],[118,0,118,1],[118,2,119,2],[119,0,119,1],[6,3,6,4],[6,1,7,1],[6,2,7,2]]}
["CRONOGRAMA FÍSICO-FINANCEIRO",{"$nulls":27},"INSTRUÇÕES"]
[{"$nulls":28},"*Preencher com as porcentagens de cada item.     *Ocultar colunas não utilizadas (não deletar).                                 *As linhas devem ser ocultadas, nunca deletadas.    *Não preencher as porcentagens de engenheiro, mestre e encarregado."]
["OBJETO:",{"$f":"+PO!$B$9","v":"Obras de Aquisição e Instalação de Academias de Ginástica ao ar livre na Praça Grêmio Futebol Portoalegrense (110/03), Praça Guia Lopes (118/08) e Praça Simões Lopes Neto (125/06)"}]
["DATA:",{"$f":"IF(PO!$B$10=\"\",\"\",PO!$B$10)","v":"2021-09-14"},{"$f":"+PO!B3:L3","v":0}]
["ART nº:",{"$f":"IF(PO!$B$11=\"\",\"\",PO!$B$11)","v":""}]
[]
["ITEM","SERVIÇO","VALOR DO SERVIÇO","30 dias",null,"60 dias",null,"90 dias",null,"120 dias",null,"150 dias",null,"180 dias",null,"210 dias",null,"240 dias",null,"270 dias",null,"300 dias",null,"330 dias",null,"360 dias"]
[null,null,null,"%","Valor","%","Valor","%","Valor","%","Valor","%","Valor","%","Valor","%","Valor","%","Valor","%","Valor","%","Valor","%","Valor","%","Valor"]
[null,"PRAÇA PROFESSOR EMÍLIO MABILDE RÍPOLE"]
[1,"DESPESAS LEGAIS, LICENÇAS, TAXAS, CONTRIBUIÇÕES"]
["1.1","ART (ANOTAÇÃO DE RESPONSABILIDADE TÉCNICA PELA EXECUÇÃO TOTAL DO OBJETO)",{"$f":"PO!L16","v":276.05},1,{"$f":"D11*$C11","v":276.05},null,{"$f":"F11*$C11","v":0},null,{"$f":"H11*$C11","v":0},null,{"$f":"J11*$C11","v":0},null,{"$f":"L11*$C11","v":0},null,{"$f":"N11*$C11","v":0},null,{"$f":"P11*$C11","v":0},null,{"$f":"R11*$C11","v":0},null,{"$f":"T11*$C11","v":0},null,{"$f":"V11*$C11","v":0},null,{"$f":"X11*$C11","v":0},null,{"$f":"Z11*$C11","v":0},null,{"$f":"+D11+F11+H11+J11+L11+N11+P11+R11+T11+V11+X11+Z11","v":1},{"$f":"+E11+G11+I11+K11+M11+O11+Q11+S11+U11+W11+Y11+AA11","v":276.05},{"$f":"IF(C11=AD11,\"ok!\",\"incompleto\")","v":"ok!"}]
["1.2","REMOÇÃO DE ENTULHOS COM CAÇAMBA 4M³",{"$f":"PO!L17","v":1564.5},1,{"$f":"D12*$C12","v":1564.5},null,{"$f":"F12*$C12","v":0},null,{"$f":"H12*$C12","v":0},null,{"$f":"J12*$C12","v":0},null,{"$f":"L12*$C12","v":0},null,{"$f":"N12*$C12","v":0},null,{"$f":"P12*$C12","v":0},null,{"$f":"R12*$C12","v":0},null,{"$f":"T12*$C12","v":0},null,{"$f":"V12*$C12","v":0},null,{"$f":"X12*$C12","v":0},null,{"$f":"Z12*$C12","v":0},null,{"$f":"+D12+F12+H12+J12+L12+N12+P12+R12+T12+V12+X12+Z12","v":1},1564.5,{"$f":"IF(C12=AD12,\"ok!\",\"incompleto\")","v":"ok!"}]
[2,"INSTALAÇÕES PROVISÓRIAS"]
["2.1","TAPUME EM CHAPA DE COMPENSADO RESINADO (L=10,00m; C=10,00m e H=2,20M)",{"$f":"PO!L20","v":7262.64},1,7262.64,null,{"$f":"F14*$C14","v":0},null,0,null,{"$f":"J14*$C14","v":0},null,{"$f":"L14*$C14","v":0},null,{"$f":"N14*$C14","v":0},null,{"$f":"P14*$C14","v":0},null,{"$f":"R14*$C14","v":0},null,{"$f":"T14*$C14","v":0},null,{"$f":"V14*$C14","v":0},null,{"$f":"X14*$C14","v":0},null,{"$f":"Z14*$C14","v":0},null,{"$f":"+D14+F14+H14+J14+L14+N14+P14+R14+T14+V14+X14+Z14","v":1},{"$f":"+E14+G14+I14+K14+M14+O14+Q14+S14+U14+W14+Y14+AA14","v":7262.64},{"$f":"IF(C14=AD14,\"ok!\",\"incompleto\")","v":"ok!"}]
["2.2","LOCAÇÃO DE BANHEIRO QUÍMICO",{"$f":"PO!L21","v":830.62},1,830.62,null,0,null,0,null,0,null,0,null,0,null,0,null,0,null,0,null,0,null,0,null,0,null,1,830.62,"ok!"]
["2.3","FRETE P/ BANHEIRO QUÍMICO LOCADO (IDA E VOLTA)",{"$f":"PO!L22","v":1085.48},1,{"$f":"D16*$C16","v":1085.48},null,{"$f":"F16*$C16","v":0},null,{"$f":"H16*$C16","v":0},null,{"$f":"J16*$C16","v":0},null,{"$f":"L16*$C16","v":0},null,{"$f":"N16*$C16","v":0},null,{"$f":"P16*$C16","v":0},null,{"$f":"R16*$C16","v":0},null,{"$f":"T16*$C16","v":0},null,{"$f":"V16*$C16","v":0},null,{"$f":"X16*$C16","v":0},null,{"$f":"Z16*$C16","v":0},null,{"$f":"+D16+F16+H16+J16+L16+N16+P16+R16+T16+V16+X16+Z16","v":1},{"$f":"+E16+G16+I16+K16+M16+O16+Q16+S16+U16+W16+Y16+AA16","v":1085.48},{"$f":"IF(C16=AD16,\"ok!\",\"incompleto\")","v":"ok!"}]
["2.4","INSTALAÇÃO PROVISÓRIA DE ENERGIA, AÉREA, BIFÁSICA, COM CAIXA DE EMBUTIR C/ POSTE H=9,00M",{"$f":"PO!L23","v":2979.99},1,2979.99,null,0,null,0,null,0,null,0,null,0,null,0,null,0,null,0,null,0,null,0,null,0,null,1,2979.99,"ok!"]
["2.5","INSTALAÇÃO PROVISÓRIA DE ÁGUA",{"$f":"PO!L24","v":897.15},1,897.15,null,0,null,0,null,0,null,0,null,0,null,0,null,0,null,0,null,0,null,0,null,0,null,1,897.15,"ok!"]
["2.6","PLACA DE OBRA EM CHAPA GALVANIZADA",{"$f":"PO!L25","v":925.52},1,{"$f":"D19*$C19","v":925.52},null,{"$f":"F19*$C19","v":0},null,{"$f":"H19*$C19","v":0},null,{"$f":"J19*$C19","v":0},null,{"$f":"L19*$C19","v":0},null,{"$f":"N19*$C19","v":0},null,{"$f":"P19*$C19","v":0},null,{"$f":"R19*$C19","v":0},null,{"$f":"T19*$C19","v":0},null,{"$f":"V19*$C19","v":0},null,{"$f":"X19*$C19","v":0},null,{"$f":"Z19*$C19","v":0},null,{"$f":"+D19+F19+H19+J19+L19+N19+P19+R19+T19+V19+X19+Z19","v":1},{"$f":"+E19+G19+I19+K19+M19+O19+Q19+S19+U19+W19+Y19+AA19","v":925.52},{"$f":"IF(C19=AD19,\"ok!\",\"incompleto\")","v":"ok!"}]
["2.7","SINALIZAÇÃO COM TELA PLÁSTICA LARANJA FIXADA EM CONE PLÁSTICO",{"$f":"PO!L26","v":1848.42},1,{"$f":"D20*$C20","v":1848.42},null,{"$f":"F20*$C20","v":0},null,{"$f":"H20*$C20","v":0},null,{"$f":"J20*$C20","v":0},null,{"$f":"L20*$C20","v":0},null,{"$f":"N20*$C20","v":0},null,{"$f":"P20*$C20","v":0},null,{"$f":"R20*$C20","v":0},null,{"$f":"T20*$C20","v":0},null,{"$f":"V20*$C20","v":0},null,{"$f":"X20*$C20","v":0},null,{"$f":"Z20*$C20","v":0},null,{"$f":"+D20+F20+H20+J20+L20+N20+P20+R20+T20+V20+X20+Z20","v":1},{"$f":"+E20+G20+I20+K20+M20+O20+Q20+S20+U20+W20+Y20+AA20","v":1848.42},{"$f":"IF(C20=AD20,\"ok!\",\"incompleto\")","v":"ok!"}]
["2.8","LOCAÇÃO DE OBRA",{"$f":"PO!L27","v":30.38},1,30.38,null,0,null,0,null,0,null,0,null,0,null,0,null,0,null,0,null,0,null,0,null,0,null,1,30.38,"ok!"]
["2.9","NIVELAMENTO",{"$f":"PO!L28","v":45.73},1,{"$f":"D22*$C22","v":45.73},null,{"$f":"F22*$C22","v":0},null,{"$f":"H22*$C22","v":0},null,{"$f":"J22*$C22","v":0},null,{"$f":"L22*$C22","v":0},null,{"$f":"N22*$C22","v":0},null,{"$f":"P22*$C22","v":0},null,{"$f":"R22*$C22","v":0},null,{"$f":"T22*$C22","v":0},null,{"$f":"V22*$C22","v":0},null,{"$f":"X22*$C22","v":0},null,{"$f":"Z22*$C22","v":0},null,{"$f":"+D22+F22+H22+J22+L22+N22+P22+R22+T22+V22+X22+Z22","v":1},{"$f":"+E22+G22+I22+K22+M22+O22+Q22+S22+U22+W22+Y22+AA22","v":45.73},{"$f":"IF(C22=AD22,\"ok!\",\"incompleto\")","v":"ok!"}]
[3,"ADMINISTRAÇÃO LOCAL"]
["3.1","ADMINISTRAÇÃO LOCAL",{"$f":"PO!L31","v":24761.29},1,{"$f":"D24*$C24","v":24761.29},null,{"$f":"F24*$C24","v":0},null,{"$f":"H24*$C24","v":0},null,{"$f":"J24*$C24","v":0},null,{"$f":"L24*$C24","v":0},null,{"$f":"N24*$C24","v":0},null,{"$f":"P24*$C24","v":0},null,{"$f":"R24*$C24","v":0},null,{"$f":"T24*$C24","v":0},null,{"$f":"V24*$C24","v":0},null,{"$f":"X24*$C24","v":0},null,{"$f":"Z24*$C24","v":0},null,{"$f":"+D24+F24+H24+J24+L24+N24+P24+R24+T24+V24+X24+Z24","v":1},{"$f":"+E24+G24+I24+K24+M24+O24+Q24+S24+U24+W24+Y24+AA24","v":24761.29},{"$f":"IF(C24=AD24,\"ok!\",\"incompleto\")","v":"ok!"}]
[4,"MOVIMENTO DE TERRA"]
["4.1","MODELAGEM (MOVIMENTO DE TERRA ATÉ 15CM)",{"$f":"PO!L34","v":449.72},1,{"$f":"D26*$C26","v":449.72},null,{"$f":"F26*$C26","v":0},null,{"$f":"H26*$C26","v":0},null,{"$f":"J26*$C26","v":0},null,{"$f":"L26*$C26","v":0},null,{"$f":"N26*$C26","v":0},null,{"$f":"P26*$C26","v":0},null,{"$f":"R26*$C26","v":0},null,{"$f":"T26*$C26","v":0},null,{"$f":"V26*$C26","v":0},null,{"$f":"X26*$C26","v":0},null,{"$f":"Z26*$C26","v":0},null,{"$f":"+D26+F26+H26+J26+L26+N26+P26+R26+T26+V26+X26+Z26","v":1},449.72,{"$f":"IF(C26=AD26,\"ok!\",\"incompleto\")","v":"ok!"}]
["4.2","ATERRO MANUAL C/MATERIAL IMPORTADO C/COMPACTAÇÃO MANUAL",{"$f":"PO!L35","v":973.66},1,973.66,null,0,null,0,null,0,null,0,null,0,null,0,null,0,null,0,null,0,null,0,null,0,null,1,973.66,"ok!"]
[5,"PAVIMENTAÇÃO"]
["5.1","EXECUÇÃO DE PASSEIO (CALÇADA) OU PISO DE CONCRETO COM CONCRETO MOLDADO IN LOCO, FEITO EM OBRA, ACABAMENTO CONVENCIONAL, ESPESSURA 8 CM, ARMADO",{"$f":"PO!L38","v":589.13},1,589.13,null,0,null,0,null,0,null,0,null,0,null,0,null,0,null,0,null,0,null,0,null,0,null,{"$f":"+D29+F29+H29+J29+L29+N29+P29+R29+T29+V29+X29+Z29","v":1},{"$f":"+E29+G29+I29+K29+M29+O29+Q29+S29+U29+W29+Y29+AA29","v":589.13},{"$f":"IF(C29=AD29,\"ok!\",\"incompleto\")","v":"ok!"}]
["5.2","PISO CONCRETO ARMADO E= 10 cm - ACADEMIA AO AR LIVRE",{"$f":"PO!L39","v":11712.69},1,11712.69,null,0,null,0,null,0,null,0,null,0,null,0,null,0,null,0,null,0,null,0,null,0,null,1,11712.69,"ok!"]
["5.3","PISO PODOTÁTIL 25x25 cm - E=2,5CM",{"$f":"PO!L40","v":101.37},1,101.37,null,0,null,0,null,0,null,0,null,0,null,0,null,0,null,0,null,0,null,0,null,0,null,1,101.37,"ok!"]
[6,"MOBILIÁRIO URBANO"]
["6.1","BANCO B (C/ ENCOSTO) - L=2,00 m - PADRÃO SMAM",{"$f":"PO!L43","v":3364.32},1,{"$f":"D33*$C33","v":3364.32},null,{"$f":"F33*$C33","v":0},null,{"$f":"H33*$C33","v":0},null,{"$f":"J33*$C33","v":0},null,{"$f":"L33*$C33","v":0},null,{"$f":"N33*$C33","v":0},null,{"$f":"P33*$C33","v":0},null,{"$f":"R33*$C33","v":0},null,{"$f":"T33*$C33","v":0},null,{"$f":"V33*$C33","v":0},null,{"$f":"X33*$C33","v":0},null,{"$f":"Z33*$C33","v":0},null,{"$f":"+D33+F33+H33+J33+L33+N33+P33+R33+T33+V33+X33+Z33","v":1},{"$f":"+E33+G33+I33+K33+M33+O33+Q33+S33+U33+W33+Y33+AA33","v":3364.32},{"$f":"IF(C33=AD33,\"ok!\",\"incompleto\")","v":"ok!"}]
["6.2","LIXEIRA METÁLICA - V=30 LITROS INSTALADA",{"$f":"PO!L44","v":1251.74},1,{"$f":"D34*$C34","v":1251.74},null,{"$f":"F34*$C34","v":0},null,{"$f":"H34*$C34","v":0},null,{"$f":"J34*$C34","v":0},null,{"$f":"L34*$C34","v":0},null,{"$f":"N34*$C34","v":0},null,{"$f":"P34*$C34","v":0},null,{"$f":"R34*$C34","v":0},null,{"$f":"T34*$C34","v":0},null,{"$f":"V34*$C34","v":0},null,{"$f":"X34*$C34","v":0},null,{"$f":"Z34*$C34","v":0},null,{"$f":"+D34+F34+H34+J34+L34+N34+P34+R34+T34+V34+X34+Z34","v":1},1251.74,{"$f":"IF(C34=AD34,\"ok!\",\"incompleto\")","v":"ok!"}]
[7,"ACADEMIA AO AR LIVRE"]
["7.1","PLACA ORIENTATIVA - GALVANIZADA",{"$f":"PO!L47","v":8910.19},1,{"$f":"D36*$C36","v":8910.19},null,{"$f":"F36*$C36","v":0},null,{"$f":"H36*$C36","v":0},null,{"$f":"J36*$C36","v":0},null,{"$f":"L36*$C36","v":0},null,{"$f":"N36*$C36","v":0},null,{"$f":"P36*$C36","v":0},null,{"$f":"R36*$C36","v":0},null,{"$f":"T36*$C36","v":0},null,{"$f":"V36*$C36","v":0},null,{"$f":"X36*$C36","v":0},null,{"$f":"Z36*$C36","v":0},null,{"$f":"+D36+F36+H36+J36+L36+N36+P36+R36+T36+V36+X36+Z36","v":1},8910.19,{"$f":"IF(C36=AD36,\"ok!\",\"incompleto\")","v":"ok!"}]
["7.2","SIMULADOR DE CAMINHADA TRIPLO CONJUGADO - GALVANIZADO",{"$f":"PO!L48","v":15065.84},1,15065.84,null,0,null,0,null,0,null,0,null,0,null,0,null,0,null,0,null,0,null,0,null,0,null,1,15065.84,"ok!"]
["7.3","ESQUI TRIPLO CONJUGADO - GALVANIZADO",{"$f":"PO!L49","v":1095.3},1,{"$f":"D38*$C38","v":1095.3},null,{"$f":"F38*$C38","v":0},null,{"$f":"H38*$C38","v":0},null,{"$f":"J38*$C38","v":0},null,{"$f":"L38*$C38","v":0},null,{"$f":"N38*$C38","v":0},null,{"$f":"P38*$C38","v":0},null,{"$f":"R38*$C38","v":0},null,{"$f":"T38*$C38","v":0},null,{"$f":"V38*$C38","v":0},null,{"$f":"X38*$C38","v":0},null,{"$f":"Z38*$C38","v":0},null,{"$f":"+D38+F38+H38+J38+L38+N38+P38+R38+T38+V38+X38+Z38","v":1},{"$f":"+E38+G38+I38+K38+M38+O38+Q38+S38+U38+W38+Y38+AA38","v":1095.3},{"$f":"IF(C38=AD38,\"ok!\",\"incompleto\")","v":"ok!"}]
["7.4","ADUÇÃO E ABDUÇÃO DE PERNAS DUPLO - GALVANIZADO",{"$f":"PO!L50","v":10491.68},1,10491.68,null,0,null,0,null,0,null,0,null,0,null,0,null,0,null,0,null,0,null,0,null,0,null,1,10491.68,"ok!"]
["7.5","JOGO DE BARRAS",{"$f":"PO!L51","v":10945.66},1,{"$f":"D40*$C40","v":10945.66},null,{"$f":"F40*$C40","v":0},null,{"$f":"H40*$C40","v":0},null,{"$f":"J40*$C40","v":0},null,{"$f":"L40*$C40","v":0},null,{"$f":"N40*$C40","v":0},null,{"$f":"P40*$C40","v":0},null,{"$f":"R40*$C40","v":0},null,{"$f":"T40*$C40","v":0},null,{"$f":"V40*$C40","v":0},null,{"$f":"X40*$C40","v":0},null,{"$f":"Z40*$C40","v":0},null,{"$f":"+D40+F40+H40+J40+L40+N40+P40+R40+T40+V40+X40+Z40","v":1},{"$f":"+E40+G40+I40+K40+M40+O40+Q40+S40+U40+W40+Y40+AA40","v":10945.66},{"$f":"IF(C40=AD40,\"ok!\",\"incompleto\")","v":"ok!"}]
["7.6","SIMULADOR DE REMO  - GALVANIZADO",{"$f":"PO!L52","v":6442.09},1,6442.09,null,0,null,0,null,0,null,0,null,0,null,0,null,0,null,0,null,0,null,0,null,0,null,1,6442.09,"ok!"]
["7.7","MULTIEXERCITADOR CONJUGADO 6 FUNÇÕES - GALVANIZADO",{"$f":"PO!L53","v":2735.72},1,2735.72,null,0,null,0,null,0,null,0,null,0,null,0,null,0,null,0,null,0,null,0,null,0,null,1,2735.72,"ok!"]
["7.8","REMADA ESPECIAL - GALVANIZADO",{"$f":"PO!L54","v":6776.86},1,6776.86,null,0,null,0,null,0,null,0,null,0,null,0,null,0,null,0,null,0,null,0,null,0,null,1,6776.86,"ok!"]
["7.9","VOADOR PEITORAL E VOADOR DORSAL - GALVANIZADO",{"$f":"PO!L55","v":7137.53},1,7137.53,null,0,null,0,null,0,null,0,null,0,null,0,null,0,null,0,null,0,null,0,null,0,null,1,7137.53,"ok!"]
[8,"PLANTIO"]
["8.1","PLANTIO DE GRAMA CATARINA (SÃO MARCOS) COM COMPOSTO ORGÂNICO",{"$f":"PO!L58","v":1651.91},1,{"$f":"D46*$C46","v":1651.91},null,{"$f":"F46*$C46","v":0},null,{"$f":"H46*$C46","v":0},null,{"$f":"J46*$C46","v":0},null,{"$f":"L46*$C46","v":0},null,{"$f":"N46*$C46","v":0},null,{"$f":"P46*$C46","v":0},null,{"$f":"R46*$C46","v":0},null,{"$f":"T46*$C46","v":0},null,{"$f":"V46*$C46","v":0},null,{"$f":"X46*$C46","v":0},null,{"$f":"Z46*$C46","v":0},null,{"$f":"+D46+F46+H46+J46+L46+N46+P46+R46+T46+V46+X46+Z46","v":1},1651.91,{"$f":"IF(C46=AD46,\"ok!\",\"incompleto\")","v":"ok!"}]
[null,"PRAÇA GUIA LOPES"]
[9,"SERVIÇOS PRELIMINARES"]
["9.1","DEMOLIÇÃO DE MURETAS E CANTEIROS",{"$f":"PO!L65","v":292.08},null,{"$f":"D49*$C49","v":0},1,{"$f":"F49*$C49","v":292.08},null,{"$f":"H49*$C49","v":0},null,{"$f":"J49*$C49","v":0},null,{"$f":"L49*$C49","v":0},null,{"$f":"N49*$C49","v":0},null,{"$f":"P49*$C49","v":0},null,{"$f":"R49*$C49","v":0},null,{"$f":"T49*$C49","v":0},null,{"$f":"V49*$C49","v":0},null,{"$f":"X49*$C49","v":0},null,{"$f":"Z49*$C49","v":0},null,{"$f":"+D49+F49+H49+J49+L49+N49+P49+R49+T49+V49+X49+Z49","v":1},{"$f":"+E49+G49+I49+K49+M49+O49+Q49+S49+U49+W49+Y49+AA49","v":292.08},{"$f":"IF(C49=AD49,\"ok!\",\"incompleto\")","v":"ok!"}]
["9.2","REMOÇÃO DE ENTULHOS COM CAÇAMBA 4M³",{"$f":"PO!L66","v":5851.5},null,{"$f":"D50*$C50","v":0},1,{"$f":"F50*$C50","v":5851.5},null,{"$f":"H50*$C50","v":0},null,{"$f":"J50*$C50","v":0},null,{"$f":"L50*$C50","v":0},null,{"$f":"N50*$C50","v":0},null,{"$f":"P50*$C50","v":0},null,{"$f":"R50*$C50","v":0},null,{"$f":"T50*$C50","v":0},null,{"$f":"V50*$C50","v":0},null,{"$f":"X50*$C50","v":0},null,{"$f":"Z50*$C50","v":0},null,{"$f":"+D50+F50+H50+J50+L50+N50+P50+R50+T50+V50+X50+Z50","v":1},{"$f":"+E50+G50+I50+K50+M50+O50+Q50+S50+U50+W50+Y50+AA50","v":5851.5},{"$f":"IF(C50=AD50,\"ok!\",\"incompleto\")","v":"ok!"}]
[10,"INSTALAÇÕES PROVISÓRIAS"]
["10.1","TAPUME EM CHAPA DE COMPENSADO RESINADO (L=7,70m; C=11,00m e H=2,20M)",{"$f":"PO!L69","v":7262.64},null,{"$f":"D52*$C52","v":0},1,{"$f":"F52*$C52","v":7262.64},null,{"$f":"H52*$C52","v":0},null,{"$f":"J52*$C52","v":0},null,{"$f":"L52*$C52","v":0},null,{"$f":"N52*$C52","v":0},null,{"$f":"P52*$C52","v":0},null,{"$f":"R52*$C52","v":0},null,{"$f":"T52*$C52","v":0},null,{"$f":"V52*$C52","v":0},null,{"$f":"X52*$C52","v":0},null,{"$f":"Z52*$C52","v":0},null,{"$f":"+D52+F52+H52+J52+L52+N52+P52+R52+T52+V52+X52+Z52","v":1},{"$f":"+E52+G52+I52+K52+M52+O52+Q52+S52+U52+W52+Y52+AA52","v":7262.64},{"$f":"IF(C52=AD52,\"ok!\",\"incompleto\")","v":"ok!"}]
["10.2","LOCAÇÃO DE BANHEIRO QUÍMICO",{"$f":"PO!L70","v":769},null,0,1,769,null,0,null,0,null,0,null,0,null,0,null,0,null,0,null,0,null,0,null,0,null,1,769,"ok!"]
["10.3","FRETE P/ BANHEIRO QUÍMICO LOCADO (IDA E VOLTA)",{"$f":"PO!L71","v":1085.48},null,0,1,1085.48,null,0,null,0,null,0,null,0,null,0,null,0,null,0,null,0,null,0,null,0,null,1,1085.48,"ok!"]
["10.4","INSTALAÇÃO PROVISÓRIA DE ENERGIA, AÉREA, BIFÁSICA, COM CAIXA DE EMBUTIR C/ POSTE H=9,00M",{"$f":"PO!L72","v":2979.99},null,0,1,2979.99,null,0,null,0,null,0,null,0,null,0,null,0,null,0,null,0,null,0,null,0,null,1,2979.99,"ok!"]
["10.5","INSTALAÇÃO PROVISÓRIA DE ÁGUA",{"$f":"PO!L73","v":897.15},null,0,1,897.15,null,0,null,0,null,0,null,0,null,0,null,0,null,0,null,0,null,0,null,0,null,1,897.15,"ok!"]
["10.6","PLACA DE OBRA",{"$f":"PO!L74","v":925.52},null,0,1,925.52,null,0,null,0,null,0,null,0,null,0,null,0,null,0,null,0,null,0,null,0,null,1,925.52,"ok!"]
["10.7","SINALIZAÇÃO COM TELA PLÁSTICA LARANJA FIXADA EM CONE PLÁSTICO",{"$f":"PO!L75","v":1690.96},null,0,1,1690.96,null,0,null,0,null,0,null,0,null,0,null,0,null,0,null,0,null,0,null,0,null,1,1690.96,"ok!"]
["10.8","LOCAÇÃO DE OBRA",{"$f":"PO!L76","v":40.42},null,0,1,40.42,null,0,null,0,null,0,null,0,null,0,null,0,null,0,null,0,null,0,null,0,null,1,40.42,"ok!"]
["10.9","NIVELAMENTO",{"$f":"PO!L77","v":50.31},null,0,1,50.31,null,0,null,0,null,0,null,0,null,0,null,0,null,0,null,0,null,0,null,0,null,1,50.31,"ok!"]
[11,"ADMINISTRAÇÃO LOCAL"]
["11.1","ADMINISTRAÇÃO LOCAL",{"$f":"PO!L80","v":24761.29},null,{"$f":"D62*$C62","v":0},1,{"$f":"F62*$C62","v":24761.29},null,{"$f":"H62*$C62","v":0},null,{"$f":"J62*$C62","v":0},null,{"$f":"L62*$C62","v":0},null,{"$f":"N62*$C62","v":0},null,{"$f":"P62*$C62","v":0},null,{"$f":"R62*$C62","v":0},null,{"$f":"T62*$C62","v":0},null,{"$f":"V62*$C62","v":0},null,{"$f":"X62*$C62","v":0},null,{"$f":"Z62*$C62","v":0},null,{"$f":"+D62+F62+H62+J62+L62+N62+P62+R62+T62+V62+X62+Z62","v":1},{"$f":"+E62+G62+I62+K62+M62+O62+Q62+S62+U62+W62+Y62+AA62","v":24761.29},{"$f":"IF(C62=AD62,\"ok!\",\"incompleto\")","v":"ok!"}]
[12,"MOVIMENTO DE TERRA"]
["12.1","MODELAGEM (MOVIMENTO DE TERRA ATÉ 15CM)",{"$f":"PO!L83","v":494.74},null,{"$f":"D64*$C64","v":0},1,{"$f":"F64*$C64","v":494.74},null,{"$f":"H64*$C64","v":0},null,{"$f":"J64*$C64","v":0},null,{"$f":"L64*$C64","v":0},null,{"$f":"N64*$C64","v":0},null,{"$f":"P64*$C64","v":0},null,{"$f":"R64*$C64","v":0},null,{"$f":"T64*$C64","v":0},null,{"$f":"V64*$C64","v":0},null,{"$f":"X64*$C64","v":0},null,{"$f":"Z64*$C64","v":0},null,{"$f":"+D64+F64+H64+J64+L64+N64+P64+R64+T64+V64+X64+Z64","v":1},{"$f":"+E64+G64+I64+K64+M64+O64+Q64+S64+U64+W64+Y64+AA64","v":494.74},{"$f":"IF(C64=AD64,\"ok!\",\"incompleto\")","v":"ok!"}]
["12.2","ATERRO MANUAL C/MATERIAL IMPORTADO C/COMPACTAÇÃO MANUAL",{"$f":"PO!L84","v":1032.67},null,0,1,1032.67,null,0,null,0,null,0,null,0,null,0,null,0,null,0,null,0,null,0,null,0,null,1,1032.67,"ok!"]
[13,"PAVIMENTAÇÃO"]
["13.1","REPOSIÇÃO DE SAIBRO ROSA - COMPACTAÇÃO MECÂNICA - E= 6 CM",{"$f":"PO!L87","v":877.03},null,{"$f":"D67*$C67","v":0},1,{"$f":"F67*$C67","v":877.03},null,{"$f":"H67*$C67","v":0},null,{"$f":"J67*$C67","v":0},null,{"$f":"L67*$C67","v":0},null,{"$f":"N67*$C67","v":0},null,{"$f":"P67*$C67","v":0},null,{"$f":"R67*$C67","v":0},null,{"$f":"T67*$C67","v":0},null,{"$f":"V67*$C67","v":0},null,{"$f":"X67*$C67","v":0},null,{"$f":"Z67*$C67","v":0},null,{"$f":"+D67+F67+H67+J67+L67+N67+P67+R67+T67+V67+X67+Z67","v":1},{"$f":"+E67+G67+I67+K67+M67+O67+Q67+S67+U67+W67+Y67+AA67","v":877.03},{"$f":"IF(C67=AD67,\"ok!\",\"incompleto\")","v":"ok!"}]
["13.2","PISO CONCRETO ARMADO E= 10 cm - ACADEMIA AO AR LIVRE",{"$f":"PO!L88","v":12424.91},null,0,1,12424.91,null,0,null,0,null,0,null,0,null,0,null,0,null,0,null,0,null,0,null,0,null,1,12424.91,"ok!"]
[14,"MOBILIÁRIO URBANO"]
["14.1","BANCO B (C/ ENCOSTO) - L=2,00 m - PADRÃO SMAM",{"$f":"PO!L91","v":1682.16},null,{"$f":"D70*$C70","v":0},1,{"$f":"F70*$C70","v":1682.16},null,{"$f":"H70*$C70","v":0},null,{"$f":"J70*$C70","v":0},null,{"$f":"L70*$C70","v":0},null,{"$f":"N70*$C70","v":0},null,{"$f":"P70*$C70","v":0},null,{"$f":"R70*$C70","v":0},null,{"$f":"T70*$C70","v":0},null,{"$f":"V70*$C70","v":0},null,{"$f":"X70*$C70","v":0},null,{"$f":"Z70*$C70","v":0},null,{"$f":"+D70+F70+H70+J70+L70+N70+P70+R70+T70+V70+X70+Z70","v":1},{"$f":"+E70+G70+I70+K70+M70+O70+Q70+S70+U70+W70+Y70+AA70","v":1682.16},{"$f":"IF(C70=AD70,\"ok!\",\"incompleto\")","v":"ok!"}]
["14.2","LIXEIRA METÁLICA - V=30 LITROS INSTALADA",{"$f":"PO!L92","v":1251.74},null,{"$f":"D71*$C71","v":0},1,{"$f":"F71*$C71","v":1251.74},null,{"$f":"H71*$C71","v":0},null,{"$f":"J71*$C71","v":0},null,{"$f":"L71*$C71","v":0},null,{"$f":"N71*$C71","v":0},null,{"$f":"P71*$C71","v":0},null,{"$f":"R71*$C71","v":0},null,{"$f":"T71*$C71","v":0},null,{"$f":"V71*$C71","v":0},null,{"$f":"X71*$C71","v":0},null,{"$f":"Z71*$C71","v":0},null,1,1251.74,{"$f":"IF(C71=AD71,\"ok!\",\"incompleto\")","v":"ok!"}]
[15,"ACADEMIA AO AR LIVRE"]
["15.1","PLACA ORIENTATIVA - GALVANIZADA",{"$f":"PO!L95","v":8910.19},null,{"$f":"D73*$C73","v":0},1,{"$f":"F73*$C73","v":8910.19},null,{"$f":"H73*$C73","v":0},null,{"$f":"J73*$C73","v":0},null,{"$f":"L73*$C73","v":0},null,{"$f":"N73*$C73","v":0},null,{"$f":"P73*$C73","v":0},null,{"$f":"R73*$C73","v":0},null,{"$f":"T73*$C73","v":0},null,{"$f":"V73*$C73","v":0},null,{"$f":"X73*$C73","v":0},null,{"$f":"Z73*$C73","v":0},null,{"$f":"+D73+F73+H73+J73+L73+N73+P73+R73+T73+V73+X73+Z73","v":1},{"$f":"+E73+G73+I73+K73+M73+O73+Q73+S73+U73+W73+Y73+AA73","v":8910.19},{"$f":"IF(C73=AD73,\"ok!\",\"incompleto\")","v":"ok!"}]
["15.2","SIMULADOR DE CAMINHADA TRIPLO CONJUGADO - GALVANIZADO",{"$f":"PO!L96","v":15065.84},null,0,1,15065.84,null,0,null,0,null,0,null,0,null,0,null,0,null,0,null,0,null,0,null,0,null,1,15065.84,"ok!"]
["15.3","ESQUI TRIPLO CONJUGADO - GALVANIZADO",{"$f":"PO!L97","v":18380.59},null,0,1,18380.59,null,0,null,0,null,0,null,0,null,0,null,0,null,0,null,0,null,0,null,0,null,1,18380.59,"ok!"]
["15.4","ADUÇÃO E ABDUÇÃO DE PERNAS DUPLO - GALVANIZADO",{"$f":"PO!L98","v":10491.68},null,0,1,10491.68,null,0,null,0,null,0,null,0,null,0,null,0,null,0,null,0,null,0,null,0,null,1,10491.68,"ok!"]
["15.5","PRESSÃO DE PERNAS TRIPLO CONJUGADO - GALVANIZADO",{"$f":"PO!L99","v":10857.79},null,0,1,10857.79,null,0,null,0,null,0,null,0,null,0,null,0,null,0,null,0,null,0,null,0,null,1,10857.79,"ok!"]
["15.6","SIMULADOR DE REMO - GALVANIZADO",{"$f":"PO!L100","v":6442.09},null,0,1,6442.09,null,0,null,0,null,0,null,0,null,0,null,0,null,0,null,0,null,0,null,0,null,1,6442.09,"ok!"]
["15.7","ABDOMINAL SIMPLES - GALVANIZADO",{"$f":"PO!L101","v":1777.22},null,0,1,1777.22,null,0,null,0,null,0,null,0,null,0,null,0,null,0,null,0,null,0,null,0,null,1,1777.22,"ok!"]
["15.8","VOADOR PEITORAL E VOADOR DORSAL - GALVANIZADO",{"$f":"PO!L102","v":7137.53},null,0,1,7137.53,null,0,null,0,null,0,null,0,null,0,null,0,null,0,null,0,null,0,null,0,null,1,7137.53,"ok!"]
[16,"PLANTIO"]
["16.1","CHAPISCO APLICADO EM ALVENARIA (SEM PRESENÇA DE VÃOS) E ESTRUTURAS DE CONCRETO DE FACHADA, COM EQUIPAMENTO DE PROJEÇÃO. ARGAMASSA TRAÇO 1:3 COM PREPARO EM BETONEIRA 400 L. AF_06/2014",{"$f":"PO!L105","v":50.88},null,{"$f":"D82*$C82","v":0},1,{"$f":"F82*$C82","v":50.88},null,{"$f":"H82*$C82","v":0},null,{"$f":"J82*$C82","v":0},null,{"$f":"L82*$C82","v":0},null,{"$f":"N82*$C82","v":0},null,{"$f":"P82*$C82","v":0},null,{"$f":"R82*$C82","v":0},null,{"$f":"T82*$C82","v":0},null,{"$f":"V82*$C82","v":0},null,{"$f":"X82*$C82","v":0},null,{"$f":"Z82*$C82","v":0},null,{"$f":"+D82+F82+H82+J82+L82+N82+P82+R82+T82+V82+X82+Z82","v":1},{"$f":"+E82+G82+I82+K82+M82+O82+Q82+S82+U82+W82+Y82+AA82","v":50.88},{"$f":"IF(C82=AD82,\"ok!\",\"incompleto\")","v":"ok!"}]
["16.2","EMBOÇO OU MASSA ÚNICA EM ARGAMASSA TRAÇO 1:2:8, PREPARO MANUAL, APLICADA MANUALMENTE EM PANOS CEGOS DE FACHADA (SEM PRESENÇA DE VÃOS), ESPESSURA DE 25 MM. AF_06/2014",{"$f":"PO!L106","v":359.69},null,0,1,359.69,null,0,null,0,null,0,null,0,null,0,null,0,null,0,null,0,null,0,null,0,null,1,359.69,"ok!"]
["16.3","APLICAÇÃO MANUAL DE PINTURA COM TINTA LÁTEX ACRÍLICA EM PAREDES, DUAS DEMÃOS. AF_06/2014",{"$f":"PO!L107","v":402.02},null,{"$f":"D84*$C84","v":0},1,{"$f":"F84*$C84","v":402.02},null,{"$f":"H84*$C84","v":0},null,{"$f":"J84*$C84","v":0},null,{"$f":"L84*$C84","v":0},null,{"$f":"N84*$C84","v":0},null,{"$f":"P84*$C84","v":0},null,{"$f":"R84*$C84","v":0},null,{"$f":"T84*$C84","v":0},null,{"$f":"V84*$C84","v":0},null,{"$f":"X84*$C84","v":0},null,{"$f":"Z84*$C84","v":0},null,{"$f":"+D84+F84+H84+J84+L84+N84+P84+R84+T84+V84+X84+Z84","v":1},{"$f":"+E84+G84+I84+K84+M84+O84+Q84+S84+U84+W84+Y84+AA84","v":402.02},{"$f":"IF(C84=AD84,\"ok!\",\"incompleto\")","v":"ok!"}]
[null,"PRAÇA SIMÕES LOPES NETO"]
[17,"SERVIÇOS PRELIMINARES"]
["17.1","REMOÇÃO DE PASSEIOS - SEM REMOÇÃO DE ENTULHOS",{"$f":"PO!L114","v":61.5},null,{"$f":"D87*$C87","v":0},null,{"$f":"F87*$C87","v":0},1,{"$f":"H87*$C87","v":61.5},null,{"$f":"J87*$C87","v":0},null,{"$f":"L87*$C87","v":0},null,{"$f":"N87*$C87","v":0},null,{"$f":"P87*$C87","v":0},null,{"$f":"R87*$C87","v":0},null,{"$f":"T87*$C87","v":0},null,{"$f":"V87*$C87","v":0},null,{"$f":"X87*$C87","v":0},null,{"$f":"Z87*$C87","v":0},null,{"$f":"+D87+F87+H87+J87+L87+N87+P87+R87+T87+V87+X87+Z87","v":1},{"$f":"+E87+G87+I87+K87+M87+O87+Q87+S87+U87+W87+Y87+AA87","v":61.5},{"$f":"IF(C87=AD87,\"ok!\",\"incompleto\")","v":"ok!"}]
["17.2","REMOÇÃO DE ENTULHOS COM CAÇAMBA 4M³",{"$f":"PO!L115","v":744},null,0,null,{"$f":"F88*$C88","v":0},1,744,null,{"$f":"J88*$C88","v":0},null,{"$f":"L88*$C88","v":0},null,{"$f":"N88*$C88","v":0},null,{"$f":"P88*$C88","v":0},null,{"$f":"R88*$C88","v":0},null,{"$f":"T88*$C88","v":0},null,{"$f":"V88*$C88","v":0},null,{"$f":"X88*$C88","v":0},null,{"$f":"Z88*$C88","v":0},null,1,744,{"$f":"IF(C88=AD88,\"ok!\",\"incompleto\")","v":"ok!"}]
[18,"INSTALAÇÕES PROVISÓRIAS"]
["18.1","TAPUME EM CHAPA DE COMPENSADO RESINADO (L=7,70m; C=11,00m e H=2,20M)",{"$f":"PO!L118","v":7262.64},null,{"$f":"D90*$C90","v":0},null,{"$f":"F90*$C90","v":0},1,{"$f":"H90*$C90","v":7262.64},null,{"$f":"J90*$C90","v":0},null,{"$f":"L90*$C90","v":0},null,{"$f":"N90*$C90","v":0},null,{"$f":"P90*$C90","v":0},null,{"$f":"R90*$C90","v":0},null,{"$f":"T90*$C90","v":0},null,{"$f":"V90*$C90","v":0},null,{"$f":"X90*$C90","v":0},null,{"$f":"Z90*$C90","v":0},null,{"$f":"+D90+F90+H90+J90+L90+N90+P90+R90+T90+V90+X90+Z90","v":1},{"$f":"+E90+G90+I90+K90+M90+O90+Q90+S90+U90+W90+Y90+AA90","v":7262.64},{"$f":"IF(C90=AD90,\"ok!\",\"incompleto\")","v":"ok!"}]
["18.2","LOCAÇÃO DE BANHEIRO QUÍMICO",{"$f":"PO!L119","v":830.62},null,{"$f":"D91*$C91","v":0},null,{"$f":"F91*$C91","v":0},1,{"$f":"H91*$C91","v":830.62},null,0,null,0,null,0,null,0,null,0,null,0,null,0,null,0,null,0,null,1,830.62,"ok!"]
["18.3","FRETE P/ BANHEIRO QUÍMICO LOCADO (IDA E VOLTA)",{"$f":"PO!L120","v":1085.48},null,0,null,0,1,1085.48,null,0,null,0,null,0,null,0,null,0,null,0,null,0,null,0,null,0,null,1,1085.48,"ok!"]
["18.4","INSTALAÇÃO PROVISÓRIA DE ENERGIA, AÉREA, BIFÁSICA, COM CAIXA DE EMBUTIR C/ POSTE H=9,00M",{"$f":"PO!L121","v":2979.99},null,0,null,0,1,2979.99,null,0,null,0,null,0,null,0,null,0,null,0,null,0,null,0,null,0,null,1,2979.99,"ok!"]
["18.5","INSTALAÇÃO PROVISÓRIA DE ÁGUA",{"$f":"PO!L122","v":897.15},null,0,null,0,1,897.15,null,0,null,0,null,0,null,0,null,0,null,0,null,0,null,0,null,0,null,1,897.15,"ok!"]
["18.6","PLACA DE OBRA",{"$f":"PO!L123","v":925.52},null,0,null,0,1,925.52,null,0,null,0,null,0,null,0,null,0,null,0,null,0,null,0,null,0,null,1,925.52,"ok!"]
["18.7","SINALIZAÇÃO COM TELA PLÁSTICA LARANJA FIXADA EM CONE PLÁSTICO",{"$f":"PO!L124","v":787.29},null,0,null,0,1,787.29,null,0,null,0,null,0,null,0,null,0,null,0,null,0,null,0,null,0,null,1,787.29,"ok!"]
["18.8","LOCAÇÃO DE OBRA",{"$f":"PO!L125","v":18.600000000000001},null,0,null,0,1,18.600000000000001,null,0,null,0,null,0,null,0,null,0,null,0,null,0,null,0,null,0,null,1,18.600000000000001,"ok!"]
["18.9","NIVELAMENTO",{"$f":"PO!L126","v":21.3},null,0,null,0,1,21.3,null,0,null,0,null,0,null,0,null,0,null,0,null,0,null,0,null,0,null,1,21.3,"ok!"]
[19,"ADMINISTRAÇÃO LOCAL"]
["19.1","ADMINISTRAÇÃO LOCAL SIMÕES LOPES NETO",{"$f":"PO!L129","v":24617.4},null,{"$f":"D100*$C100","v":0},null,{"$f":"F100*$C100","v":0},1,{"$f":"H100*$C100","v":24617.4},null,{"$f":"J100*$C100","v":0},null,{"$f":"L100*$C100","v":0},null,{"$f":"N100*$C100","v":0},null,{"$f":"P100*$C100","v":0},null,{"$f":"R100*$C100","v":0},null,{"$f":"T100*$C100","v":0},null,{"$f":"V100*$C100","v":0},null,{"$f":"X100*$C100","v":0},null,{"$f":"Z100*$C100","v":0},null,{"$f":"+D100+F100+H100+J100+L100+N100+P100+R100+T100+V100+X100+Z100","v":1},{"$f":"+E100+G100+I100+K100+M100+O100+Q100+S100+U100+W100+Y100+AA100","v":24617.4},{"$f":"IF(C100=AD100,\"ok!\",\"incompleto\")","v":"ok!"}]
[20,"MOVIMENTO DE TERRA"]
["20.1","MODELAGEM (MOVIMENTO DE TERRA ATÉ 15CM)",{"$f":"PO!L132","v":209.45},null,{"$f":"D102*$C102","v":0},null,{"$f":"F102*$C102","v":0},1,{"$f":"H102*$C102","v":209.45},null,{"$f":"J102*$C102","v":0},null,{"$f":"L102*$C102","v":0},null,{"$f":"N102*$C102","v":0},null,{"$f":"P102*$C102","v":0},null,{"$f":"R102*$C102","v":0},null,{"$f":"T102*$C102","v":0},null,{"$f":"V102*$C102","v":0},null,{"$f":"X102*$C102","v":0},null,{"$f":"Z102*$C102","v":0},null,{"$f":"+D102+F102+H102+J102+L102+N102+P102+R102+T102+V102+X102+Z102","v":1},{"$f":"+E102+G102+I102+K102+M102+O102+Q102+S102+U102+W102+Y102+AA102","v":209.45},{"$f":"IF(C102=AD102,\"ok!\",\"incompleto\")","v":"ok!"}]
[21,"PAVIMENTAÇÃO"]
["21.2","PISO CONCRETO ARMADO E= 10 cm - ACADEMIA AO AR LIVRE",{"$f":"PO!L135","v":5915.5},null,{"$f":"D104*$C104","v":0},null,{"$f":"F104*$C104","v":0},1,{"$f":"H104*$C104","v":5915.5},null,{"$f":"J104*$C104","v":0},null,{"$f":"L104*$C104","v":0},null,{"$f":"N104*$C104","v":0},null,{"$f":"P104*$C104","v":0},null,{"$f":"R104*$C104","v":0},null,{"$f":"T104*$C104","v":0},null,{"$f":"V104*$C104","v":0},null,{"$f":"X104*$C104","v":0},null,{"$f":"Z104*$C104","v":0},null,{"$f":"+D104+F104+H104+J104+L104+N104+P104+R104+T104+V104+X104+Z104","v":1},{"$f":"+E104+G104+I104+K104+M104+O104+Q104+S104+U104+W104+Y104+AA104","v":5915.5},{"$f":"IF(C104=AD104,\"ok!\",\"incompleto\")","v":"ok!"}]
[22,"MOBILIÁRIO URBANO"]
["22.1","BANCO B (C/ ENCOSTO) - L=2,00 m - PADRÃO SMAM",{"$f":"PO!L138","v":1682.16},null,{"$f":"D106*$C106","v":0},null,{"$f":"F106*$C106","v":0},1,{"$f":"H106*$C106","v":1682.16},null,{"$f":"J106*$C106","v":0},null,{"$f":"L106*$C106","v":0},null,{"$f":"N106*$C106","v":0},null,{"$f":"P106*$C106","v":0},null,{"$f":"R106*$C106","v":0},null,{"$f":"T106*$C106","v":0},null,{"$f":"V106*$C106","v":0},null,{"$f":"X106*$C106","v":0},null,{"$f":"Z106*$C106","v":0},null,{"$f":"+D106+F106+H106+J106+L106+N106+P106+R106+T106+V106+X106+Z106","v":1},{"$f":"+E106+G106+I106+K106+M106+O106+Q106+S106+U106+W106+Y106+AA106","v":1682.16},{"$f":"IF(C106=AD106,\"ok!\",\"incompleto\")","v":"ok!"}]
["22.2","INSTALAÇÃO DE BANCO S/ENCOSTO TIPO A (EXISTENTE)",{"$f":"PO!L139","v":119.41},null,{"$f":"D107*$C107","v":0},null,{"$f":"F107*$C107","v":0},1,{"$f":"H107*$C107","v":119.41},null,{"$f":"J107*$C107","v":0},null,{"$f":"L107*$C107","v":0},null,{"$f":"N107*$C107","v":0},null,{"$f":"P107*$C107","v":0},null,{"$f":"R107*$C107","v":0},null,{"$f":"T107*$C107","v":0},null,{"$f":"V107*$C107","v":0},null,{"$f":"X107*$C107","v":0},null,{"$f":"Z107*$C107","v":0},null,{"$f":"+D107+F107+H107+J107+L107+N107+P107+R107+T107+V107+X107+Z107","v":1},{"$f":"+E107+G107+I107+K107+M107+O107+Q107+S107+U107+W107+Y107+AA107","v":119.41},{"$f":"IF(C107=AD107,\"ok!\",\"incompleto\")","v":"ok!"}]
["22.3","LIXEIRA METÁLICA - V=30 LITROS INSTALADA",{"$f":"PO!L140","v":1251.74},null,{"$f":"D108*$C108","v":0},null,{"$f":"F108*$C108","v":0},1,{"$f":"H108*$C108","v":1251.74},null,{"$f":"J108*$C108","v":0},null,{"$f":"L108*$C108","v":0},null,{"$f":"N108*$C108","v":0},null,{"$f":"P108*$C108","v":0},null,{"$f":"R108*$C108","v":0},null,{"$f":"T108*$C108","v":0},null,{"$f":"V108*$C108","v":0},null,{"$f":"X108*$C108","v":0},null,{"$f":"Z108*$C108","v":0},null,1,1251.74,{"$f":"IF(C108=AD108,\"ok!\",\"incompleto\")","v":"ok!"}]
[23,"ACADEMIA AO AR LIVRE"]
["23.1","PLACA ORIENTATIVA - GALVANIZADA",{"$f":"PO!L143","v":8910.19},null,{"$f":"D110*$C110","v":0},null,{"$f":"F110*$C110","v":0},1,{"$f":"H110*$C110","v":8910.19},null,{"$f":"J110*$C110","v":0},null,{"$f":"L110*$C110","v":0},null,{"$f":"N110*$C110","v":0},null,{"$f":"P110*$C110","v":0},null,{"$f":"R110*$C110","v":0},null,{"$f":"T110*$C110","v":0},null,{"$f":"V110*$C110","v":0},null,{"$f":"X110*$C110","v":0},null,{"$f":"Z110*$C110","v":0},null,{"$f":"+D110+F110+H110+J110+L110+N110+P110+R110+T110+V110+X110+Z110","v":1},{"$f":"+E110+G110+I110+K110+M110+O110+Q110+S110+U110+W110+Y110+AA110","v":8910.19},{"$f":"IF(C110=AD110,\"ok!\",\"incompleto\")","v":"ok!"}]
["23.2","SIMULADOR DE CAMINHADA TRIPLO CONJUGADO - GALVANIZADO",{"$f":"PO!L144","v":15065.84},null,0,null,0,1,15065.84,null,0,null,0,null,0,null,0,null,0,null,0,null,0,null,0,null,0,null,1,15065.84,"ok!"]
["23.3","ADUÇÃO E ABDUÇÃO DE PERNAS DUPLO - GALVANIZADO",{"$f":"PO!L145","v":10491.68},null,0,null,0,1,10491.68,null,0,null,0,null,0,null,0,null,0,null,0,null,0,null,0,null,0,null,1,10491.68,"ok!"]
["23.4","ESPALDAR - EQUIPAMENTO PADRÃO SMAMS",{"$f":"PO!L146","v":2735.72},null,0,null,0,1,2735.72,null,0,null,0,null,0,null,0,null,0,null,0,null,0,null,0,null,0,null,1,2735.72,"ok!"]
["23.5","SIMULADOR DE REMO - GALVANIZADO",{"$f":"PO!L147","v":6442.09},null,0,null,0,1,6442.09,null,0,null,0,null,0,null,0,null,0,null,0,null,0,null,0,null,0,null,1,6442.09,"ok!"]
["23.6","REMADA ESPECIAL PPNE - GALVANIZADA",{"$f":"PO!L148","v":6776.86},null,{"$f":"D115*$C115","v":0},null,{"$f":"F115*$C115","v":0},1,{"$f":"H115*$C115","v":6776.86},null,{"$f":"J115*$C115","v":0},null,{"$f":"L115*$C115","v":0},null,{"$f":"N115*$C115","v":0},null,{"$f":"P115*$C115","v":0},null,{"$f":"R115*$C115","v":0},null,{"$f":"T115*$C115","v":0},null,{"$f":"V115*$C115","v":0},null,{"$f":"X115*$C115","v":0},null,{"$f":"Z115*$C115","v":0},null,{"$f":"+D115+F115+H115+J115+L115+N115+P115+R115+T115+V115+X115+Z115","v":1},{"$f":"+E115+G115+I115+K115+M115+O115+Q115+S115+U115+W115+Y115+AA115","v":6776.86},{"$f":"IF(C115=AD115,\"ok!\",\"incompleto\")","v":"ok!"}]
[24,"PLANTIO"]
["24.1","PLANTIO DE GRAMA CATARINA (SÃO MARCOS) COM COMPOSTO ORGÂNICO",{"$f":"PO!L151","v":715.26},null,{"$f":"D117*$C117","v":0},null,{"$f":"F117*$C117","v":0},1,{"$f":"H117*$C117","v":715.26},null,{"$f":"J117*$C117","v":0},null,{"$f":"L117*$C117","v":0},null,{"$f":"N117*$C117","v":0},null,{"$f":"P117*$C117","v":0},null,{"$f":"R117*$C117","v":0},null,{"$f":"T117*$C117","v":0},null,{"$f":"V117*$C117","v":0},null,{"$f":"X117*$C117","v":0},null,{"$f":"Z117*$C117","v":0},null,{"$f":"+D117+F117+H117+J117+L117+N117+P117+R117+T117+V117+X117+Z117","v":1},{"$f":"+E117+G117+I117+K117+M117+O117+Q117+S117+U117+W117+Y117+AA117","v":715.26},{"$f":"IF(C117=AD117,\"ok!\",\"incompleto\")","v":"ok!"}]
[]
["TOTAL PARCIAL",null,{"$f":"SUM(C11:C117)","v":376995.68},{"$f":"E119/C119","v":0.35067558333824939},{"$f":"SUM(E11:E117)","v":132203.18},{"$f":"G119/C119","v":0.38261740824191937},{"$f":"SUM(G11:G117)","v":144245.10999999999},{"$f":"I119/C119","v":0.26670700841983119},{"$f":"SUM(I11:I117)","v":100547.38999999998},{"$f":"K119/#REF!","v":{"$error":"#REF!"}},{"$f":"SUM(K88:K117)","v":0},{"$f":"M119/#REF!","v":{"$error":"#REF!"}},{"$f":"SUM(M88:M117)","v":0},{"$f":"O119/#REF!","v":{"$error":"#REF!"}},{"$f":"SUM(O88:O117)","v":0},{"$f":"Q119/#REF!","v":{"$error":"#REF!"}},{"$f":"SUM(Q88:Q117)","v":0},{"$f":"S119/#REF!","v":{"$error":"#REF!"}},{"$f":"SUM(S88:S117)","v":0},{"$f":"U119/#REF!","v":{"$error":"#REF!"}},{"$f":"SUM(U88:U117)","v":0},{"$f":"W119/#REF!","v":{"$error":"#REF!"}},{"$f":"SUM(W88:W117)","v":0},{"$f":"Y119/#REF!","v":{"$error":"#REF!"}},{"$f":"SUM(Y88:Y117)","v":0},{"$f":"AA119/#REF!","v":{"$error":"#REF!"}},{"$f":"SUM(AA88:AA117)","v":0},null,{"$f":"D119+F119+H119","v":0.99999999999999989},{"$f":"SUM(AD11:AD117)","v":376995.68},{"$f":"IF(C119=AD119,\"ok!\",\"incompleto\")","v":"ok!"}]
["TOTAL ACUMULADO",null,null,{"$f":"E120/C119","v":0.35067558333824939},{"$f":"E119","v":132203.18},{"$f":"G120/C119","v":0.7332929915801687},{"$f":"G119+E120","v":276448.28999999998},{"$f":"H119+F120","v":0.99999999999999989},{"$f":"I119+G120","v":376995.67999999993},{"$f":"K120/#REF!","v":{"$error":"#REF!"}},{"$f":"K119+I120","v":376995.67999999993},{"$f":"M120/#REF!","v":{"$error":"#REF!"}},{"$f":"M119+K120","v":376995.67999999993},{"$f":"O120/#REF!","v":{"$error":"#REF!"}},{"$f":"O119+M120","v":376995.67999999993},{"$f":"Q120/#REF!","v":{"$error":"#REF!"}},{"$f":"Q119+O120","v":376995.67999999993},{"$f":"S120/#REF!","v":{"$error":"#REF!"}},{"$f":"S119+Q120","v":376995.67999999993},{"$f":"U120/#REF!","v":{"$error":"#REF!"}},{"$f":"U119+S120","v":376995.67999999993},{"$f":"W120/#REF!","v":{"$error":"#REF!"}},{"$f":"W119+U120","v":376995.67999999993},{"$f":"Y120/#REF!","v":{"$error":"#REF!"}},{"$f":"Y119+W120","v":376995.67999999993},{"$f":"AA120/#REF!","v":{"$error":"#REF!"}},{"$f":"AA119+Y120","v":376995.67999999993}]

{"sheet":"Composições","index":2,"n_rows":864,"n_cols":8,"rows_kept":864,"cut":false,"hidden":false,"merged":[[235,2,235,5],[217,3,217,5],[31,0,31,1],[31,2,31,5],[34,0,34,1],[34,2,34,5],[475,3,475,5],[478,0,478,1],[478,2,478,5],[192,0,192,1],[192,2,192,5],[219,0,219,1],[247,2,247,5],[257,0,257,5],[219,2,219,5],[228,3,228,5],[231,0,231,1],[250,0,250,1],[231,2,231,5],[235,0,235,1],[114,3,114,5],[67,2,67,5],[65,3,65,5],[187,0,187,1],[298,2,298,5],[308,3,308,5],[311,0,311,1],[311,2,311,5],[738,0,738,1],[741,0,741,1],[738,2,738,5],[267,0,267,1],[267,2,267,5],[481,0,481,1],[481,2,481,5],[741,2,741,5],[685,2,685,5],[685,0,685,1],[719,0,719,1],[688,2,688,5],[706,2,706,5],[636,2,636,5],[667,0,667,1],[683,0,683,1],[722,2,722,5],[688,0,688,1],[736,2,736,5],[736,0,736,1],[790,0,790,1],[790,2,790,5],[793,0,793,1],[187,2,187,5],[67,0,67,1],[179,3,179,5],[77,3,77,5],[86,0,86,1],[116,0,116,1],[116,2,116,5],[147,0,147,1],[147,2,147,5],[150,0,150,1],[150,2,150,5],[161,3,161,5],[169,0,169,1],[169,2,169,5],[125,3,125,5],[91,0,91,1],[103,0,103,1],[793,2,793,5],[202,3,202,5],[205,0,205,1],[205,2,205,5],[849,3,849,5],[854,0,854,1],[854,2,854,5],[857,0,857,1],[857,2,857,5],[806,2,806,5],[809,0,809,1],[824,0,824,1],[806,0,806,1],[824,2,824,5],[821,0,821,1],[821,2,821,5],[809,2,809,5],[837,2,837,5],[832,0,832,5],[840,0,840,1],[840,2,840,5],[834,3,834,5],[837,0,837,1],[613,7,617,11],[499,2,499,5],[683,2,683,5],[670,2,670,5],[465,0,465,1],[611,7,612,11],[610,0,610,5],[509,3,509,5],[518,0,518,1],[518,2,518,5],[522,0,522,1],[522,2,522,5],[555,3,555,5],[569,0,569,1],[569,2,569,5],[574,0,574,1],[574,2,574,5],[652,2,652,5],[617,2,617,5],[634,0,634,1],[634,2,634,5],[636,0,636,1],[617,0,617,1],[499,0,499,1],[754,2,754,5],[775,0,775,1],[772,0,772,1],[772,2,772,5],[770,2,770,5],[757,2,757,5],[775,2,775,5],[754,0,754,1],[757,0,757,1],[770,0,770,1],[722,0,722,1],[0,0,0,5],[52,0,52,1],[55,0,55,1],[2,0,2,5],[55,2,55,5],[52,2,52,5],[45,3,45,5],[3,0,3,5],[1,0,1,5],[14,2,14,5],[12,0,12,1],[14,0,14,1],[409,0,409,1],[409,2,409,5],[428,0,428,1],[428,2,428,5],[339,2,339,5],[250,2,250,5],[259,3,259,5],[208,0,208,1],[208,2,208,5],[296,3,296,5],[298,0,298,1],[3,9,3,11],[103,2,103,5],[101,3,101,5],[4,2,4,4],[5,2,5,4],[10,3,10,5],[12,2,12,5],[6,2,6,4],[7,2,7,4],[86,2,86,5],[91,2,91,5],[24,3,24,5],[670,0,670,1],[532,3,532,5],[541,0,541,1],[496,2,496,5],[706,0,706,1],[719,2,719,5],[703,0,703,1],[374,0,374,1],[388,3,388,5],[620,0,620,1],[701,2,701,5],[615,0,615,1],[438,3,438,5],[436,0,436,5],[496,0,496,1],[703,2,703,5],[667,2,667,5],[655,2,655,5],[639,0,639,1],[639,2,639,5],[655,0,655,1],[652,0,652,1],[701,0,701,1],[615,2,615,5],[341,2,341,5],[419,3,419,5],[359,2,359,5],[620,2,620,5],[541,2,541,5],[545,0,545,1],[545,2,545,5],[425,0,425,1],[603,0,603,1],[598,0,598,1],[458,0,458,1],[492,3,492,5],[465,2,465,5],[458,2,458,5],[584,3,584,5],[598,2,598,5],[603,2,603,5],[244,3,244,5],[247,0,247,1],[425,2,425,5],[374,2,374,5],[378,0,378,1],[321,3,321,5],[324,0,324,1],[324,2,324,5],[327,0,327,1],[327,2,327,5],[368,3,368,5],[339,0,339,1],[277,3,277,5],[285,0,285,1],[285,2,285,5],[341,0,341,1],[351,3,351,5],[357,0,357,1],[357,2,357,5],[359,0,359,1],[337,3,337,5],[403,0,403,1],[378,2,378,5],[403,2,403,5]]}
["PLANILHA COMPOSIÇÕES SMAMUS"]
[]
["Data Base SINAPI: JUNHO / 2021 - Data da Cotaçãoes: Julho / 2021"]
[]
["OBJETO:",{"$f":"+PO!$B$9","v":"Obras de Aquisição e Instalação de Academias de Ginástica ao ar livre na Praça Grêmio Futebol Portoalegrense (110/03), Praça Guia Lopes (118/08) e Praça Simões Lopes Neto (125/06)"},"Leis Sociais Horistas (SINAPI):",null,null,{"$f":"+Planilha_M.O.!$D$7","v":1.111}]
["DATA:",{"$f":"IF(PO!$B$10=\"\",\"\",PO!$B$10)","v":"2021-09-14"},"Leis Sociais Mensalistas (SINAPI):",null,null,{"$f":"+Planilha_M.O.!$D$8","v":0.69159999999999999}]
["ART nº:",{"$f":"IF(PO!$B$11=\"\",\"\",PO!$B$11)","v":""},"BDI:",null,null,{"$f":"+Planilha_M.O.!$F$7","v":"22,15%"}]
[null,null,"BDI diferenciado Academia ar livre:",null,null,{"$f":"IF($F$7=\"28,21%\",19.35%,13.7%)","v":0.13699999999999998}]
[]
["CÓDIGO","DISCRIMINAÇÃO","UN","COEFIC.","UNITÁRIO","TOTAL"]
[390,"REMOÇÃO DE ENTULHO C/CAÇAMBA","m³"]
["COTAÇÃO 113","CAÇAMBA V=4,0M³","m³",0.25,{"$f":"Insumos!G66","v":443.33},{"$f":"TRUNC(D12*E12,2)","v":110.83}]
["SUB-TOTAL - MATERIAL / EQUIPAMENTOS:",null,{"$f":"SUM(F12:F12)","v":110.83}]
["SINAPI C 88316","SERVENTE C/ENCARGOS COMPLEMENTARES","h",0.7,{"$f":"Planilha_M.O.!E18","v":17.11},{"$f":"TRUNC(D14*E14,2)","v":11.97}]
["SUB-TOTAL - MÃO-DE-OBRA:",null,{"$f":"SUM(F14:F14)","v":11.97}]
[]
[null,"CUSTO TOTAL:",null,null,null,{"$f":"+C13+C15","v":122.8}]
[]
[null,"BDI:","%",{"$f":"+$F$7","v":"22,15%"},null,{"$f":"TRUNC(F17*D19,2)","v":27.2}]
[]
[null,"PREÇO:",null,null,null,{"$f":"+F17+F19","v":150}]
[]
[]
["CÓDIGO","DISCRIMINAÇÃO","UN","COEFIC.","UNITÁRIO","TOTAL"]
[101,"REMOÇÃO BANCO S/ENCOSTO","un"]
[{"$f":"CONCATENATE(\"SINAPI C \",'[3]Composições Aux. SINAPI'!$A$56,)","v":"SINAPI C 5795"},"MARTELETE OU ROMPEDOR PNEUMÁTICO MANUAL, 28 KG, COM SILENCIADOR (chp)","chp",0.112,{"$f":"'Composições Aux. SINAPI'!E59:F59","v":26.44},{"$f":"TRUNC(D26*E26,2)","v":2.96}]
[{"$f":"CONCATENATE(\"SINAPI C \",'[3]Composições Aux. SINAPI'!$A$57,)","v":"SINAPI C 5952"},"MARTELETE OU ROMPEDOR PNEUMÁTICO MANUAL, 28 KG, COM SILENCIADOR (chi)","chi",3.1699999999999999E-2,{"$f":"'Composições Aux. SINAPI'!E60:F60","v":24.44},0.77]
[{"$f":"CONCATENATE(\"SINAPI C \",'[3]Composições Aux. SINAPI'!$A$28,)","v":"SINAPI C 5953"},"COMPRESSOR DE AR REBOCÁVEL, VAZÃO 189 PCM, MOTOR DIESEL, POTÊNCIA 63 CV (chp)","chp",0.112,{"$f":"'Composições Aux. SINAPI'!E34:F34","v":41.39},4.63]
[{"$f":"CONCATENATE(\"SINAPI C \",'[3]Composições Aux. SINAPI'!$A$29,)","v":"SINAPI C 5954"},"COMPRESSOR DE AR REBOCÁVEL, VAZÃO 189 PCM, MOTOR DIESEL, POTÊNCIA 63 CV (chi)","chi",3.1699999999999999E-2,{"$f":"'Composições Aux. SINAPI'!E35:F35","v":3.73},0.11]
["COTAÇÃO 113","CAÇAMBA 4,00 m³","un",2.3400000000000001E-2,{"$f":"Insumos!G66","v":443.33},10.37]
[{"$f":"CONCATENATE(\"SINAPI I \",[3]Insumos!$B$87)","v":"SINAPI I 6081"},"ARGILA OU BARRO PARA ATERRO OU REATERRO","m³",0.09,{"$f":"Insumos!G35","v":31.59},2.84]
["SUB-TOTAL - MATERIAL / EQUIPAMENTOS:",null,{"$f":"SUM(F26:F31)","v":21.679999999999996}]
["SINAPI C 88309","PEDREIRO C/ENCARGOS COMPLEMENTARES","h",2.1999999999999999E-2,{"$f":"Planilha_M.O.!E24","v":20.71},{"$f":"TRUNC(D33*E33,2)","v":0.45}]
["SINAPI C 88316","SERVENTE C/ ENCARGOS COMPLEMENTARES","h",1.6496999999999999,{"$f":"Planilha_M.O.!E18","v":17.11},{"$f":"TRUNC(D34*E34,2)","v":28.22}]
["SUB-TOTAL - MÃO-DE-OBRA:",null,{"$f":"SUM(F33:F34)","v":28.669999999999998}]
[]
[null,"CUSTO TOTAL:",null,null,null,{"$f":"+C32+C35","v":50.349999999999994}]
[]
[null,"BDI:","%",{"$f":"+$F$7","v":"22,15%"},null,{"$f":"TRUNC(F37*D39,2)","v":11.15}]
[]
[null,"PREÇO:",null,null,null,{"$f":"+F37+F39","v":61.499999999999993}]
[]
[]
[]
["CÓDIGO","DISCRIMINAÇÃO","UN","COEFIC.","UNITÁRIO","TOTAL"]
[122,"DEMOLIÇÃO DE MURETAS E CANTEIRO","m"]
[{"$f":"CONCATENATE(\"COTAÇÃO \",Insumos!$B$66)","v":"COTAÇÃO 113"},"CAÇAMBA 4,00 m³","un",0.04,{"$f":"+Insumos!$G$66","v":443.33},{"$f":"TRUNC(D47*E47,2)","v":17.73}]
[{"$f":"CONCATENATE(\"SINAPI C \",'Composições Aux. SINAPI'!$A$59,)","v":"SINAPI C 5795"},"MARTELETE OU ROMPEDOR PNEUMÁTICO MANUAL, 28 KG, COM SILENCIADOR (chp)","chp",2.52E-2,{"$f":"+'Composições Aux. SINAPI'!$E$59:$F$59","v":26.44},{"$f":"TRUNC(D48*E48,2)","v":0.66}]
[{"$f":"CONCATENATE(\"SINAPI C \",'Composições Aux. SINAPI'!$A$60,)","v":"SINAPI C 5952"},"MARTELETE OU ROMPEDOR PNEUMÁTICO MANUAL, 28 KG, COM SILENCIADOR (chi)","chi",2.52E-2,{"$f":"+'Composições Aux. SINAPI'!$E$60:$F$60","v":24.44},0.61]
[{"$f":"CONCATENATE(\"SINAPI C \",'Composições Aux. SINAPI'!$A$34,)","v":"SINAPI C 5953"},"COMPRESSOR DE AR REBOCÁVEL, VAZÃO 189 PCM, MOTOR DIESEL, POTÊNCIA 63 CV (chp)","chp",2.52E-2,{"$f":"+'Composições Aux. SINAPI'!$E$34:$F$34","v":41.39},1.04]
[{"$f":"CONCATENATE(\"SINAPI C \",'Composições Aux. SINAPI'!$A$35,)","v":"SINAPI C 5954"},"COMPRESSOR DE AR REBOCÁVEL, VAZÃO 189 PCM, MOTOR DIESEL, POTÊNCIA 63 CV (chi)","chi",2.52E-2,{"$f":"+'Composições Aux. SINAPI'!$E$35:$F$35","v":3.73},0.09]
[{"$f":"CONCATENATE(\"SINAPI I \",Insumos!$B$35)","v":"SINAPI I 6081"},"ARGILA OU BARRO PARA ATERRO OU REATERRO","m³",8.5500000000000007E-2,{"$f":"+Insumos!$G$35","v":31.59},{"$f":"TRUNC(D52*E52,2)","v":2.7}]
["SUB-TOTAL - MATERIAL / EQUIPAMENTOS:",null,{"$f":"SUM(F47:F52)","v":22.83}]
["SINAPI C 88309","PEDREIRO C/ENCARGOS COMPLEMENTARES","h",0.01,{"$f":"Planilha_M.O.!E24","v":20.71},{"$f":"TRUNC(D54*E54,2)","v":0.2}]
["SINAPI C 88316","SERVENTE C/ ENCARGOS COMPLEMENTARES","h",0.01,{"$f":"Planilha_M.O.!E18","v":17.11},{"$f":"TRUNC(D55*E55,2)","v":0.17}]
["SUB-TOTAL - MÃO-DE-OBRA:",null,{"$f":"SUM(F54:F55)","v":0.37}]
[]
[null,"CUSTO TOTAL:",null,null,null,{"$f":"+C53+C56","v":23.2}]
[]
[null,"BDI:","%",{"$f":"+$F$7","v":"22,15%"},null,{"$f":"TRUNC(F58*D60,2)","v":5.13}]
[]
[null,"PREÇO:",null,null,null,{"$f":"+F58+F60","v":28.33}]
[]
[]
["CÓDIGO","DISCRIMINAÇÃO","UN","COEFIC.","UNITÁRIO","TOTAL"]
[450,"ART - ANOTAÇÃO DE RESPONSABILIDADE TÉCNICA PELA EXECUÇÃO","un"]
[{"$f":"CONCATENATE(\"COTAÇÃO \",Insumos!$B$38)","v":"COTAÇÃO 128"},"ART","un",1,{"$f":"+Insumos!$G$38","v":226},{"$f":"TRUNC(D67*E67,2)","v":226}]
["SUB-TOTAL - MATERIAL / EQUIPAMENTOS:",null,{"$f":"SUM(F67)","v":226}]
[]
[null,"CUSTO TOTAL:",null,null,null,{"$f":"+C68","v":226}]
[]
[null,"BDI:","%",{"$f":"+$F$7","v":"22,15%"},null,{"$f":"TRUNC(F70*D72,2)","v":50.05}]
[]
[null,"PREÇO:",null,null,null,{"$f":"+F70+F72","v":276.05}]
[]
[]
["CÓDIGO","DISCRIMINAÇÃO","UN","COEFIC.","UNITÁRIO","TOTAL"]
[500,"TAPUME EM CHAPA DE COMPENSADO RESINADO","m²"]
["SINAPI I 002745","PONTALETE ROLIÇO S/TRATAMENTO EUCALIPTO D=8 A 11 cm","m",0.26219999999999999,{"$f":"Insumos!G159","v":3.39},{"$f":"TRUNC(D79*E79,2)","v":0.88}]
["SINAPI I 004460","SARRAFO DE MADEIRA NÃO APARELHADA 2,5 x 10 cm","m",0.70799999999999996,{"$f":"Insumos!G179","v":7.48},5.29]
["SINAPI I 001355","CHAPA DE MADEIRA COMPENSADA RESINADA 14 mm","m²",0.52500000000000002,{"$f":"Insumos!G78","v":28.72},15.07]
["SINAPI C 91692","SERRA CIRCULAR DE BANCADA C/COIFA PARA DISCO 10\" (chp)","chp",4.4000000000000003E-3,{"$f":"'Composições Aux. SINAPI'!E74:F74","v":26.83},0.11]
["SINAPI C 91693","SERRA CIRCULAR DE BANCADA C/COIFA PARA DISCO 10\" (chi)","chi",1.9099999999999999E-2,{"$f":"'Composições Aux. SINAPI'!E75:F75","v":23.89},0.45]
["SINAPI I 5061","PREGO DE AÇO 18 x 27 C/CABEÇA","kg",4.2799999999999998E-2,{"$f":"Insumos!G170","v":20.75},0.88]
["SINAPI I 35693","TINTA LÁTEX ACRÍLICA ECONÔMICA, COR BRANCA","l",0.26979999999999998,{"$f":"Insumos!G207","v":11.78},{"$f":"TRUNC(D85*E85,2)","v":3.17}]
[{"$f":"CONCATENATE(\"SINAPI I \",[4]Insumos!$B$228)","v":"SINAPI I 3767"},"LIXA P/MADEIRA","un",0.8,{"$f":"Insumos!G120","v":0.79},{"$f":"TRUNC(D86*E86,2)","v":0.63}]
["SUB-TOTAL - MATERIAL / EQUIPAMENTOS:",null,{"$f":"SUM(F79:F86)","v":26.48}]
["SINAPI C 88262","CARPINTEIRO C/ENCARGOS COMPLEMENTARES","h",0.61270000000000002,{"$f":"Planilha_M.O.!E26","v":20.5},{"$f":"TRUNC(D88*E88,2)","v":12.56}]
["SINAPI C 88239","AJUDANTE DE CARPINTEIRO C/ENCARGOS COMPLEMENTARES","h",0.20419999999999999,{"$f":"Planilha_M.O.!E20","v":17.059999999999999},{"$f":"TRUNC(D89*E89,2)","v":3.48}]
["SINAPI C 88310","PINTOR C/ENCARGOS COMPLEMENTARES","h",0.8,{"$f":"Planilha_M.O.!E25","v":21.7},{"$f":"TRUNC(D90*E90,2)","v":17.36}]
["SINAPI C 88316","SERVENTE C/ ENCARGOS COMPLEMENTARES","h",0.45,{"$f":"Planilha_M.O.!E18","v":17.11},{"$f":"TRUNC(D91*E91,2)","v":7.69}]
["SUB-TOTAL - MÃO-DE-OBRA:",null,{"$f":"SUM(F88:F91)","v":41.089999999999996}]
[]
[null,"CUSTO TOTAL:",null,null,null,{"$f":"+C87+C92","v":67.569999999999993}]
[]
[null,"BDI:","%",{"$f":"+$F$7","v":"22,15%"},null,{"$f":"TRUNC(F94*D96,2)","v":14.96}]
[]
[null,"PREÇO:",null,null,null,{"$f":"+F94+F96","v":82.53}]
[]
[]
["CÓDIGO","DISCRIMINAÇÃO","UN","COEFIC.","UNITÁRIO","TOTAL"]
[510,"LOCAÇÃO DE BANHEIRO QUÍMICO","%"]
["SUDECAP 89.50.09","LOCAÇÃO SANITÁRIO QUÍMICO","ms",0.01,{"$f":"+Insumos!G121","v":680},{"$f":"TRUNC(D103*E103,4)","v":6.8}]
["SUB-TOTAL - MATERIAL / EQUIPAMENTOS:",null,{"$f":"SUM(F103)","v":6.8}]
[]
[null,"CUSTO TOTAL:",null,null,null,{"$f":"+C104","v":6.8}]
[]
[null,"BDI:","%",{"$f":"+$F$7","v":"22,15%"},null,{"$f":"TRUNC(F106*D108,4)","v":1.5062}]
[]
[null,"PREÇO:",null,null,null,{"$f":"+F106+F108","v":8.3062000000000005}]
[null,"CÁLCULO: LOCAÇÃO BANHEIRO: NÚMERO DE MESES: 1,0 MÊS"]
[null,"NECESSÁRIO 1% DO VALOR TOTAL DA OBRA, DESSA FORMA , COEFICIENTE =1,0 MÊS /100%"]
[]
["CÓDIGO","DISCRIMINAÇÃO","UN","COEFIC.","UNITÁRIO","TOTAL"]
[520,"FRETE P/ SANITÁRIO QUÍMICO","cj"]
["SINAPI C 93402","GUINDAUTO HIDRÁULICO, CAP. 3300 KG, INCLUSIVE CAMINHÃO TOCO","chp",5,{"$f":"'Composições Aux. SINAPI'!E51:F51","v":177.73},{"$f":"TRUNC(D116*E116,2)","v":888.65}]
["SUB-TOTAL - MATERIAL / EQUIPAMENTOS:",null,{"$f":"SUM(F116)","v":888.65}]
[]
[null,"CUSTO TOTAL:",null,null,null,{"$f":"+C117","v":888.65}]
[null,"Auxiliar para composições 510"]
[null,"BDI:","%",{"$f":"+$F$7","v":"22,15%"},null,{"$f":"TRUNC(F119*D121,2)","v":196.83}]
[]
[null,"PREÇO:",null,null,null,{"$f":"+F119+F121","v":1085.48}]
[]
["CÓDIGO","DISCRIMINAÇÃO","UN","COEFIC.","UNITÁRIO","TOTAL"]
[530,"INSTALAÇÃO PROVISÓRIA DE ENERGIA, AÉREA, TRIFASICA, COM CAIXA DE EMBUTIR C/ POSTE H=9,00M","pt"]
["SINAPI C 91872","ELETRODUTO RÍGIDO ROSCÁVEL, PVC, DN 32 mm (1\"), PARA CIRCUITOS TERMINAIS","m",6.05,{"$f":"'Composições Aux. SINAPI'!E49:F49","v":14.97},{"$f":"TRUNC(D127*E127,2)","v":90.56}]
["SINAPI C 91885","LUVA PARA ELETRODUTO, PVC, ROSCÁVEL, DN 32 mm (1\")","un",1,{"$f":"'Composições Aux. SINAPI'!E58:F58","v":8.8800000000000008},8.8800000000000008]
["SINAPI C 91917","CURVA 90° PARA ELETRODUTO, PVC, ROSCÁVEL, DN 32 mm (1\")","un",1,{"$f":"'Composições Aux. SINAPI'!E44:F44","v":14.99},14.99]
["SINAPI C 91919","CURVA 180° P/ELETRODUTO, PVC, ROSCÁVEL, DN 32 mm (1\"\u0094)","un",1,{"$f":"'Composições Aux. SINAPI'!E45:F45","v":16.98},16.98]
["SINAPI C 91933","CABO DE COBRE FLEXÍVEL ISOLADO, 10 mm², ANTI-CHAMA 0,6/1,0 kV","m",22.2,{"$f":"'Composições Aux. SINAPI'!E27:F27","v":16.22},360.08]
["SINAPI C 93673","DISJUNTOR TRIPOLAR TIPO DIN, CORRENTE NOMINAL DE 50 A","un",1,{"$f":"'Composições Aux. SINAPI'!E48:F48","v":94.12},94.12]
["SINAPI C 96977","CORDOALHA DE COBRE NU 50 mm², ENTERRADA, SEM ISOLADOR","m",1.95,{"$f":"'Composições Aux. SINAPI'!E43:F43","v":50.13},97.75]
["SINAPI C 96986","HASTE DE ATERRAMENTO 3/4\" PARA SPDA","un",1,{"$f":"'Composições Aux. SINAPI'!E52:F52","v":102.57},102.57]
["SINAPI C 100578","ASSENTAMENTO DE POSTE DE CONCRETO COM COMPRIMENTO NOMINAL DE 9 m","un",1,{"$f":"'Composições Aux. SINAPI'!E24:F24","v":412.48},412.48]
["SINAPI I 001094","ARMAÇÃO VERTICAL C/HASTE E CONTRA-PINO, EM CHAPA DE FG 3/16\", C/1 ESTRIBO","un",1,{"$f":"Insumos!G36","v":13.98},13.98]
["SINAPI I 003398","ISOLADOR DE PORCELANA, TIPO ROLDANA, DIMENSÕES DE 72 x 72 mm","un",1,{"$f":"Insumos!G114","v":4.7699999999999996},4.7699999999999996]
["SINAPI I 004346","PARAFUSO FERRO POLIDO, SEXTAVADO, D=5/8\", C/PORCA E ARRUELA DE PRESSÃO MÉDIA","un",3,{"$f":"Insumos!G140","v":6.93},20.79]
["SINAPI I 011267","ARRUELA LISA, DE LATÃO POLIDO, DIÂMETRO NOMINAL 5/8\", DIÂMETRO DO FURO = 17 mm","un",2,{"$f":"Insumos!G37","v":0.8},1.6]
["SINAPI I 011864","CONECTOR METÁLICO TIPO PARAFUSO FENDIDO (SPLIT BOLT), PARA CABOS ATÉ 95 mm2","un",1,{"$f":"Insumos!G87","v":29.18},29.18]
["SINAPI I 011950","BUCHA NYLON S/ABA S6, C/PARAFUSO DE 4,2 x 40 mm EM AÇO ZINCADO C/ROSCA SOBERBA","un",4,{"$f":"Insumos!G64","v":0.37},1.48]
["SINAPI I 014153","FITA METÁLICA PERFURADA, L = 18 mm, ROLO DE 30 m, CARGA RECOMENDADA = 30 kgf","un",0.06,{"$f":"Insumos!G103","v":52.81},3.16]
["SINAPI I 034643","CAIXA INSPEÇÃO EM POLIETILENO PARA ATERRAMENTO E PÁRA RAIOS DIÂMETRO = 300 mm","un",1,{"$f":"Insumos!G69","v":20.079999999999998},20.079999999999998]
["SINAPI I 039809","CAIXA P/MEDIDOR POLIFÁSICO, EM POLICARBONATO/TERMOPLÁSTICO, P/1 DISJUNTOR","un",1,{"$f":"Insumos!G70","v":138.18},138.18]
["SINAPI I 039996","VERGALHÃO ZINCADO ROSCA TOTAL, 1/4 \" (6,3 mm)","m",0.16639999999999999,{"$f":"Insumos!G227","v":5.38},0.89]
["SINAPI I 039997","PORCA ZINCADA, SEXTAVADA, DIÂMETRO 1/4\"","un",2,{"$f":"Insumos!G163","v":0.2},0.4]
["SINAPI I 005044","POSTE DE CONCRETO CIRCULAR, 200 kg, H = 9 m","un",1,{"$f":"Insumos!G172","v":920.7},920.7]
["SUB-TOTAL - MATERIAL / EQUIPAMENTOS:",null,{"$f":"SUM(F127:F147)","v":2353.6200000000003}]
[{"$f":"CONCATENATE(\"SINAPI C \",[5]Insumos!$B$23)","v":"SINAPI C 88264"},"ELETRICISTA C/ENCARGOS COMPLEMENTARES","h",3.5078,{"$f":"Planilha_M.O.!E41","v":22.61},{"$f":"TRUNC(D149*E149,2)","v":79.31}]
[{"$f":"CONCATENATE(\"SINAPI C \",[5]Insumos!$B$16)","v":"SINAPI C 88247"},"AUXILIAR DE ELETRICISTA C/ENCARGOS COMPLEMENTARES","h",0.38969999999999999,{"$f":"Planilha_M.O.!E42","v":17.170000000000002},{"$f":"TRUNC(D150*E150,2)","v":6.69}]
["SUB-TOTAL - MÃO-DE-OBRA:",null,{"$f":"SUM(F149:F150)","v":86}]
[]
[null,"CUSTO TOTAL:",null,null,null,{"$f":"+C148+C151","v":2439.6200000000003}]
[]
[null,"BDI:","%",{"$f":"+$F$7","v":"22,15%"},null,{"$f":"TRUNC(F153*D155,2)","v":540.37}]
[]
[]
[null,"PREÇO:",null,null,null,{"$f":"+F153+F155","v":2979.9900000000002}]
[]
[]
["CÓDIGO","DISCRIMINAÇÃO","UN","COEFIC.","UNITÁRIO","TOTAL"]
[535,"INSTALAÇÃO PROVISÓRIA DE ÁGUA","pt"]
[{"$f":"CONCATENATE(\"SINAPI C \",'[5]Composições Aux. SINAPI'!$A$62)","v":"SINAPI C 89971"},"KIT DE REGISTRO DE GAVETA BRUTO DE LATÃO ½\", INCLUSIVE CONEXÕES, ROSCÁVEL","un",1,{"$f":"'Composições Aux. SINAPI'!E54:F54","v":50.53},{"$f":"TRUNC(D163*E163,2)","v":50.53}]
[{"$f":"CONCATENATE(\"SINAPI C \",'[5]Composições Aux. SINAPI'!$A$50)","v":"SINAPI C 93358"},"ESCAVAÇÃO MANUAL DE VALA COM PROFUNDIDADE MENOR OU IGUAL A 1,30 M","m³",0.16,{"$f":"'Composições Aux. SINAPI'!E50:F50","v":67.680000000000007},10.82]
[{"$f":"CONCATENATE(\"SINAPI C \",'[5]Composições Aux. SINAPI'!$A$91)","v":"SINAPI C 89401"},"TUBO, PVC, SOLDÁVEL, DN 20MM - FORNECIMENTO E INSTALAÇÃO","m",8,{"$f":"'Composições Aux. SINAPI'!E78:F78","v":7.63},61.04]
[{"$f":"CONCATENATE(\"SINAPI C \",'[5]Composições Aux. SINAPI'!$A$61)","v":"SINAPI C 89358"},"JOELHO 90 GRAUS, PVC, SOLDÁVEL, DN 20MM - FORNECIMENTO E INSTALAÇÃO","un",4,{"$f":"'Composições Aux. SINAPI'!E53:F53","v":6.38},25.52]
[{"$f":"CONCATENATE(\"SINAPI C \",'[5]Composições Aux. SINAPI'!$A$25)","v":"SINAPI C 95676"},"CAIXA EM CONCRETO PRÉ-MOLDADO PARA ABRIGO DE HIDRÔMETRO COM DN 20 (½\u0094)","un",1,{"$f":"'Composições Aux. SINAPI'!E28:F28","v":93.49},93.49]
[{"$f":"CONCATENATE(\"SINAPI C \",'[5]Composições Aux. SINAPI'!$A$83)","v":"SINAPI C 86913"},"TORNEIRA CROMADA 1/2\" OU 3/4\" PARA TANQUE, PADRÃO POPULAR","un",1,{"$f":"'Composições Aux. SINAPI'!E76:F76","v":27.71},27.71]
[{"$f":"CONCATENATE(\"COTAÇÃO \",[5]Insumos!$B$339)","v":"COTAÇÃO 116"},"TAXA INSTALAÇÃO ÁGUA DMAE","cj",1,{"$f":"Cotações!M134","v":465.36},465.36]
["SUB-TOTAL - MATERIAL / EQUIPAMENTOS:",null,{"$f":"SUM(F163:F169)","v":734.47}]
[]
[null,"CUSTO TOTAL:",null,null,null,{"$f":"+C170","v":734.47}]
[]
[null,"BDI:","%",{"$f":"+$F$7","v":"22,15%"},null,{"$f":"TRUNC(F172*D174,2)","v":162.68}]
[]
[null,"PREÇO:",null,null,null,{"$f":"+F172+F174","v":897.15000000000009}]
[]
[]
["CÓDIGO","DISCRIMINAÇÃO","UN","COEFIC.","UNITÁRIO","TOTAL"]
[542,"PLACA DE OBRA EM CHAPA GALVANIZADA","m²"]
["COTAÇÃO 16","CAIBRO CEDRINHO 5 x 7 cm","m",0.57110000000000005,{"$f":"Cotações!M11","v":22.2},{"$f":"TRUNC(D181*E181,2)","v":12.67}]
["SINAPI I 44481","VIGA DE MADEIRA NÃO APARELHADA 8 x 16 cm","m",0.57110000000000005,{"$f":"Insumos!G228","v":43.33},24.74]
["SINAPI I 5075","PREGO DE AÇO 18 x 30 C/CABEÇA","kg",9.8699999999999996E-2,{"$f":"Insumos!G166","v":21.11},2.08]
["COTAÇÃO 113","CAÇAMBA 4,00 m³","un",8.0000000000000002E-3,{"$f":"Insumos!G66","v":443.33},3.54]
["SINAPI C 94962","CONCRETO MAGRO PARA LASTRO,PREPARO COM BETONEIRA","m³",2.9899999999999999E-2,{"$f":"'Composições Aux. SINAPI'!E36:F36","v":294.52999999999997},8.8000000000000007]
["SINAPI C 92873","LANÇAMENTO, ADENSAMENTO E ACABAMENTO CONCRETO","m³",2.9899999999999999E-2,{"$f":"+'[4]Composições Aux. SINAPI'!$E$53:$F$53","v":154.36000000000001},4.6100000000000003]
["SINAPI I 4813","PLACA DE OBRA (PARA CONSTRUCAO CIVIL) EM CHAPA GALVANIZADA *N. 22*, ADESIVADA, DE *2,0 X 1,125* M","m²",1,{"$f":"Insumos!G157","v":225},225]
["SUB-TOTAL - MATERIAL / EQUIPAMENTOS:",null,{"$f":"SUM(F181:F187)","v":281.44}]
["SINAPI C 88262","CARPINTEIRO C/ENCARGOS COMPLEMENTARES","h",0.51800000000000002,{"$f":"Planilha_M.O.!E26","v":20.5},{"$f":"TRUNC(D189*E189,2)","v":10.61}]
["SINAPI C 88239","AJUDANTE DE CARPINTEIRO C/ENCARGOS COMPLEMENTARES","h",0.40010000000000001,{"$f":"Planilha_M.O.!E20","v":17.059999999999999},{"$f":"TRUNC(D190*E190,2)","v":6.82}]
["SINAPI C 88309","PEDREIRO C/ENCARGOS COMPLEMENTARES","h",7.5499999999999998E-2,{"$f":"Planilha_M.O.!E24","v":20.71},{"$f":"TRUNC(D191*E191,2)","v":1.56}]
["SINAPI C 88316","SERVENTE C/ ENCARGOS COMPLEMENTARES","h",0.15509999999999999,{"$f":"Planilha_M.O.!E18","v":17.11},{"$f":"TRUNC(D192*E192,2)","v":2.65}]
["SUB-TOTAL - MÃO-DE-OBRA:",null,{"$f":"SUM(F189:F192)","v":21.639999999999997}]
[]
[null,"CUSTO TOTAL:",null,null,null,{"$f":"+C188+C193","v":303.08}]
[]
[null,"BDI:","%",{"$f":"+$F$7","v":"22,15%"},null,{"$f":"TRUNC(F195*D197,2)","v":67.13}]
[]
[null,"PREÇO:",null,null,null,{"$f":"+F195+F197","v":370.21}]
[]
[]
["CÓDIGO","DISCRIMINAÇÃO","UN","COEFIC.","UNITÁRIO","TOTAL"]
[552,"SINALIZAÇÃO COM TELA PLÁSTICA LARANJA FIXADA EM CONE PLÁSTICO","m"]
["SINAPI I 34498","CONE DE SINALIZAÇÃO EM PVC FLEXÍVEL, h=70/76 cm","un",0.17499999999999999,{"$f":"Insumos!G86","v":114.77},{"$f":"TRUNC(D204*E204,2)","v":20.079999999999998}]
["SINAPI I 37524","TELA PLÁSTICA LARANJA","m",1.1000000000000001,{"$f":"Insumos!G194","v":2.06},{"$f":"TRUNC(D205*E205,2)","v":2.2599999999999998}]
["SUB-TOTAL - MATERIAL / EQUIPAMENTOS:",null,{"$f":"SUM(F204:F205)","v":22.339999999999996}]
[{"$f":"CONCATENATE(\"SINAPI C \",[4]Insumos!$B$23)","v":"SINAPI C 88262"},"CARPINTEIRO C/ENCARGOS COMPLEMENTARES","h",0.16800000000000001,{"$f":"Planilha_M.O.!E26","v":20.5},{"$f":"TRUNC(D207*E207,2)","v":3.44}]
[{"$f":"CONCATENATE(\"SINAPI C \",[4]Insumos!$B$15)","v":"SINAPI C 88239"},"AJUDANTE DE CARPINTEIRO C/ENCARGOS COMPLEMENTARES","h",0.13200000000000001,{"$f":"Planilha_M.O.!E20","v":17.059999999999999},{"$f":"TRUNC(D208*E208,2)","v":2.25}]
["SUB-TOTAL - MÃO-DE-OBRA:",null,{"$f":"SUM(F207:F208)","v":5.6899999999999995}]
[]
[null,"CUSTO TOTAL:",null,null,null,{"$f":"+C206+C209","v":28.029999999999994}]
[]
[null,"BDI:","%",{"$f":"+$F$7","v":"22,15%"},null,{"$f":"TRUNC(F211*D213,2)","v":6.2}]
[]
[null,"PREÇO:",null,null,null,{"$f":"+F211+F213","v":34.229999999999997}]
[]
["CÓDIGO","DISCRIMINAÇÃO","UN","COEFIC.","UNITÁRIO","TOTAL"]
[99064,"LOCAÇÃO DE OBRA","m"]
["SINAPI C 99058","LOCAÇÃO DE PONTO PARA REFERÊNCIA TOPOGRÁFICA","un",0.05,{"$f":"'Composições Aux. SINAPI'!E57:F57","v":10.33},{"$f":"TRUNC(D219*E219,2)","v":0.51}]
["SUB-TOTAL - MATERIAL / EQUIPAMENTOS:",null,{"$f":"SUM(F219:F219)","v":0.51}]
[]
[null,"CUSTO TOTAL:",null,null,null,{"$f":"+C220","v":0.51}]
[]
[null,"BDI:","%",{"$f":"+$F$7","v":"22,15%"},null,{"$f":"TRUNC(F222*D224,2)","v":0.11}]
[]
[null,"PREÇO:",null,null,null,{"$f":"+F222+F224","v":0.62}]
[]
["CÓDIGO","DISCRIMINAÇÃO","UN","COEFIC.","UNITÁRIO","TOTAL"]
[565,"NIVELAMENTO","m²"]
["SINAPI I 4460","SARRAFO NÃO APARELHADO 2,5 X 10 cm","m",2.8999999999999998E-3,{"$f":"Insumos!G179","v":7.48},{"$f":"TRUNC(D230*E230,2)","v":0.02}]
["SINAPI I 7252","LOCACAO DE NIVEL OPTICO, COM PRECISAO DE 0,7 MM, AUMENTO DE 32X","h",2.5000000000000001E-3,{"$f":"Insumos!G130","v":2.0299999999999998},{"$f":"ROUND(D231*E231,2)","v":0.01}]
["SUB-TOTAL - MATERIAL / EQUIPAMENTOS:",null,{"$f":"SUM(F230:F231)","v":0.03}]
["SINAPI C 88253","AUXILIAR DE TOPÓGRAFO C/ENCARGOS COMPLEMENTARES","h",2.5000000000000001E-3,{"$f":"Planilha_M.O.!E21","v":13.69},{"$f":"TRUNC(D233*E233,2)","v":0.03}]
["SINAPI C 90781","TOPÓGRAFO C/ ENCARGOS COMPLEMENTARES","h",2.5000000000000001E-3,{"$f":"Planilha_M.O.!E39","v":31.8},{"$f":"TRUNC(D234*E234,2)","v":7.0000000000000007E-2}]
["SINAPI C 88316","SERVENTE C/ ENCARGOS COMPLEMENTARES","h",7.4999999999999997E-3,{"$f":"Planilha_M.O.!E18","v":17.11},{"$f":"TRUNC(D235*E235,2)","v":0.12}]
["SUB-TOTAL - MÃO-DE-OBRA:",null,{"$f":"SUM(F233:F235)","v":0.22}]
[]
[null,"CUSTO TOTAL:",null,null,null,{"$f":"+C232+C236","v":0.25}]
[]
[null,"BDI:","%",{"$f":"+$F$7","v":"22,15%"},null,{"$f":"TRUNC(F238*D240,2)","v":0.05}]
[]
[null,"PREÇO:",null,null,null,{"$f":"+F238+F240","v":0.3}]
[]
["CÓDIGO","DISCRIMINAÇÃO","UN","COEFIC.","UNITÁRIO","TOTAL"]
[97053,"SINALIZAÇÃO COM FITA ZEBRADA FIXADA EM CONE PLÁSTICO","m"]
["SINAPI I 34498","CONE DE SINALIZAÇÃO EM PVC FLEXÍVEL, h=70/76 cm","un",2.1899999999999999E-2,{"$f":"+Insumos!$G$86","v":114.77},{"$f":"TRUNC(D246*E246,2)","v":2.5099999999999998}]
["SINAPI I 42015","FITA ZEBRADA","m",1.1000000000000001,{"$f":"+Insumos!$G$105","v":1.1200000000000001},{"$f":"TRUNC(D247*E247,2)","v":1.23}]
["SUB-TOTAL - MATERIAL / EQUIPAMENTOS:",null,{"$f":"SUM(F246:F247)","v":3.7399999999999998}]
["SINAPI C 88262","CARPINTEIRO C/ENCARGOS COMPLEMENTARES","h",0.1384,{"$f":"Planilha_M.O.!E26","v":20.5},{"$f":"TRUNC(D249*E249,2)","v":2.83}]
["SINAPI C 88239","AJUDANTE DE CARPINTEIRO C/ENCARGOS COMPLEMENTARES","h",0.10879999999999999,{"$f":"Planilha_M.O.!E20","v":17.059999999999999},{"$f":"TRUNC(D250*E250,2)","v":1.85}]
["SUB-TOTAL - MÃO-DE-OBRA:",null,{"$f":"SUM(F249:F250)","v":4.68}]
[]
[null,"CUSTO TOTAL:",null,null,null,{"$f":"+C248+C251","v":8.42}]
[]
[null,"BDI:","%",{"$f":"+$F$7","v":"22,15%"},null,{"$f":"TRUNC(F253*D255,2)","v":1.86}]
[]
[null,"PREÇO:",null,null,null,{"$f":"+F253+F255","v":10.28}]
[]
["CÓDIGO","DISCRIMINAÇÃO","UN","COEFIC.","UNITÁRIO","TOTAL"]
[700,"ADMINISTRAÇÃO LOCAL","%"]
["SINAPI C 90778","ENGENHEIRO CIVIL DE OBRA C/ENCARGOS COMPLEMENTARES","h",0.44,{"$f":"Planilha_M.O.!E38","v":107.35},{"$f":"TRUNC(D261*E261,4)","v":47.234000000000002}]
["SINAPI C 93572","ENCARREGADO DE OBRAS","mês",0.01,{"$f":"Planilha_M.O.!E37","v":7828.88},{"$f":"TRUNC(D262*E262,4)","v":78.288799999999995}]
["SINAPI C 88326","VIGIA NOTURNO COM ENCARGOS COMPLEMENTARES","h",{"$f":"(30*10)/100","v":3},{"$f":"Planilha_M.O.!E40","v":22.41},{"$f":"TRUNC(D263*E263,4)","v":67.23}]
["SINAPI I 10886","EXTINTOR DE INCENDIO PORTATIL COM CARGA DE AGUA PRESSURIZADA DE 10 L, CLASSE A","un",0.01,{"$f":"Insumos!G98","v":183.75},{"$f":"TRUNC(D264*E264,4)","v":1.8374999999999999}]
["SINAPI I 10891","EXTINTOR DE INCENDIO PORTATIL COM CARGA DE PO QUIMICO SECO (PQS) DE 4 KG, CLASSE BC","un",0.01,{"$f":"Insumos!G99","v":177.69},{"$f":"TRUNC(D265*E265,4)","v":1.7768999999999999}]
["SMAMS 750","CONSUMO DE ENERGIA ELÉTRICA","kWh",3,{"$f":"F301","v":0.91},{"$f":"TRUNC(D266*E266,4)","v":2.73}]
["SMAMS 753","CONSUMO DE AGUA TRATADA","m³",0.5,{"$f":"C312","v":7.2299999999999995},3.6150000000000002]
["SUB-TOTAL - MÃO-DE-OBRA:",null,{"$f":"SUM(F261:F267)","v":202.7122}]
[]
[null,"CUSTO TOTAL:",null,null,null,{"$f":"C268","v":202.7122}]
[]
[null,"BDI:","%",{"$f":"+$F$7","v":"22,15%"},null,{"$f":"TRUNC(F270*D272,4)","v":44.900700000000001}]
[]
[null,"PREÇO:",null,null,null,{"$f":"+F270+F272","v":247.6129}]
[]
[]
["CÓDIGO","DISCRIMINAÇÃO","UN","COEFIC.","UNITÁRIO","TOTAL"]
["SMAMS 701","ADMINISTRAÇÃO LOCAL SIMÃO LOPES NETO","%"]
["SINAPI C 90778","ENGENHEIRO CIVIL DE OBRA C/ENCARGOS COMPLEMENTARES","h",0.44,{"$f":"Planilha_M.O.!E38","v":107.35},{"$f":"TRUNC(D279*E279,4)","v":47.234000000000002}]
["SINAPI C 93572","ENCARREGADO DE OBRAS","mês",0.01,{"$f":"Planilha_M.O.!E37","v":7828.88},{"$f":"TRUNC(D280*E280,4)","v":78.288799999999995}]
["SINAPI C 88326","VIGIA NOTURNO COM ENCARGOS COMPLEMENTARES","h",{"$f":"(30*10)/100","v":3},{"$f":"Planilha_M.O.!E40","v":22.41},{"$f":"TRUNC(D281*E281,4)","v":67.23}]
["SINAPI I 10886","EXTINTOR DE INCENDIO PORTATIL COM CARGA DE AGUA PRESSURIZADA DE 10 L, CLASSE A","un",0.01,{"$f":"Insumos!G98","v":183.75},{"$f":"TRUNC(D282*E282,4)","v":1.8374999999999999}]
["SINAPI I 10891","EXTINTOR DE INCENDIO PORTATIL COM CARGA DE PO QUIMICO SECO (PQS) DE 4 KG, CLASSE BC","un",0.01,{"$f":"Insumos!G99","v":177.69},{"$f":"TRUNC(D283*E283,4)","v":1.7768999999999999}]
["SMAMS 750","CONSUMO DE ENERGIA ELÉTRICA","kWh",2.5,{"$f":"F301","v":0.91},2.2749999999999999]
["SMAMS 753","CONSUMO DE AGUA TRATADA","m³",0.4,{"$f":"C312","v":7.2299999999999995},2.8919999999999999]
["SUB-TOTAL - MÃO-DE-OBRA:",null,{"$f":"SUM(F279:F285)","v":201.5342}]
[]
[null,"CUSTO TOTAL:",null,null,null,{"$f":"C286","v":201.5342}]
[]
[null,"BDI:","%",{"$f":"+$F$7","v":"22,15%"},null,{"$f":"TRUNC(F288*D290,4)","v":44.639800000000001}]
[]
[null,"PREÇO:",null,null,null,{"$f":"+F288+F290","v":246.17400000000001}]
[]
[]
[]
["ITEM","DISCRIMINAÇÃO","UN","COEFIC.","UNITÁRIO","TOTAL"]
[750,"CONSUMO DE ENERGIA ELÉTRICA","kWh"]
["SINAPI I 2705","ENERGIA ELÉTRICA","kWh",1,{"$f":"Insumos!G95","v":0.91},{"$f":"TRUNC(D298*E298,2)","v":0.91}]
["SUB-TOTAL - MATERIAL / EQUIPAMENTOS:",null,{"$f":"SUM(F298)","v":0.91}]
[]
[null,"CUSTO TOTAL:",null,null,null,{"$f":"C299","v":0.91}]
[]
[null,"BDI:","%",{"$f":"+$F$7","v":"22,15%"},null,{"$f":"TRUNC(F301*D303,2)","v":0.2}]
[]
[null,"PREÇO:",null,null,null,{"$f":"+F301+F303","v":1.1100000000000001}]
[]
[]
["ITEM","DISCRIMINAÇÃO","UN","COEFIC.","UNITÁRIO","TOTAL"]
[753,"CONSUMO DE ÁGUA TRATADA","m³"]
[{"$f":"CONCATENATE(\"COTAÇÃO \",[5]Insumos!$B$77)","v":"COTAÇÃO 118"},"ÁGUA TRATADA","m³",1,{"$f":"Cotações!D136","v":4.0199999999999996},{"$f":"TRUNC(D310*E310,2)","v":4.0199999999999996}]
[{"$f":"CONCATENATE(\"COTAÇÃO \",[5]Insumos!$B$190)","v":"COTAÇÃO 119"},"ESGOTO CLOCAL","m³",1,{"$f":"Cotações!D137","v":3.2159999999999997},{"$f":"TRUNC(D311*E311,2)","v":3.21}]
["SUB-TOTAL - MATERIAL / EQUIPAMENTOS:",null,{"$f":"SUM(F310:F311)","v":7.2299999999999995}]
[]
[null,"CUSTO TOTAL:",null,null,null,{"$f":"C312","v":7.2299999999999995}]
[]
[null,"BDI:","%",{"$f":"+$F$7","v":"22,15%"},null,{"$f":"TRUNC(F314*D316,2)","v":1.6}]
[]
[null,"PREÇO:",null,null,null,{"$f":"+F314+F316","v":8.83}]
[]
[]
["CÓDIGO","DISCRIMINAÇÃO","UN","COEFIC.","UNITÁRIO","TOTAL"]
[1002,"MODELAGEM (MOVIMENTO DE TERRA ATÉ 15CM)","m²"]
["SINAPI C 91533","COMPACTADOR DE SOLOS DE PERCUSSÃO C/MOTOR A GASOLINA, POTÊNCIA 4 cv (chp)","chp",1.6000000000000001E-3,{"$f":"'Composições Aux. SINAPI'!E32:F32","v":32.03},{"$f":"TRUNC(D323*E323,2)","v":0.05}]
["SINAPI C 91534","COMPACTADOR DE SOLOS DE PERCUSSÃO C/MOTOR A GASOLINA, POTÊNCIA 4 cv (chi)","chi",1.6000000000000001E-3,{"$f":"'Composições Aux. SINAPI'!E33:F33","v":24.83},{"$f":"TRUNC(D324*E324,2)","v":0.03}]
["SUB-TOTAL - MATERIAL / EQUIPAMENTOS:",null,{"$f":"SUM(F323:F324)","v":0.08}]
["SINAPI C 88309","PEDREIRO C/ENCARGOS COMPLEMENTARES","h",5.0700000000000002E-2,{"$f":"Planilha_M.O.!E24","v":20.71},{"$f":"TRUNC(D326*E326,2)","v":1.04}]
["SINAPI C 88316","SERVENTE C/ ENCARGOS COMPLEMENTARES","h",7.5999999999999998E-2,{"$f":"Planilha_M.O.!E18","v":17.11},{"$f":"TRUNC(D327*E327,2)","v":1.3}]
["SUB-TOTAL - MÃO-DE-OBRA:",null,{"$f":"SUM(F326:F327)","v":2.34}]
[]
[null,"CUSTO TOTAL:",null,null,null,{"$f":"+C325+C328","v":2.42}]
[]
[null,"BDI:","%",{"$f":"+$F$7","v":"22,15%"},null,{"$f":"TRUNC(F330*D332,2)","v":0.53}]
[]
[null,"PREÇO:",null,null,null,{"$f":"+F330+F332","v":2.95}]
[]
[]
["CÓDIGO","DISCRIMINAÇÃO","UN","COEFIC.","UNITÁRIO","TOTAL"]
[1010,"ATERRO MANUAL C/MATERIAL IMPORTADO C/COMPACTAÇÃO MANUAL","m³"]
[{"$f":"CONCATENATE(\"SINAPI I \",Insumos!$B$35)","v":"SINAPI I 6081"},"ARGILA OU BARRO PARA ATERRO OU REATERRO","m³",1.25,{"$f":"+Insumos!$G$35","v":31.59},{"$f":"TRUNC(D339*E339,2)","v":39.479999999999997}]
["SUB-TOTAL - MATERIAL / EQUIPAMENTOS:",null,{"$f":"SUM(F339:F339)","v":39.479999999999997}]
["SINAPI C 88316","SERVENTE C/ ENCARGOS COMPLEMENTARES","h",2.3986000000000001,{"$f":"Planilha_M.O.!E18","v":17.11},{"$f":"TRUNC(D341*E341,2)","v":41.04}]
["SUB-TOTAL - MÃO-DE-OBRA:",null,{"$f":"SUM(F341)","v":41.04}]
[]
[null,"CUSTO TOTAL:",null,null,null,{"$f":"+C340+C342","v":80.52}]
[]
[null,"BDI:","%",{"$f":"+$F$7","v":"22,15%"},null,{"$f":"TRUNC(F344*D346,2)","v":17.829999999999998}]
[]
[null,"PREÇO:",null,null,null,{"$f":"+F344+F346","v":98.35}]
[]
[]
["CÓDIGO","DISCRIMINAÇÃO","UN","COEFIC.","UNITÁRIO","TOTAL"]
[2010,"SAIBRO ROSA - COMPACTAÇÃO MECÂNICA - 6 cm","m²"]
[{"$f":"CONCATENATE(\"SINAPI C \",'[6]Composições Aux. SINAPI'!$A$55)","v":"SINAPI C 99058"},"LOCAÇÃO DE PONTO PARA REFERÊNCIA TOPOGRÁFICA","un",2.8199999999999999E-2,{"$f":"'Composições Aux. SINAPI'!E57:F57","v":10.33},{"$f":"TRUNC(D353*E353,2)","v":0.28999999999999998}]
[{"$f":"CONCATENATE(\"SINAPI C \",'[6]Composições Aux. SINAPI'!$A$62)","v":"SINAPI C 91277"},"PLACA VIBRATÓRIA REVERSÍVEL, POTÊNCIA 5,5 cv (chp)","chp",0.01,{"$f":"'Composições Aux. SINAPI'!E66:F66","v":9.84},{"$f":"TRUNC(D354*E354,2)","v":0.09}]
[{"$f":"CONCATENATE(\"SINAPI C \",'[6]Composições Aux. SINAPI'!$A$68)","v":"SINAPI C 5867"},"ROLO COMPACTADOR VIBRATÓRIO, POTÊNCIA 58 hp (chp)","chp",9.9000000000000008E-3,{"$f":"'Composições Aux. SINAPI'!E72:F72","v":111.07},{"$f":"TRUNC(D355*E355,2)","v":1.0900000000000001}]
[{"$f":"CONCATENATE(\"SINAPI C \",'[6]Composições Aux. SINAPI'!$A$69)","v":"SINAPI C 5869"},"ROLO COMPACTADOR VIBRATÓRIO, POTÊNCIA 58 hp (chi)","chi",3.3E-3,{"$f":"'Composições Aux. SINAPI'!E73:F73","v":49.7},{"$f":"TRUNC(D356*E356,2)","v":0.16}]
[{"$f":"CONCATENATE(\"COTAÇÃO \",[6]Insumos!$B$176)","v":"COTAÇÃO 101"},"SAIBRO ROSA - POSTO OBRA","m³",9.5000000000000001E-2,{"$f":"Cotações!M107","v":59},{"$f":"TRUNC(D357*E357,2)","v":5.6}]
["SUB-TOTAL - MATERIAL / EQUIPAMENTOS:",null,{"$f":"SUM(F353:F357)","v":7.2299999999999995}]
["SINAPI C 88316","SERVENTE C/ ENCARGOS COMPLEMENTARES","h",0.24779999999999999,{"$f":"Planilha_M.O.!E18","v":17.11},{"$f":"TRUNC(D359*E359,2)","v":4.2300000000000004}]
["SUB-TOTAL - MÃO-DE-OBRA:",null,{"$f":"SUM(F359:F359)","v":4.2300000000000004}]
[]
[null,"CUSTO TOTAL:",null,null,null,{"$f":"+C358+C360","v":11.46}]
[]
[null,"BDI:","%",{"$f":"+$F$7","v":"22,15%"},null,{"$f":"TRUNC(F362*D364,2)","v":2.5299999999999998}]
[]
[null,"PREÇO:",null,null,null,{"$f":"+F362+F364","v":13.99}]
[]
["CÓDIGO","DISCRIMINAÇÃO","UN","COEFIC.","UNITÁRIO","TOTAL"]
["SINAPI C 94994","EXECUÇÃO DE PASSEIO (CALÇADA) OU PISO DE CONCRETO COM CONCRETO MOLDADO IN LOCO, FEITO EM OBRA, ACABAMENTO CONVENCIONAL, ESPESSURA 8 CM, ARMADO.","m²"]
["SINAPI C 94964","CONCRETO FCK = 20MPA, TRAÇO 1:2,7:3 (CIMENTO/ AREIA MÉDIA/ BRITA 1) - PREPARO MECÂNICO COM BETONEIRA 400 L. AF_07/2016","m³",9.7000000000000003E-2,{"$f":"'Composições Aux. SINAPI'!E38:F38","v":368.57},{"$f":"TRUNC(D370*E370,2)","v":35.75}]
["SINAPI I 3777","LONA PLASTICA PESADA PRETA, E = 150 MICRA","m²",1.1279999999999999,{"$f":"Insumos!G122","v":1.47},{"$f":"TRUNC(D371*E371,2)","v":1.65}]
["SINAPI I 7156","TELA DE ACO SOLDADA NERVURADA, CA-60, Q-196, (3,11 KG/M2), DIAMETRO DO FIO = 5,0 MM, LARGURA = 2,45 M, ESPACAMENTO DA MALHA = 10 X 10 CM","m²",1.1224000000000001,{"$f":"Insumos!G198","v":51.7},58.02]
[{"$f":"CONCATENATE(\"SINAPI I \",Insumos!$B$181)","v":"SINAPI I 4517"},"SARRAFO PINUS 2,5 x 7,5 cm","m",0.2,{"$f":"+Insumos!$G$181","v":1.53},0.3]
["SINAPI I 4460","SARRAFO NÃO APARELHADO 2,5 X 10 cm","m",0.25,{"$f":"+Insumos!$G$179","v":7.48},1.87]
["SUB-TOTAL - MATERIAL / EQUIPAMENTOS:",null,{"$f":"SUM(F370:F374)","v":97.59}]
["SINAPI C 88262","CARPINTEIRO C/ENCARGOS COMPLEMENTARES","h",0.18049999999999999,{"$f":"Planilha_M.O.!E26","v":20.5},{"$f":"TRUNC(D376*E376,2)","v":3.7}]
["SINAPI C 88309","PEDREIRO C/ENCARGOS COMPLEMENTARES","h",0.2767,{"$f":"Planilha_M.O.!E24","v":20.71},{"$f":"TRUNC(D377*E377,2)","v":5.73}]
["SINAPI C 88316","SERVENTE C/ ENCARGOS COMPLEMENTARES","h",0.4572,{"$f":"Planilha_M.O.!E18","v":17.11},{"$f":"TRUNC(D378*E378,2)","v":7.82}]
["SUB-TOTAL - MÃO-DE-OBRA:",null,{"$f":"SUM(F376:F378)","v":17.25}]
[]
[null,"CUSTO TOTAL:",null,null,null,{"$f":"+C375+C379","v":114.84}]
[]
[null,"BDI:","%",{"$f":"+$F$7","v":"22,15%"},null,{"$f":"TRUNC(F381*D383,2)","v":25.43}]
[]
[null,"PREÇO:",null,null,null,{"$f":"+F381+F383","v":140.27000000000001}]
[]
[]
["CÓDIGO","DISCRIMINAÇÃO","UN","COEFIC.","UNITÁRIO","TOTAL"]
[2023,"PISO CONCRETO ARMADO E= 10 CM - ACADEMIA AO AR LIVRE - INCLUI JUNTA DILATAÇÃO","m²"]
[{"$f":"CONCATENATE(\"SINAPI C \",'Composições Aux. SINAPI'!$A$46)","v":"SINAPI C 95282"},"DESEMPENADEIRA DE CONCRETO, PESO DE 75KG, 4 PÁS, MOTOR A GASOLINA - CHP DIURNO","chp",3.3300000000000003E-2,{"$f":"+'Composições Aux. SINAPI'!$E$46:$F$46","v":9.33},{"$f":"TRUNC(D390*E390,2)","v":0.31}]
[{"$f":"CONCATENATE(\"SINAPI C \",'Composições Aux. SINAPI'!$A$47)","v":"SINAPI C 95283"},"DESEMPENADEIRA DE CONCRETO, PESO DE 75KG, 4 PÁS, MOTOR A GASOLINA - CHI DIURNO","chi",3.3300000000000003E-2,{"$f":"+'Composições Aux. SINAPI'!$E$47:$F$47","v":0.49},{"$f":"TRUNC(D391*E391,2)","v":0.01}]
[{"$f":"CONCATENATE(\"SINAPI C \",'Composições Aux. SINAPI'!$A$39)","v":"SINAPI C 91283"},"CORTADORA DE PISO, POTÊNCIA 13 hp, C/DISCO DE CORTE DIAMANTADO 350 mm","chp",3.7000000000000002E-3,{"$f":"+'Composições Aux. SINAPI'!$E$39:$F$39","v":21.82},{"$f":"TRUNC(D392*E392,2)","v":0.08}]
["SINAPI I 1527","CONCRETO USINADO BOMBEÁVEL, fck=25 MPa, INCLUI SERVIÇO DE BOMBEAMENTO","m³",0.105,{"$f":"+Insumos!$G$85","v":384.28},40.340000000000003]
[{"$f":"CONCATENATE(\"SINAPI C \",'Composições Aux. SINAPI'!$A$79)","v":"SINAPI C 90586"},"VIBRADOR DE IMERSÃO, DIÂMETRO DE PONTEIRA 45 mm (chp)","chp",6.7499999999999999E-3,{"$f":"+'Composições Aux. SINAPI'!$E$79:$F$79","v":1.79},0.01]
[{"$f":"CONCATENATE(\"SINAPI C \",'Composições Aux. SINAPI'!$A$80)","v":"SINAPI C 90587"},"VIBRADOR DE IMERSÃO, DIÂMETRO DE PONTEIRA 45 mm (chi)","chi",1.3129999999999999E-2,{"$f":"+'Composições Aux. SINAPI'!$E$80:$F$80","v":0.39},0.01]
["SINAPI I 21141","TELA DE AÇO SOLDADA CA-60 4,2mm 15 x 15 cm","m²",1.1200000000000001,{"$f":"+Insumos!$G$197","v":24.18},{"$f":"TRUNC(D396*E396,2)","v":27.08}]
["SINAPI I 5068","PREGO DE AÇO 17 x 21 C/CABEÇA","kg",3.5000000000000001E-3,{"$f":"+Insumos!$G$167","v":21.11},7.0000000000000007E-2]
[{"$f":"CONCATENATE(\"SINAPI I \",Insumos!$B$181)","v":"SINAPI I 4517"},"SARRAFO PINUS 2,5 x 7,5 cm","m",0.2,{"$f":"+Insumos!$G$181","v":1.53},0.3]
["SINAPI I 4460","SARRAFO NÃO APARELHADO 2,5 X 10 cm","m",0.25,{"$f":"+Insumos!$G$179","v":7.48},1.87]
[{"$f":"CONCATENATE(\"SINAPI I \",Insumos!$B$29)","v":"SINAPI I 43132"},"ARAME RECOZIDO 18 BWG","kg",2.4899999999999999E-2,{"$f":"+Insumos!$G$29","v":25.83},0.64]
[{"$f":"CONCATENATE(\"COTAÇÃO \",Insumos!$B$126)","v":"COTAÇÃO 106"},"MICROFIBRA DE POLIPROPILENO","sc",0.1,{"$f":"+Insumos!$G$126","v":23.2},2.3199999999999998]
["SINAPI I 3777","LONA PLÁSTICA PRETA","m²",1.1200000000000001,{"$f":"+Insumos!$G$122","v":1.47},1.64]
["SINAPI I 004011","GEOTEXTIL NAO TECIDO AGULHADO DE FILAMENTOS CONTINUOS 100% POLIESTER, RESITENCIA A TRACAO = 10 KN/M","m²",1.05,{"$f":"Insumos!G110","v":6.75},7.08]
["SUB-TOTAL - MATERIAL / EQUIPAMENTOS:",null,{"$f":"SUM(F390:F403)","v":81.759999999999991}]
["SINAPI C 88253","AUXILIAR DE TOPÓGRAFO C/ENCARGOS COMPLEMENTARES","h",2.5000000000000001E-3,{"$f":"Planilha_M.O.!E21","v":13.69},{"$f":"TRUNC(D405*E405,2)","v":0.03}]
["SINAPI C 88262","CARPINTEIRO C/ENCARGOS COMPLEMENTARES","h",1.5900000000000001E-2,{"$f":"Planilha_M.O.!E26","v":20.5},{"$f":"TRUNC(D406*E406,2)","v":0.32}]
["SINAPI C 88297","OPERADOR DE MÁQUINAS E EQUIPAMENTOS C/ENCARGOS COMPLEMENTARES","h",2.2800000000000001E-2,{"$f":"Planilha_M.O.!E35","v":23.8},{"$f":"TRUNC(D407*E407,2)","v":0.54}]
["SINAPI C 88309","PEDREIRO C/ENCARGOS COMPLEMENTARES","h",0.2082,{"$f":"Planilha_M.O.!E24","v":20.71},4.3099999999999996]
["SINAPI C 88316","SERVENTE C/ ENCARGOS COMPLEMENTARES","h",0.57899999999999996,{"$f":"Planilha_M.O.!E18","v":17.11},9.9]
["SUB-TOTAL - MÃO-DE-OBRA:",null,{"$f":"SUM(F405:F409)","v":15.1}]
[]
[null,"CUSTO TOTAL:",null,null,null,{"$f":"+C404+C410","v":96.859999999999985}]
[]
[null,"BDI:","%",{"$f":"+$F$7","v":"22,15%"},null,{"$f":"TRUNC(F412*D414,2)","v":21.45}]
[]
[null,"PREÇO:",null,null,null,{"$f":"+F412+F414","v":118.30999999999999}]
[]
[]
["CÓDIGO","DISCRIMINAÇÃO","UN","COEFIC.","UNITÁRIO","TOTAL"]
[2070,"PISO PODOTÁTIL 25x25 cm - E=2,0 cm","m"]
["SINAPI I 370","AREIA MÉDIA","m³",1.8499999999999999E-2,{"$f":"+Insumos!$G$32","v":63.5},{"$f":"TRUNC(D421*E421,2)","v":1.17}]
["SINAPI I 366","AREIA FINA","m³",6.9999999999999999E-4,{"$f":"+Insumos!$G$30","v":65},{"$f":"TRUNC(D422*E422,2)","v":0.04}]
[{"$f":"CONCATENATE(\"COTAÇÃO \",Insumos!$B$155)","v":"COTAÇÃO 100"},"PISO PODOTÁTIL 25x25 cm - E=2CM","un",4.12,{"$f":"+Insumos!$G$155","v":3.5},{"$f":"TRUNC(D423*E423,2)","v":14.42}]
["SINAPI I 34353","CIMENTO COLA AC-2","kg",0.28129999999999999,{"$f":"+Insumos!$G$83","v":0.98},{"$f":"TRUNC(D424*E424,2)","v":0.27}]
["SINAPI I 1379","CIMENTO PORTLAND CP-II 32","kg",5.5904999999999996,{"$f":"+Insumos!$G$84","v":0.65},{"$f":"TRUNC(D425*E425,2)","v":3.63}]
["SUB-TOTAL - MATERIAL / EQUIPAMENTOS:",null,{"$f":"SUM(F421:F425)","v":19.529999999999998}]
["SINAPI C 88309","PEDREIRO C/ENCARGOS COMPLEMENTARES","h",0.2,{"$f":"Planilha_M.O.!E24","v":20.71},{"$f":"TRUNC(D427*E427,2)","v":4.1399999999999997}]
["SINAPI C 88316","SERVENTE C/ ENCARGOS COMPLEMENTARES","h",0.23400000000000001,{"$f":"Planilha_M.O.!E18","v":17.11},{"$f":"TRUNC(D428*E428,2)","v":4}]
["SUB-TOTAL - MÃO-DE-OBRA:",null,{"$f":"SUM(F427:F428)","v":8.14}]
[]
[null,"CUSTO TOTAL:",null,null,null,{"$f":"+C426+C429","v":27.669999999999998}]
[]
[null,"BDI:","%",{"$f":"+$F$7","v":"22,15%"},null,{"$f":"TRUNC(F431*D433,2)","v":6.12}]
[]
[null,"PREÇO:",null,null,null,{"$f":"+F431+F433","v":33.79}]
[]
[]
["CÓDIGO","DISCRIMINAÇÃO","UN","COEFIC.","UNITÁRIO","TOTAL"]
[2601,"BANCO B - L=2,00 m","un"]
[{"$f":"CONCATENATE(\"COTAÇÃO \",Insumos!$B$66)","v":"COTAÇÃO 113"},"CAÇAMBA 4,00 m³","un",3.5999999999999997E-2,{"$f":"+Insumos!$G$66","v":443.33},{"$f":"TRUNC(D440*E440,2)","v":15.95}]
[{"$f":"CONCATENATE(\"SINAPI C \",'Composições Aux. SINAPI'!$A$37)","v":"SINAPI C 94963"},"CONCRETO fck = 15MPa, TRAÇO 1:3,4:3,5 (CIMENTO/ AREIA MÉDIA/ BRITA 1) - PREPARO MECÂNICO COM BETONEIRA 400 l","m³",0.72,{"$f":"'Composições Aux. SINAPI'!E37:F37","v":332.32},{"$f":"TRUNC(D441*E441,2)","v":239.27}]
["SINAPI I 43061","AÇO CA-60 4,2 mm - 0,109 kg/m","kg",1.0571999999999999,{"$f":"+Insumos!$G$19","v":11.89},12.57]
["SINAPI I 34449","AÇO CA-50 1/4\" - 0,248 kg/m","kg",0.29759999999999998,{"$f":"+Insumos!$G$14","v":14.07},4.18]
[{"$f":"CONCATENATE(\"SINAPI I \",Insumos!$B$29)","v":"SINAPI I 43132"},"ARAME RECOZIDO 18 BWG","kg",3.1699999999999999E-2,{"$f":"+Insumos!$G$29","v":25.83},0.81]
["SINAPI I 20247","PREGO DE AÇO 15 x 15 C/CABEÇA","kg",0.11940000000000001,{"$f":"+Insumos!$G$164","v":22.47},2.68]
[{"$f":"CONCATENATE(\"COTAÇÃO \",Insumos!$B$177)","v":"COTAÇÃO 28"},"SARRAFO CEDRINHO 2,5 X 5,0 cm","m",2.8039999999999998,{"$f":"+Insumos!$G$177","v":7.5},21.03]
["SINAPI I 1347","CHAPA COMPENSADO PLASTIFICADO 12 mm","m²",0.19900000000000001,{"$f":"+Insumos!$G$79","v":27.6},5.49]
["SINAPI I 563","BARRA FERRO CHATO 1 1/2\" x 3/8\"","m",6.72,{"$f":"+Insumos!$G$53","v":28.31},190.24]
[{"$f":"CONCATENATE(\"COTAÇÃO \",Insumos!$B$135)","v":"COTAÇÃO 50"},"PARAFUSO FRANCÊS ZINCADO 5/16\" x 2 1/2\" C/PORCA","un",12,{"$f":"+Insumos!$G$135","v":1.06},12.72]
["COTAÇÃO 44","TÁBUA ITAÚBA LIXADA E APLAINADA 3,5 x 19 x 2,00","un",3,{"$f":"Cotações!N35","v":145},435]
[{"$f":"CONCATENATE(\"COTAÇÃO \",Insumos!$B$145)","v":"COTAÇÃO 58"},"PARAFUSO SEXTAVADO ZINCADO C/PORCA 1/4\" x 2\"","un",4,{"$f":"+Insumos!$G$145","v":0.59},2.36]
[{"$f":"CONCATENATE(\"SINAPI I \",Insumos!$B$182)","v":"SINAPI I 5318"},"SOLVENTE DILUENTE A BASE DE AGUARRÁS","l",0.1226,{"$f":"+Insumos!$G$182","v":17.98},2.2000000000000002]
["SINAPI I 3767","LIXA P/MADEIRA","fl",2.7399,{"$f":"+Insumos!$G$120","v":0.79},2.16]
["SINAPI I 3768","LIXA P/FERRO","fl",0.70320000000000005,{"$f":"+Insumos!$G$119","v":3.37},2.36]
["SINAPI I 7307","FUNDO ANTICORROSIVO TIPO ZARCÃO","l",7.8399999999999997E-2,{"$f":"+Insumos!$G$107","v":29.63},2.3199999999999998]
["SINAPI I 6086","FUNDO SINTÉTICO NIVELADOR BRANCO FOSCO","l",0.54800000000000004,{"$f":"+Insumos!$G$109","v":90.88},49.8]
[{"$f":"CONCATENATE(\"SINAPI I \",Insumos!$B$205)","v":"SINAPI I 7292"},"TINTA ESMALTE SINTÉTICO BRILHANTE","l",0.56440000000000001,{"$f":"+Insumos!$G$205","v":27.61},15.58]
["SINAPI I 7293","TINTA GRAFITE","l",0.16880000000000001,{"$f":"+Insumos!$G$206","v":30.39},5.12]
["SUB-TOTAL - MATERIAL / EQUIPAMENTOS:",null,{"$f":"SUM(F440:F458)","v":1021.8400000000001}]
["SINAPI C 88262","CARPINTEIRO C/ENCARGOS COMPLEMENTARES","h",4.5,{"$f":"Planilha_M.O.!E26","v":20.5},{"$f":"TRUNC(D460*E460,2)","v":92.25}]
["SINAPI C 88245","ARMADOR C/ENCARGOS COMPLEMENTARES","h",3.5,{"$f":"Planilha_M.O.!E29","v":20.6},72.099999999999994]
["SINAPI C 88238","AJUDANTE DE ARMADOR C/ENCARGOS COMPLEMENTARES","h",3.5,{"$f":"Planilha_M.O.!E19","v":15.67},54.84]
["SINAPI C 88310","PINTOR C/ENCARGOS COMPLEMENTARES","h",2.5,{"$f":"Planilha_M.O.!E25","v":21.7},54.25]
["SINAPI C 88309","PEDREIRO C/ENCARGOS COMPLEMENTARES","h",0.64759999999999995,{"$f":"Planilha_M.O.!E24","v":20.71},13.41]
["SINAPI C 88316","SERVENTE C/ ENCARGOS COMPLEMENTARES","h",4,{"$f":"Planilha_M.O.!E18","v":17.11},68.44]
["SUB-TOTAL - MÃO-DE-OBRA:",null,{"$f":"SUM(F460:F465)","v":355.29}]
[]
[null,"CUSTO TOTAL:",null,null,null,{"$f":"+C459+C466","v":1377.13}]
[]
[null,"BDI:","%",{"$f":"+$F$7","v":"22,15%"},null,{"$f":"TRUNC(F468*D470,2)","v":305.02999999999997}]
[]
[null,"PREÇO:",null,null,null,{"$f":"+F468+F470","v":1682.16}]
[]
[]
["CÓDIGO","DISCRIMINAÇÃO","UN","COEFIC.","UNITÁRIO","TOTAL"]
[3723,"INSTALAÇÃO BANCO S/ENCOSTO","un"]
[{"$f":"CONCATENATE(\"COTAÇÃO \",[7]Insumos!$B$66)","v":"COTAÇÃO 113"},"CAÇAMBA 4,00 m³","un",1.7999999999999999E-2,{"$f":"Insumos!G66","v":443.33},{"$f":"TRUNC(D477*E477,2)","v":7.97}]
[{"$f":"CONCATENATE(\"SINAPI C \",'[7]Composições Aux. SINAPI'!$A$37)","v":"SINAPI C 94963"},"CONCRETO fck = 15MPa, TRAÇO 1:3,4:3,5 (CIMENTO/ AREIA MÉDIA/ BRITA 1) - PREPARO MECÂNICO COM BETONEIRA 400 l","m³",0.16,{"$f":"'Composições Aux. SINAPI'!E37:F37","v":332.32},{"$f":"TRUNC(D478*E478,2)","v":53.17}]
["SUB-TOTAL - MATERIAL / EQUIPAMENTOS:",null,{"$f":"SUM(F477:F478)","v":61.14}]
[{"$f":"CONCATENATE(\"SINAPI C \",[3]Insumos!$B$38)","v":"SINAPI C 88309"},"PEDREIRO C/ENCARGOS COMPLEMENTARES","h",0.53800000000000003,{"$f":"+[3]Insumos!$G$38","v":18.48},{"$f":"TRUNC(D480*E480,2)","v":9.94}]
[{"$f":"CONCATENATE(\"SINAPI C \",[3]Insumos!$B$41)","v":"SINAPI C 88316"},"SERVENTE C/ ENCARGOS COMPLEMENTARES","h",1.7383999999999999,{"$f":"+[3]Insumos!$G$41","v":15.35},{"$f":"TRUNC(D481*E481,2)","v":26.68}]
["SUB-TOTAL - MÃO-DE-OBRA:",null,{"$f":"SUM(F480:F481)","v":36.619999999999997}]
[]
[null,"CUSTO TOTAL:",null,null,null,{"$f":"+C479+C482","v":97.759999999999991}]
[]
[null,"BDI:","%",{"$f":"+$F$7","v":"22,15%"},null,{"$f":"TRUNC(F484*D486,2)","v":21.65}]
[]
[null,"PREÇO:",null,null,null,{"$f":"+F484+F486","v":119.41}]
[]
[]
[]
["CÓDIGO","DISCRIMINAÇÃO","UN","COEFIC.","UNITÁRIO","TOTAL"]
[2671,"LIXEIRA METÁLICA - V=30LITROS","un"]
[{"$f":"CONCATENATE(\"COTAÇÃO \",Insumos!$B$66)","v":"COTAÇÃO 113"},"CAÇAMBA 4,00 m³","un",0.10296,{"$f":"+Insumos!$G$66","v":443.33},{"$f":"TRUNC(D494*E494,2)","v":45.64}]
[{"$f":"CONCATENATE(\"SINAPI C \",'Composições Aux. SINAPI'!$A$37)","v":"SINAPI C 94963"},"CONCRETO fck = 15MPa, TRAÇO 1:3,4:3,5 (CIMENTO/ AREIA MÉDIA/ BRITA 1) - PREPARO MECÂNICO COM BETONEIRA 400 l","m³",7.9200000000000007E-2,{"$f":"'Composições Aux. SINAPI'!E37:F37","v":332.32},{"$f":"TRUNC(D495*E495,2)","v":26.31}]
[{"$f":"CONCATENATE(\"COTAÇÃO \",Insumos!$B$132)","v":"COTAÇÃO 110"},"PAPELEIRA EXTERNA METÁLICA H-30","un",1,{"$f":"+Insumos!$G$132","v":900},900]
["SUB-TOTAL - MATERIAL / EQUIPAMENTOS:",null,{"$f":"SUM(F494:F496)","v":971.95}]
["SINAPI C 88309","PEDREIRO C/ENCARGOS COMPLEMENTARES","h",1.3968,{"$f":"Planilha_M.O.!E24","v":20.71},{"$f":"TRUNC(D498*E498,2)","v":28.92}]
["SINAPI C 88316","SERVENTE C/ ENCARGOS COMPLEMENTARES","h",1.3968,{"$f":"Planilha_M.O.!E18","v":17.11},{"$f":"TRUNC(D499*E499,2)","v":23.89}]
["SUB-TOTAL - MÃO-DE-OBRA:",null,{"$f":"SUM(F498:F499)","v":52.81}]
[]
[null,"CUSTO TOTAL:",null,null,null,{"$f":"+C497+C500","v":1024.76}]
[]
[null,"BDI:","%",{"$f":"+$F$7","v":"22,15%"},null,{"$f":"TRUNC(F502*D504,2)","v":226.98}]
[]
[null,"PREÇO:",null,null,null,{"$f":"+F502+F504","v":1251.74}]
[]
[]
["CÓDIGO","DISCRIMINAÇÃO","UN","COEFIC.","UNITÁRIO","TOTAL"]
[3025,"ESPALDAR - EQUIPAMENTO PADRÃO SMAMS","un"]
[{"$f":"CONCATENATE(\"COTAÇÃO \",[8]Insumos!$B$63)","v":"COTAÇÃO 113"},"CAÇAMBA 4,00 m³","un",0.11700000000000001,{"$f":"Insumos!G66","v":443.33},{"$f":"TRUNC(D511*E511,2)","v":51.86}]
[{"$f":"CONCATENATE(\"SINAPI C \",'[8]Composições Aux. SINAPI'!$A$33)","v":"SINAPI C 94963"},"CONCRETO fck = 15MPa, TRAÇO 1:3,4:3,5 (CIMENTO/ AREIA MÉDIA/ BRITA 1) - PREPARO MECÂNICO COM BETONEIRA 400 l","m³",0.09,{"$f":"'Composições Aux. SINAPI'!E37:F37","v":332.32},{"$f":"TRUNC(D512*E512,2)","v":29.9}]
[{"$f":"CONCATENATE(\"SINAPI I \",[8]Insumos!$B$209)","v":"SINAPI I 7292"},"TINTA ESMALTE SINTÉTICO BRILHANTE","l",2.3260000000000001,{"$f":"Insumos!G205","v":27.61},{"$f":"TRUNC(D513*E513,2)","v":64.22}]
[{"$f":"CONCATENATE(\"SINAPI I \",[8]Insumos!$B$170)","v":"SINAPI I 5318"},"SOLVENTE DILUENTE A BASE DE AGUARRÁS","l",0.41899999999999998,{"$f":"+[8]Insumos!$G$170","v":17.98},7.53]
[{"$f":"CONCATENATE(\"COTAÇÃO \",[8]Insumos!$B$104)","v":"COTAÇÃO 108"},"FUNDO P/GALVANIZADO","l",0.32240000000000002,{"$f":"Cotações!M119","v":34.81},11.22]
[{"$f":"CONCATENATE(\"SINAPI I \",[8]Insumos!$B$215)","v":"SINAPI I 21012"},"TUBO AÇO GALVANIZADO C/COSTURA 1 1/2\", 3,00 mm","m",9,{"$f":"Insumos!G211","v":77.03},693.27]
[{"$f":"CONCATENATE(\"SINAPI I \",[8]Insumos!$B$217)","v":"SINAPI I 21014"},"TUBO AÇO GALVANIZADO C/COSTURA 2 1/2\", 3,35 mm","m",5,{"$f":"Insumos!G213","v":140.66},703.3]
[{"$f":"CONCATENATE(\"SINAPI I \",[8]Insumos!$B$195)","v":"SINAPI I 1169"},"TAMPÃO DE FERRO GALVANIZADO DE 2 1/2\"","un",2,{"$f":"Insumos!G190","v":41.16},{"$f":"TRUNC(D518*E518,2)","v":82.32}]
["SUB-TOTAL - MATERIAL / EQUIPAMENTOS:",null,{"$f":"SUM(F511:F518)","v":1643.62}]
["SINAPI C 88310","PINTOR C/ENCARGOS COMPLEMENTARES","h",7.05,{"$f":"Planilha_M.O.!E25","v":21.7},{"$f":"TRUNC(D520*E520,2)","v":152.97999999999999}]
["SINAPI C 88315","PEDREIRO C/ENCARGOS COMPLEMENTARES","h",9,{"$f":"Planilha_M.O.!E24","v":20.71},{"$f":"TRUNC(D521*E521,2)","v":186.39}]
["SINAPI C 88309","SERVENTE C/ ENCARGOS COMPLEMENTARES","h",15,{"$f":"Planilha_M.O.!E18","v":17.11},{"$f":"TRUNC(D522*E522,2)","v":256.64999999999998}]
["SUB-TOTAL - MÃO-DE-OBRA:",null,{"$f":"SUM(F520:F522)","v":596.02}]
[]
[null,"CUSTO TOTAL:",null,null,null,{"$f":"+C519+C523","v":2239.64}]
[]
[null,"BDI:","%",{"$f":"+$F$7","v":"22,15%"},null,{"$f":"TRUNC(F525*D527,2)","v":496.08}]
[]
[null,"PREÇO:",null,null,null,{"$f":"+F525+F527","v":2735.72}]
[]
[]
["CÓDIGO","DISCRIMINAÇÃO","UN","COEFIC.","UNITÁRIO","TOTAL"]
[3010,"APOIO P/ MEMBROS SUPERIORES - EQUIPAMENTO PADRÃO SMAMS","un"]
["COTAÇÃO 113","CAÇAMBA 4,00 m³","un",9.3600000000000003E-2,{"$f":"Insumos!G66","v":443.33},{"$f":"TRUNC(D534*E534,2)","v":41.49}]
["SINAPI C 94963","CONCRETO fck = 15MPa, TRAÇO 1:3,4:3,5 (CIMENTO/ AREIA MÉDIA/ BRITA 1) - PREPARO MECÂNICO COM BETONEIRA 400 l","m³",7.1999999999999995E-2,{"$f":"'Composições Aux. SINAPI'!E37:F37","v":332.32},{"$f":"TRUNC(D535*E535,2)","v":23.92}]
["SINAPI I 1166","TAMPÃO DE FERRO GALVANIZADO DE 2\"","un",2,{"$f":"Insumos!G189","v":21.55},{"$f":"TRUNC(D536*E536,2)","v":43.1}]
["SINAPI I 7292","TINTA ESMALTE SINTÉTICO BRILHANTE","l",0.77969999999999995,{"$f":"Insumos!G205","v":27.61},21.52]
["SINAPI I 5318","SOLVENTE DILUENTE A BASE DE AGUARRÁS","l",0.1404,{"$f":"Insumos!G182","v":17.98},2.52]
["COTAÇÃO 108","FUNDO P/GALVANIZADO","l",0.122,{"$f":"Cotações!M119","v":34.81},4.24]
["SINAPI I 21013","TUBO AÇO GALVANIZADO C/COSTURA 2\", 3,00 mm","m",2.84,{"$f":"Insumos!G212","v":87.2},247.64]
["SINAPI I 21014","TUBO AÇO GALVANIZADO C/COSTURA 2 1/2\", 3,35 mm","m",1.8,{"$f":"Insumos!G213","v":140.66},253.18]
["SUB-TOTAL - MATERIAL / EQUIPAMENTOS:",null,{"$f":"SUM(F534:F541)","v":637.61}]
["SINAPI C 88310","PINTOR C/ENCARGOS COMPLEMENTARES","h",2.3580000000000001,{"$f":"Planilha_M.O.!E25","v":21.7},{"$f":"TRUNC(D543*E543,2)","v":51.16}]
["SINAPI C 88315","PEDREIRO C/ENCARGOS COMPLEMENTARES","h",4.3258000000000001,{"$f":"Planilha_M.O.!E24","v":20.71},{"$f":"TRUNC(D544*E544,2)","v":89.58}]
["SINAPI C 88309","SERVENTE C/ ENCARGOS COMPLEMENTARES","h",6.9165999999999999,{"$f":"Planilha_M.O.!E18","v":17.11},{"$f":"TRUNC(D545*E545,2)","v":118.34}]
["SUB-TOTAL - MÃO-DE-OBRA:",null,{"$f":"SUM(F543:F545)","v":259.08000000000004}]
[]
[null,"CUSTO TOTAL:",null,null,null,{"$f":"+C542+C546","v":896.69}]
[]
[null,"BDI:","%",{"$f":"+$F$7","v":"22,15%"},null,{"$f":"TRUNC(F548*D550,2)","v":198.61}]
[]
[null,"PREÇO:",null,null,null,{"$f":"+F548+F550","v":1095.3000000000002}]
[]
[]
["CÓDIGO","DISCRIMINAÇÃO","UN","COEFIC.","UNITÁRIO","TOTAL"]
[3030,"PRANCHA DE ABDOMINAIS - EQUIPAMENTO PADRÃO SMAMS ","un"]
[{"$f":"CONCATENATE(\"COTAÇÃO \",[8]Insumos!$B$63)","v":"COTAÇÃO 113"},"CAÇAMBA 4,00 m³","un",0.11700000000000001,{"$f":"Insumos!G66","v":443.33},{"$f":"TRUNC(D557*E557,2)","v":51.86}]
[{"$f":"CONCATENATE(\"SINAPI C \",'[8]Composições Aux. SINAPI'!$A$33)","v":"SINAPI C 94963"},"CONCRETO fck = 15MPa, TRAÇO 1:3,4:3,5 (CIMENTO/ AREIA MÉDIA/ BRITA 1) - PREPARO MECÂNICO COM BETONEIRA 400 l","m³",0.09,{"$f":"'Composições Aux. SINAPI'!E37:F37","v":332.32},{"$f":"TRUNC(D558*E558,2)","v":29.9}]
["SINAPI I 1166","TAMPÃO DE FERRO GALVANIZADO DE 2\"","un",2,{"$f":"Insumos!G189","v":21.55},{"$f":"TRUNC(D559*E559,2)","v":43.1}]
["SINAPI I 1165","TAMPÃO DE FERRO GALVANIZADO DE 1 1/2\"","un",4,{"$f":"Insumos!G188","v":14.92},59.68]
[{"$f":"CONCATENATE(\"COTAÇÃO \",[8]Insumos!$B$184)","v":"COTAÇÃO 31"},"TÁBUA ITAÚBA LIXADA APLAINADA 3,5 x 25 x 2,00","un",2,{"$f":"Cotações!M21","v":216.33},432.66]
[{"$f":"CONCATENATE(\"COTAÇÃO \",[8]Insumos!$B$131)","v":"COTAÇÃO 51"},"PARAFUSO FRANCÊS ZINCADO 5/16\" x 4\" C/PORCA","un",8,{"$f":"Cotações!M44","v":1.47},11.76]
["SINAPI I 3767","LIXA P/MADEIRA","fl",2.0870000000000002,{"$f":"Insumos!G120","v":0.79},1.64]
[{"$f":"CONCATENATE(\"SINAPI I \",[8]Insumos!$B$209)","v":"SINAPI I 7292"},"TINTA ESMALTE SINTÉTICO BRILHANTE","l",1.2161,{"$f":"Insumos!G205","v":27.61},33.57]
[{"$f":"CONCATENATE(\"SINAPI I \",[8]Insumos!$B$170)","v":"SINAPI I 5318"},"SOLVENTE DILUENTE A BASE DE AGUARRÁS","l",0.20669999999999999,{"$f":"Insumos!G182","v":17.98},3.71]
[{"$f":"CONCATENATE(\"COTAÇÃO \",[8]Insumos!$B$104)","v":"COTAÇÃO 108"},"FUNDO P/GALVANIZADO","l",0.1305,{"$f":"Cotações!M119","v":34.81},4.54]
["SINAPI I 6086","FUNDO SINTÉTICO NIVELADOR BRANCO FOSCO","l",0.41470000000000001,{"$f":"Insumos!G109","v":90.88},37.68]
[{"$f":"CONCATENATE(\"SINAPI I \",[8]Insumos!$B$215)","v":"SINAPI I 21012"},"TUBO AÇO GALVANIZADO C/COSTURA 1 1/2\", 3,00 mm","m",4.96,{"$f":"Insumos!G211","v":77.03},382.06]
["SINAPI I 21013","TUBO AÇO GALVANIZADO C/COSTURA 2\", 3,00 mm","m",0.5,{"$f":"Insumos!G212","v":87.2},43.6]
["SUB-TOTAL - MATERIAL / EQUIPAMENTOS:",null,{"$f":"SUM(F557:F569)","v":1135.76}]
["SINAPI C 88310","PINTOR C/ENCARGOS COMPLEMENTARES","h",3.9178999999999999,{"$f":"Planilha_M.O.!E25","v":21.7},{"$f":"TRUNC(D571*E571,2)","v":85.01}]
["SINAPI C 88262","CARPINTEIRO C/ENCARGOS COMPLEMENTARES","h",2.3182,{"$f":"Planilha_M.O.!E26","v":20.5},{"$f":"TRUNC(D572*E572,2)","v":47.52}]
["SINAPI C 88309","PEDREIRO C/ENCARGOS COMPLEMENTARES","h",3.23,{"$f":"Planilha_M.O.!E24","v":20.71},{"$f":"TRUNC(D573*E573,2)","v":66.89}]
["SINAPI C 88316","SERVENTE C/ ENCARGOS COMPLEMENTARES","h",7,{"$f":"Planilha_M.O.!E18","v":17.11},{"$f":"TRUNC(D574*E574,2)","v":119.77}]
["SUB-TOTAL - MÃO-DE-OBRA:",null,{"$f":"SUM(F571:F574)","v":319.19}]
[]
[null,"CUSTO TOTAL:",null,null,null,{"$f":"+C570+C575","v":1454.95}]
[]
[null,"BDI:","%",{"$f":"+$F$7","v":"22,15%"},null,{"$f":"TRUNC(F577*D579,2)","v":322.27}]
[]
[null,"PREÇO:",null,null,null,{"$f":"+F577+F579","v":1777.22}]
[]
[]
["CÓDIGO","DISCRIMINAÇÃO","UN","COEFIC.","UNITÁRIO","TOTAL"]
[3030,"PRANCHA DE ABDOMINAIS PADRÃO SMAMS ","un"]
[{"$f":"CONCATENATE(\"COTAÇÃO \",Insumos!$B$66)","v":"COTAÇÃO 113"},"CAÇAMBA 4,00 m³","un",0.11700000000000001,{"$f":"Insumos!G66","v":443.33},{"$f":"TRUNC(D586*E586,2)","v":51.86}]
[{"$f":"CONCATENATE(\"SINAPI C \",'Composições Aux. SINAPI'!$A$37)","v":"SINAPI C 94963"},"CONCRETO fck = 15MPa, TRAÇO 1:3,4:3,5 (CIMENTO/ AREIA MÉDIA/ BRITA 1) - PREPARO MECÂNICO COM BETONEIRA 400 l","m³",0.09,{"$f":"'Composições Aux. SINAPI'!E37:F37","v":332.32},{"$f":"TRUNC(D587*E587,2)","v":29.9}]
["SINAPI I 1166","TAMPÃO DE FERRO GALVANIZADO DE 2\"","un",2,{"$f":"+Insumos!$G$189","v":21.55},{"$f":"TRUNC(D588*E588,2)","v":43.1}]
["SINAPI I 1165","TAMPÃO DE FERRO GALVANIZADO DE 1 1/2\"","un",4,{"$f":"+Insumos!$G$188","v":14.92},59.68]
[{"$f":"CONCATENATE(\"COTAÇÃO \",Insumos!#REF!)","v":{"$error":"#REF!"}},"TÁBUA ITAÚBA LIXADA APLAINADA 3,5 x 25 x 2,00","un",2,{"$f":"+Insumos!#REF!","v":{"$error":"#REF!"}},{"$error":"#REF!"}]
[{"$f":"CONCATENATE(\"COTAÇÃO \",Insumos!$B$136)","v":"COTAÇÃO 51"},"PARAFUSO FRANCÊS ZINCADO 5/16\" x 4\" C/PORCA","un",8,{"$f":"+Insumos!$G$136","v":1.47},11.76]
["SINAPI I 3767","LIXA P/MADEIRA","fl",2.0870000000000002,{"$f":"+Insumos!$G$120","v":0.79},1.64]
[{"$f":"CONCATENATE(\"SINAPI I \",Insumos!$B$205)","v":"SINAPI I 7292"},"TINTA ESMALTE SINTÉTICO BRILHANTE","l",1.2161,{"$f":"+Insumos!$G$205","v":27.61},33.57]
[{"$f":"CONCATENATE(\"SINAPI I \",Insumos!$B$182)","v":"SINAPI I 5318"},"SOLVENTE DILUENTE A BASE DE AGUARRÁS","l",0.20669999999999999,{"$f":"+Insumos!$G$182","v":17.98},3.71]
[{"$f":"CONCATENATE(\"COTAÇÃO \",Insumos!$B$108)","v":"COTAÇÃO 108"},"FUNDO P/GALVANIZADO","l",0.1305,{"$f":"+Insumos!$G$108","v":34.81},4.54]
["SINAPI I 6086","FUNDO SINTÉTICO NIVELADOR BRANCO FOSCO","l",0.41470000000000001,{"$f":"+Insumos!$G$109","v":90.88},37.68]
[{"$f":"CONCATENATE(\"SINAPI I \",Insumos!$B$211)","v":"SINAPI I 21012"},"TUBO AÇO GALVANIZADO C/COSTURA 1 1/2\", 3,00 mm","m",4.96,{"$f":"+Insumos!$G$211","v":77.03},382.06]
["SINAPI I 21013","TUBO AÇO GALVANIZADO C/COSTURA 2\", 3,00 mm","m",0.5,{"$f":"+Insumos!$G$212","v":87.2},43.6]
["SUB-TOTAL - MATERIAL / EQUIPAMENTOS:",null,{"$f":"SUM(F586:F598)","v":{"$error":"#REF!"}}]
["SINAPI C 88310","PINTOR C/ENCARGOS COMPLEMENTARES","h",3.9178999999999999,{"$f":"Planilha_M.O.!E25","v":21.7},{"$f":"TRUNC(D600*E600,2)","v":85.01}]
["SINAPI C 88262","CARPINTEIRO C/ENCARGOS COMPLEMENTARES","h",2.3182,{"$f":"Planilha_M.O.!E26","v":20.5},{"$f":"TRUNC(D601*E601,2)","v":47.52}]
["SINAPI C 88309","PEDREIRO C/ENCARGOS COMPLEMENTARES","h",3.23,{"$f":"Planilha_M.O.!E24","v":20.71},{"$f":"TRUNC(D602*E602,2)","v":66.89}]
["SINAPI C 88316","SERVENTE C/ ENCARGOS COMPLEMENTARES","h",7,{"$f":"Planilha_M.O.!E18","v":17.11},{"$f":"TRUNC(D603*E603,2)","v":119.77}]
["SUB-TOTAL - MÃO-DE-OBRA:",null,{"$f":"SUM(F600:F603)","v":319.19}]
[]
[null,"CUSTO TOTAL:",null,null,null,{"$f":"+C599+C604","v":{"$error":"#REF!"}}]
[]
[null,"BDI:","%",{"$f":"+$F$7","v":"22,15%"},null,{"$f":"TRUNC(F606*D608,2)","v":{"$error":"#REF!"}}]
[]
[null,"PREÇO:",null,null,null,{"$f":"+F606+F608","v":{"$error":"#REF!"}}]
[]
["CÓDIGO","DISCRIMINAÇÃO","UN","COEFIC.","UNITÁRIO","TOTAL",null,"Atenção!!"]
[3205,"PLACA ORIENTATIVA GALVANIZADA","un"]
[{"$f":"CONCATENATE(\"COTAÇÃO \",Insumos!$B$66)","v":"COTAÇÃO 113"},"CAÇAMBA 4,00 m³","un",4.3999999999999997E-2,{"$f":"+Insumos!$G$66","v":443.33},{"$f":"TRUNC(D614*E614,2)","v":19.5},null,"Se o orçamento for de apenas de 1 academia, manter BDI Diferenciado. Caso contrário, se a academia fizer parte de uma obra maior, ajustar o BDI para que tenha o mesmo percentual do restante do orçamento."]
[{"$f":"CONCATENATE(\"SINAPI C \",'Composições Aux. SINAPI'!$A$37)","v":"SINAPI C 94963"},"CONCRETO fck=15 MPa PREPARO COM BETONEIRA","m³",0.2024,{"$f":"+'Composições Aux. SINAPI'!$E$37:$F$37","v":332.32},{"$f":"TRUNC(D615*E615,2)","v":67.260000000000005}]
["SUB-TOTAL - MATERIAL:",null,{"$f":"SUM(F614:F615)","v":86.76}]
[{"$f":"CONCATENATE(\"COTAÇÃO \",Insumos!$B$45)","v":"COTAÇÃO 88"},"(ATI) PLACA ORIENTATIVA","un",1,{"$f":"Cotações!M91","v":7695.33},{"$f":"TRUNC(D617*E617,2)","v":7695.33}]
["SUB-TOTAL - EQUIPAMENTO:",null,{"$f":"SUM(F617)","v":7695.33}]
["SINAPI C 88309","PEDREIRO C/ENCARGOS COMPLEMENTARES","h",0.91990000000000005,{"$f":"Planilha_M.O.!E24","v":20.71},{"$f":"TRUNC(D619*E619,2)","v":19.05}]
["SINAPI C 88316","SERVENTE C/ ENCARGOS COMPLEMENTARES","h",1.5006999999999999,{"$f":"Planilha_M.O.!E18","v":17.11},{"$f":"TRUNC(D620*E620,2)","v":25.67},null,"1 - Remover linha \"Sub-total Material\";"]
["SUB-TOTAL - MÃO-DE-OBRA:",null,{"$f":"SUM(F619:F620)","v":44.72},{"$nulls":4},"2 - Editar linha \"Sub-total equipamento\". Trocar para \"Sub-total Material\";"]
[{"$nulls":7},"3 - Ajustar a soma do \"Sub-total material\" de forma que todos os valores de material sejam somados;"]
[null,"CUSTO TOTAL:",null,null,null,{"$f":"+C616+C618+C621","v":7826.81},null,"4 - Remover, na soma do Custo Total, a referência que não existe mais;"]
[{"$nulls":7},"5 - No valor do BDI, substituir a referência inexistente pela referência do \"Sub-total Material\";"]
[null,"BDI:","%",{"$f":"+$F$7","v":"22,15%"},null,{"$f":"TRUNC((C616+C621)*D625,2)","v":29.12},null,"6 - Remover a linha do BDI Diferenciado;"]
[null,"BDI diferenciado:","%",{"$f":"+$F$8","v":0.13699999999999998},null,{"$f":"TRUNC(C618*D626,2)","v":1054.26},null,"7 - No preço final, remover a referência que não existe mais."]
[]
[null,"PREÇO:",null,null,null,{"$f":"+F623+F625+F626","v":8910.19}]
[]
[]
["CÓDIGO","DISCRIMINAÇÃO","UN","COEFIC.","UNITÁRIO","TOTAL"]
[3212,"JOGO DE BARRAS - GALVANIZADO","un"]
[{"$f":"CONCATENATE(\"COTAÇÃO \",[4]Insumos!$B$130)","v":"COTAÇÃO 113"},"CAÇAMBA 4,00 m³","un",8.7999999999999995E-2,{"$f":"Insumos!G66","v":443.33},{"$f":"TRUNC(D633*E633,2)","v":39.01}]
[{"$f":"CONCATENATE(\"SINAPI C \",'[4]Composições Aux. SINAPI'!$A$30)","v":"SINAPI C 94963"},"CONCRETO fck=15 MPa PREPARO COM BETONEIRA","m³",0.40479999999999999,{"$f":"'Composições Aux. SINAPI'!E37:F37","v":332.32},{"$f":"TRUNC(D634*E634,2)","v":134.52000000000001}]
["SUB-TOTAL - MATERIAL:",null,{"$f":"SUM(F633:F634)","v":173.53}]
[{"$f":"CONCATENATE(\"COTAÇÃO \",[4]Insumos!$B$96)","v":"COTAÇÃO 85"},"(ATI) JOGO DE BARRAS","un",1,{"$f":"Cotações!M88","v":9359.33},{"$f":"TRUNC(D636*E636,2)","v":9359.33}]
["SUB-TOTAL - EQUIPAMENTO:",null,{"$f":"SUM(F636)","v":9359.33}]
[{"$f":"CONCATENATE(\"SINAPI C \",[4]Insumos!$B$38)","v":"SINAPI C 88309"},"PEDREIRO C/ENCARGOS COMPLEMENTARES","h",1.5899000000000001,{"$f":"+[4]Insumos!$G$38","v":18.48},{"$f":"TRUNC(D638*E638,2)","v":29.38}]
[{"$f":"CONCATENATE(\"SINAPI C \",[4]Insumos!$B$41)","v":"SINAPI C 88316"},"SERVENTE C/ ENCARGOS COMPLEMENTARES","h",3.0013000000000001,{"$f":"+[4]Insumos!$G$41","v":15.35},{"$f":"TRUNC(D639*E639,2)","v":46.06}]
["SUB-TOTAL - MÃO-DE-OBRA:",null,{"$f":"SUM(F638:F639)","v":75.44}]
[]
[null,"CUSTO TOTAL:",null,null,null,{"$f":"+C635+C637+C640","v":9608.3000000000011}]
[]
[null,"BDI:","%",{"$f":"+$F$7","v":"22,15%"},null,{"$f":"TRUNC((C635+C640)*D644,2)","v":55.14}]
[null,"BDI diferenciado:","%",{"$f":"+$F$8","v":0.13699999999999998},null,{"$f":"TRUNC(C637*D645,2)","v":1282.22}]
[]
[null,"PREÇO:",null,null,null,{"$f":"+F642+F644+F645","v":10945.66}]
[]
[]
["CÓDIGO","DISCRIMINAÇÃO","UN","COEFIC.","UNITÁRIO","TOTAL"]
[3220,"SIMULADOR DE CAMINHADA TRIPLO CONJUGADO - GALVANIZADO","un"]
[{"$f":"CONCATENATE(\"COTAÇÃO \",Insumos!$B$49)","v":"COTAÇÃO 92"},"(ATI) SIMULADOR DE CAMINHADA TRIPLO CONJUGADO","un",1,{"$f":"Cotações!M95","v":13224.66},{"$f":"TRUNC(D652*E652,2)","v":13224.66}]
["SUB-TOTAL - EQUIPAMENTO:",null,{"$f":"SUM(F652)","v":13224.66}]
["SINAPI C 88309","PEDREIRO C/ENCARGOS COMPLEMENTARES","h",0.75,{"$f":"Planilha_M.O.!E24","v":20.71},{"$f":"TRUNC(D654*E654,2)","v":15.53}]
["SINAPI C 88316","SERVENTE C/ ENCARGOS COMPLEMENTARES","h",0.5,{"$f":"Planilha_M.O.!E18","v":17.11},{"$f":"TRUNC(D655*E655,2)","v":8.5500000000000007}]
["SUB-TOTAL - MÃO-DE-OBRA:",null,{"$f":"SUM(F654:F655)","v":24.08}]
[]
[null,"CUSTO TOTAL:",null,null,null,{"$f":"+C653+C656","v":13248.74}]
[]
[null,"BDI:","%",{"$f":"+$F$7","v":"22,15%"},null,{"$f":"TRUNC(C656*D660,2)","v":5.33}]
[null,"BDI diferenciado:","%",{"$f":"+$F$8","v":0.13699999999999998},null,{"$f":"TRUNC(C653*D661,2)","v":1811.77}]
[]
[null,"PREÇO:",null,null,null,{"$f":"+F658+F660+F661","v":15065.84}]
[]
["CÓDIGO","DISCRIMINAÇÃO","UN","COEFIC.","UNITÁRIO","TOTAL"]
[3230,"ESQUI TRIPLO CONJUGADO - GALVANIZADO","un"]
[{"$f":"CONCATENATE(\"COTAÇÃO \",Insumos!$B$41)","v":"COTAÇÃO 84"},"(ATI) ESQUI TRIPLO CONJUGADO","un",1,{"$f":"Cotações!M87","v":16140},{"$f":"TRUNC(D667*E667,2)","v":16140}]
["SUB-TOTAL - EQUIPAMENTO:",null,{"$f":"SUM(F667)","v":16140}]
["SINAPI C 88309","PEDREIRO C/ENCARGOS COMPLEMENTARES","h",0.75,{"$f":"Planilha_M.O.!E24","v":20.71},{"$f":"TRUNC(D669*E669,2)","v":15.53}]
["SINAPI C 88316","SERVENTE C/ ENCARGOS COMPLEMENTARES","h",0.5,{"$f":"Planilha_M.O.!E18","v":17.11},{"$f":"TRUNC(D670*E670,2)","v":8.5500000000000007}]
["SUB-TOTAL - MÃO-DE-OBRA:",null,{"$f":"SUM(F669:F670)","v":24.08}]
[]
[null,"CUSTO TOTAL:",null,null,null,{"$f":"+C668+C671","v":16164.08}]
[]
[null,"BDI:","%",{"$f":"+$F$7","v":"22,15%"},null,{"$f":"TRUNC(C671*D675,2)","v":5.33}]
[null,"BDI diferenciado:","%",{"$f":"+$F$8","v":0.13699999999999998},null,{"$f":"TRUNC(C668*D676,2)","v":2211.1799999999998}]
[]
[null,"PREÇO:",null,null,null,{"$f":"+F673+F675+F676","v":18380.59}]
[]
["CÓDIGO","DISCRIMINAÇÃO","UN","COEFIC.","UNITÁRIO","TOTAL"]
[3235,"ADUÇÃO E ABDUÇÃO DE PERNAS DUPLO - GALVANIZADO","un"]
[{"$f":"CONCATENATE(\"COTAÇÃO \",Insumos!$B$66)","v":"COTAÇÃO 113"},"CAÇAMBA 4,00 m³","un",2.1999999999999999E-2,{"$f":"+Insumos!$G$66","v":443.33},{"$f":"TRUNC(D682*E682,2)","v":9.75}]
[{"$f":"CONCATENATE(\"SINAPI C \",'Composições Aux. SINAPI'!$A$37)","v":"SINAPI C 94963"},"CONCRETO fck=15 MPa PREPARO COM BETONEIRA","m³",0.1012,{"$f":"+'Composições Aux. SINAPI'!$E$37:$F$37","v":332.32},{"$f":"TRUNC(D683*E683,2)","v":33.630000000000003}]
["SUB-TOTAL - MATERIAL:",null,{"$f":"SUM(F682:F683)","v":43.38}]
[{"$f":"CONCATENATE(\"COTAÇÃO \",Insumos!$B$40)","v":"COTAÇÃO 83"},"(ATI) ADUÇÃO E ABDUÇÃO DE PERNAS DUPLO","un",1,{"$f":"Cotações!N86","v":9150},{"$f":"TRUNC(D685*E685,2)","v":9150}]
["SUB-TOTAL - EQUIPAMENTO:",null,{"$f":"SUM(F685)","v":9150}]
["SINAPI C 88309","PEDREIRO C/ENCARGOS COMPLEMENTARES","h",0.46,{"$f":"Planilha_M.O.!E24","v":20.71},{"$f":"TRUNC(D687*E687,2)","v":9.52}]
["SINAPI C 88316","SERVENTE C/ ENCARGOS COMPLEMENTARES","h",1.1253,{"$f":"Planilha_M.O.!E18","v":17.11},{"$f":"TRUNC(D688*E688,2)","v":19.25}]
["SUB-TOTAL - MÃO-DE-OBRA:",null,{"$f":"SUM(F687:F688)","v":28.77}]
[]
[null,"CUSTO TOTAL:",null,null,null,{"$f":"+C684+C686+C689","v":9222.15}]
[]
[null,"BDI:","%",{"$f":"+$F$7","v":"22,15%"},null,{"$f":"TRUNC((C684+C689)*D693,2)","v":15.98}]
[null,"BDI diferenciado:","%",{"$f":"+$F$8","v":0.13699999999999998},null,{"$f":"TRUNC(C686*D694,2)","v":1253.55}]
[]
[null,"PREÇO:",null,null,null,{"$f":"+F691+F693+F694","v":10491.679999999998}]
[]
["CÓDIGO","DISCRIMINAÇÃO","UN","COEFIC.","UNITÁRIO","TOTAL"]
[3240,"PRESSÃO DE PERNAS TRIPLO CONJUGADO - GALVANIZADO","un"]
[{"$f":"CONCATENATE(\"COTAÇÃO \",Insumos!$B$66)","v":"COTAÇÃO 113"},"CAÇAMBA 4,00 m³","un",2.1999999999999999E-2,{"$f":"+Insumos!$G$66","v":443.33},{"$f":"TRUNC(D700*E700,2)","v":9.75}]
[{"$f":"CONCATENATE(\"SINAPI C \",'Composições Aux. SINAPI'!$A$37)","v":"SINAPI C 94963"},"CONCRETO fck=15 MPa PREPARO COM BETONEIRA","m³",0.1012,{"$f":"+'Composições Aux. SINAPI'!$E$37:$F$37","v":332.32},{"$f":"TRUNC(D701*E701,2)","v":33.630000000000003}]
["SUB-TOTAL - MATERIAL:",null,{"$f":"SUM(F700:F701)","v":43.38}]
[{"$f":"CONCATENATE(\"COTAÇÃO \",Insumos!$B$46)","v":"COTAÇÃO 89"},"(ATI) PRESSÃO DE PERNAS TRIPLO CONJUGADO","un",1,{"$f":"Cotações!M92","v":9472},{"$f":"TRUNC(D703*E703,2)","v":9472}]
["SUB-TOTAL - EQUIPAMENTO:",null,{"$f":"SUM(F703)","v":9472}]
["SINAPI C 88309","PEDREIRO C/ENCARGOS COMPLEMENTARES","h",0.46,{"$f":"Planilha_M.O.!E24","v":20.71},{"$f":"TRUNC(D705*E705,2)","v":9.52}]
["SINAPI C 88316","SERVENTE C/ ENCARGOS COMPLEMENTARES","h",1.1253,{"$f":"Planilha_M.O.!E18","v":17.11},{"$f":"TRUNC(D706*E706,2)","v":19.25}]
["SUB-TOTAL - MÃO-DE-OBRA:",null,{"$f":"SUM(F705:F706)","v":28.77}]
[]
[null,"CUSTO TOTAL:",null,null,null,{"$f":"+C702+C704+C707","v":9544.15}]
[]
[null,"BDI:","%",{"$f":"+$F$7","v":"22,15%"},null,{"$f":"TRUNC((C702+C707)*D711,2)","v":15.98}]
[null,"BDI diferenciado:","%",{"$f":"+$F$8","v":0.13699999999999998},null,{"$f":"TRUNC(C704*D712,2)","v":1297.6600000000001}]
[]
[null,"PREÇO:",null,null,null,{"$f":"+F709+F711+F712","v":10857.789999999999}]
[]
[]
["CÓDIGO","DISCRIMINAÇÃO","UN","COEFIC.","UNITÁRIO","TOTAL"]
[3252,"SIMULADOR DE REMO - GALVANIZADO","un"]
[{"$f":"CONCATENATE(\"COTAÇÃO \",Insumos!$B$50)","v":"COTAÇÃO 93"},"(ATI) SIMULADOR DE REMO","un",1,{"$f":"Cotações!N96","v":5640},{"$f":"TRUNC(D719*E719,2)","v":5640}]
["SUB-TOTAL - EQUIPAMENTO:",null,{"$f":"SUM(F719)","v":5640}]
["SINAPI C 88309","PEDREIRO C/ENCARGOS COMPLEMENTARES","h",0.75,{"$f":"Planilha_M.O.!E24","v":20.71},{"$f":"TRUNC(D721*E721,2)","v":15.53}]
["SINAPI C 88316","SERVENTE C/ ENCARGOS COMPLEMENTARES","h",0.5,{"$f":"Planilha_M.O.!E18","v":17.11},{"$f":"TRUNC(D722*E722,2)","v":8.5500000000000007}]
["SUB-TOTAL - MÃO-DE-OBRA:",null,{"$f":"SUM(F721:F722)","v":24.08}]
[]
[null,"CUSTO TOTAL:",null,null,null,{"$f":"+C720+C723","v":5664.08}]
[]
[null,"BDI:","%",{"$f":"+$F$7","v":"22,15%"},null,{"$f":"TRUNC(C723*D727,2)","v":5.33}]
[null,"BDI diferenciado:","%",{"$f":"+$F$8","v":0.13699999999999998},null,{"$f":"TRUNC(C720*D728,2)","v":772.68}]
[]
[null,"PREÇO:",null,null,null,{"$f":"+F725+F727+F728","v":6442.09}]
[]
[]
["CÓDIGO","DISCRIMINAÇÃO","UN","COEFIC.","UNITÁRIO","TOTAL"]
[3270,"ABDOMINAL SIMPLES - GALVANIZADO","un"]
[{"$f":"CONCATENATE(\"COTAÇÃO \",Insumos!$B$66)","v":"COTAÇÃO 113"},"CAÇAMBA 4,00 m³","un",2.1999999999999999E-2,{"$f":"+Insumos!$G$66","v":443.33},{"$f":"TRUNC(D735*E735,2)","v":9.75}]
[{"$f":"CONCATENATE(\"SINAPI C \",'Composições Aux. SINAPI'!$A$37)","v":"SINAPI C 94963"},"CONCRETO fck=15 MPa PREPARO COM BETONEIRA","m³",0.1012,{"$f":"+'Composições Aux. SINAPI'!$E$37:$F$37","v":332.32},{"$f":"TRUNC(D736*E736,2)","v":33.630000000000003}]
["SUB-TOTAL - MATERIAL:",null,{"$f":"SUM(F735:F736)","v":43.38}]
[{"$f":"CONCATENATE(\"COTAÇÃO \",Insumos!$B$39)","v":"COTAÇÃO 82"},"(ATI) ABDOMINAL SIMPLES","un",1,{"$f":"Cotações!M85","v":4936.66},{"$f":"TRUNC(D738*E738,2)","v":4936.66}]
["SUB-TOTAL - EQUIPAMENTO:",null,{"$f":"SUM(F738)","v":4936.66}]
["SINAPI C 88309","PEDREIRO C/ENCARGOS COMPLEMENTARES","h",0.46,{"$f":"Planilha_M.O.!E24","v":20.71},{"$f":"TRUNC(D740*E740,2)","v":9.52}]
["SINAPI C 88316","SERVENTE C/ ENCARGOS COMPLEMENTARES","h",1.1253,{"$f":"Planilha_M.O.!E18","v":17.11},{"$f":"TRUNC(D741*E741,2)","v":19.25}]
["SUB-TOTAL - MÃO-DE-OBRA:",null,{"$f":"SUM(F740:F741)","v":28.77}]
[]
[null,"CUSTO TOTAL:",null,null,null,{"$f":"+C737+C739+C742","v":5008.8100000000004}]
[]
[null,"BDI:","%",{"$f":"+$F$7","v":"22,15%"},null,{"$f":"TRUNC((C737+C742)*D746,2)","v":15.98}]
[null,"BDI diferenciado:","%",{"$f":"+$F$8","v":0.13699999999999998},null,{"$f":"TRUNC(C739*D747,2)","v":676.32}]
[]
[null,"PREÇO:",null,null,null,{"$f":"+F744+F746+F747","v":5701.11}]
[]
[]
["CÓDIGO","DISCRIMINAÇÃO","UN","COEFIC.","UNITÁRIO","TOTAL"]
[3276,"REMADA ESPECIAL - GALVANIZADO","un"]
[{"$f":"CONCATENATE(\"COTAÇÃO \",Insumos!$B$48)","v":"COTAÇÃO 91"},"(APC) REMADA ESPECIAL","un",1,{"$f":"Cotações!N94","v":5940},{"$f":"TRUNC(D754*E754,2)","v":5940}]
["SUB-TOTAL - EQUIPAMENTO:",null,{"$f":"SUM(F754)","v":5940}]
["SINAPI C 88309","PEDREIRO C/ENCARGOS COMPLEMENTARES","h",0.5,{"$f":"Planilha_M.O.!E24","v":20.71},{"$f":"TRUNC(D756*E756,2)","v":10.35}]
["SINAPI C 88316","SERVENTE C/ ENCARGOS COMPLEMENTARES","h",0.5,{"$f":"Planilha_M.O.!E18","v":17.11},{"$f":"TRUNC(D757*E757,2)","v":8.5500000000000007}]
["SUB-TOTAL - MÃO-DE-OBRA:",null,{"$f":"SUM(F756:F757)","v":18.899999999999999}]
[]
[null,"CUSTO TOTAL:",null,null,null,{"$f":"+C755+C758","v":5958.9}]
[]
[null,"BDI:","%",{"$f":"+$F$7","v":"22,15%"},null,{"$f":"TRUNC(C758*D762,2)","v":4.18}]
[null,"BDI diferenciado:","%",{"$f":"+$F$8","v":0.13699999999999998},null,{"$f":"TRUNC(C755*D763,2)","v":813.78}]
[]
[null,"PREÇO:",null,null,null,{"$f":"+F760+F762+F763","v":6776.86}]
[]
["CÓDIGO","DISCRIMINAÇÃO","UN","COEFIC.","UNITÁRIO","TOTAL"]
[3280,"VOADOR PEITORAL E VOADOR DORSAL","un"]
[{"$f":"CONCATENATE(\"COTAÇÃO \",Insumos!$B$66)","v":"COTAÇÃO 113"},"CAÇAMBA 4,00 m³","un",2.1999999999999999E-2,{"$f":"+Insumos!$G$66","v":443.33},{"$f":"TRUNC(D769*E769,2)","v":9.75}]
[{"$f":"CONCATENATE(\"SINAPI C \",'Composições Aux. SINAPI'!$A$37)","v":"SINAPI C 94963"},"CONCRETO fck=15 MPa PREPARO COM BETONEIRA","m³",0.1012,{"$f":"+'Composições Aux. SINAPI'!$E$37:$F$37","v":332.32},{"$f":"TRUNC(D770*E770,2)","v":33.630000000000003}]
["SUB-TOTAL - MATERIAL:",null,{"$f":"SUM(F769:F770)","v":43.38}]
[{"$f":"CONCATENATE(\"COTAÇÃO \",Insumos!$B$51)","v":"COTAÇÃO 94"},"(APC) VOADOR PEITORAL E VOADOR DORSAL","un",1,{"$f":"Cotações!N97","v":6200},{"$f":"TRUNC(D772*E772,2)","v":6200}]
["SUB-TOTAL - EQUIPAMENTO:",null,{"$f":"SUM(F772)","v":6200}]
["SINAPI C 88309","PEDREIRO C/ENCARGOS COMPLEMENTARES","h",0.46,{"$f":"Planilha_M.O.!E24","v":20.71},{"$f":"TRUNC(D774*E774,2)","v":9.52}]
["SINAPI C 88316","SERVENTE C/ ENCARGOS COMPLEMENTARES","h",1.1253,{"$f":"Planilha_M.O.!E18","v":17.11},{"$f":"TRUNC(D775*E775,2)","v":19.25}]
["SUB-TOTAL - MÃO-DE-OBRA:",null,{"$f":"SUM(F774:F775)","v":28.77}]
[]
[null,"CUSTO TOTAL:",null,null,null,{"$f":"+C771+C773+C776","v":6272.1500000000005}]
[]
[null,"BDI:","%",{"$f":"+$F$7","v":"22,15%"},null,{"$f":"TRUNC((C771+C776)*D780,2)","v":15.98}]
[null,"BDI diferenciado:","%",{"$f":"+$F$8","v":0.13699999999999998},null,{"$f":"TRUNC(C773*D781,2)","v":849.4}]
[]
[null,"PREÇO:",null,null,null,{"$f":"+F778+F780+F781","v":7137.53}]
[]
[]
["CÓDIGO","DISCRIMINAÇÃO","UN","COEFIC.","UNITÁRIO","TOTAL"]
["SINAPI C 87897","CHAPISCO APLICADO EM ALVENARIA (SEM PRESENÇA DE VÃOS)","m²"]
["SINAPI C 87313","ARGAMASSA TRAÇO 1:3 (EM VOLUME DE CIMENTO E AREIA GROSSA ÚMIDA) PARA CHAPISCO CONVENCIONAL, PREPARO MECÂNICO COM BETONEIRA 400 L. AF_08/2019","m³",4.1999999999999997E-3,{"$f":"'Composições Aux. SINAPI'!E18:F18","v":426.85},{"$f":"TRUNC(D788*E788,2)","v":1.79}]
["SINAPI C 90668","PROJETOR PNEUMÁTICO DE ARGAMASSA PARA CHAPISCO E REBOCO COM RECIPIENTE ACOPLADO, TIPO CANEQUINHA, COM COMPRESSOR DE AR REBOCÁVEL VAZÃO 89 PCM E MOTOR DIESEL DE 20 CV - CHP DIURNO. AF_06/2015","chp",1.6999999999999999E-3,{"$f":"'Composições Aux. SINAPI'!E64:F64","v":22.32},{"$f":"TRUNC(D789*E789,2)","v":0.03}]
["SINAPI C 90669","PROJETOR PNEUMÁTICO DE ARGAMASSA PARA CHAPISCO E REBOCO COM RECIPIENTE ACOPLADO, TIPO CANEQUINHA, COM COMPRESSOR DE AR REBOCÁVEL VAZÃO 89 PCM E MOTOR DIESEL DE 20 CV - CHP DIURNO. AF_06/2015","chi",8.8400000000000006E-2,{"$f":"'Composições Aux. SINAPI'!E65:F65","v":5.89},{"$f":"TRUNC(D790*E790,2)","v":0.52}]
["SUB-TOTAL - MATERIAL / EQUIPAMENTOS:",null,{"$f":"SUM(F788:F790)","v":2.34}]
["SINAPI C 88309","PEDREIRO C/ENCARGOS COMPLEMENTARES","h",0.09,{"$f":"Planilha_M.O.!E24","v":20.71},{"$f":"TRUNC(D792*E792,2)","v":1.86}]
["SINAPI C 88316","SERVENTE C/ ENCARGOS COMPLEMENTARES","h",4.4999999999999998E-2,{"$f":"Planilha_M.O.!E18","v":17.11},{"$f":"TRUNC(D793*E793,2)","v":0.76}]
["SUB-TOTAL - MÃO-DE-OBRA:",null,{"$f":"SUM(F792:F793)","v":2.62}]
[]
[null,"CUSTO TOTAL:",null,null,null,{"$f":"+C791+C794","v":4.96}]
[]
[null,"BDI:","%",{"$f":"+$F$7","v":"22,15%"},null,{"$f":"TRUNC(F796*D798,2)","v":1.0900000000000001}]
[]
[null,"PREÇO:",null,null,null,{"$f":"+F796+F798","v":6.05}]
[]
[]
["CÓDIGO","DISCRIMINAÇÃO","UN","COEFIC.","UNITÁRIO","TOTAL"]
["SINAPI C 87794","EMBOÇO OU MASSA ÚNICA EM ARGAMASSA TRAÇO 1:2:8, PREPARO MANUAL","m²"]
["SINAPI C 87369","ARGAMASSA TRAÇO 1:2:8 (EM VOLUME DE CIMENTO, CAL E AREIA MÉDIA ÚMIDA) PARA EMBOÇO/MASSA ÚNICA/ASSENTAMENTO DE ALVENARIA DE VEDAÇÃO, PREPARO MANUAL. AF_08/2019","m³",2.93E-2,{"$f":"'Composições Aux. SINAPI'!E20:F20","v":498.67},{"$f":"TRUNC(D805*E805,2)","v":14.61}]
["SINAPI I 37411","TELA DE ACO SOLDADA GALVANIZADA/ZINCADA PARA ALVENARIA, FIO D = *1,24 MM, MALHA 25 X 25 MM","chp",0.15809999999999999,{"$f":"Insumos!G193","v":33.5},{"$f":"TRUNC(D806*E806,2)","v":5.29}]
["SUB-TOTAL - MATERIAL / EQUIPAMENTOS:",null,{"$f":"SUM(F805:F806)","v":19.899999999999999}]
["SINAPI C 88309","PEDREIRO C/ENCARGOS COMPLEMENTARES","h",0.4,{"$f":"Planilha_M.O.!E24","v":20.71},{"$f":"TRUNC(D808*E808,2)","v":8.2799999999999994}]
["SINAPI C 88316","SERVENTE C/ ENCARGOS COMPLEMENTARES","h",0.4,{"$f":"Planilha_M.O.!E18","v":17.11},{"$f":"TRUNC(D809*E809,2)","v":6.84}]
["SUB-TOTAL - MÃO-DE-OBRA:",null,{"$f":"SUM(F808:F809)","v":15.12}]
[]
[null,"CUSTO TOTAL:",null,null,null,{"$f":"+C807+C810","v":35.019999999999996}]
[]
[null,"BDI:","%",{"$f":"+$F$7","v":"22,15%"},null,{"$f":"TRUNC(F812*D814,2)","v":7.75}]
[]
[null,"PREÇO:",null,null,null,{"$f":"+F812+F814","v":42.769999999999996}]
[]
[]
["CÓDIGO","DISCRIMINAÇÃO","UN","COEFIC.","UNITÁRIO","TOTAL"]
["SINAPI C 88489","APLICAÇÃO MANUAL DE PINTURA COM TINTA LÁTEX ACRÍLICA EM PAREDES, DUAS DEMÃOS. AF_06/2014","m²"]
["SINAPI I 7356","TINTA ACRILICA PREMIUM","l",0.33,{"$f":"Insumos!G204","v":25.69},{"$f":"TRUNC(D821*E821,2)","v":8.4700000000000006}]
["SUB-TOTAL - MATERIAL / EQUIPAMENTOS:",null,{"$f":"SUM(F821:F821)","v":8.4700000000000006}]
["SINAPI C 88310","PINTOR C/ENCARGOS COMPLEMENTARES","h",0.187,{"$f":"Planilha_M.O.!E25","v":21.7},{"$f":"TRUNC(D823*E823,2)","v":4.05}]
["SINAPI C 88316","SERVENTE C/ ENCARGOS COMPLEMENTARES","h",6.9000000000000006E-2,{"$f":"Planilha_M.O.!E18","v":17.11},{"$f":"TRUNC(D824*E824,2)","v":1.18}]
["SUB-TOTAL - MÃO-DE-OBRA:",null,{"$f":"SUM(F823:F824)","v":5.2299999999999995}]
[]
[null,"CUSTO TOTAL:",null,null,null,{"$f":"+C822+C825","v":13.7}]
[]
[null,"BDI:","%",{"$f":"+$F$7","v":"22,15%"},null,{"$f":"TRUNC(F827*D829,2)","v":3.03}]
[]
[null,"PREÇO:",null,null,null,{"$f":"+F827+F829","v":16.73}]
[]
[]
["CÓDIGO","DISCRIMINAÇÃO","UN","COEFIC.","UNITÁRIO","TOTAL"]
[4105,"PLANTIO DE GRAMA CATARINA (SÃO MARCOS) COM COMPOSTO ORGÂNICO","m²"]
[{"$f":"CONCATENATE(\"SINAPI I \",Insumos!$B$111)","v":"SINAPI I 3322"},"GRAMA CATARINA","m²",1,{"$f":"+Insumos!$G$111","v":20.45},{"$f":"TRUNC(D836*E836,2)","v":20.45}]
[{"$f":"CONCATENATE(\"SINAPI I \",Insumos!$B$100)","v":"SINAPI I 38125"},"FERTILIZANTE ORGÂNICO COMPOSTO, CLASSE A","kg",3,{"$f":"Insumos!G100","v":1.33},{"$f":"TRUNC(D837*E837,2)","v":3.99}]
["SUB-TOTAL - MATERIAL:",null,{"$f":"SUM(F836:F837)","v":24.439999999999998}]
["SINAPI C 88441","JARDINEIRO C/ENCARGOS COMPLEMENTARES","h",3.9100000000000003E-2,{"$f":"Planilha_M.O.!E31","v":20},{"$f":"TRUNC(D839*E839,2)","v":0.78}]
["SINAPI C 88316","SERVENTE C/ ENCARGOS COMPLEMENTARES","h",0.15640000000000001,{"$f":"Planilha_M.O.!E18","v":17.11},{"$f":"TRUNC(D840*E840,2)","v":2.67}]
["SUB-TOTAL - MÃO-DE-OBRA:",null,{"$f":"SUM(F839:F840)","v":3.45}]
[]
[null,"CUSTO TOTAL:",null,null,null,{"$f":"+C838+C841","v":27.889999999999997}]
[]
[null,"BDI:","%",{"$f":"+$F$7","v":"22,15%"},null,{"$f":"TRUNC(F843*D845,2)","v":6.17}]
[]
[null,"PREÇO:",null,null,null,{"$f":"+F843+F845","v":34.059999999999995}]
[]
["CÓDIGO","DISCRIMINAÇÃO","UN","COEFIC.","UNITÁRIO","TOTAL"]
["SMAMS 4200","PLANTIO DE GRAMA ESMERALDA EM ROLO PARA CAMPO DE FUTEBOL","m²"]
["SINAPI I 3322"," GRAMA ESMERALDA OU SAO CARLOS OU CURITIBANA, EM PLACAS, SEM PLANTIO","m²",1,{"$f":"Insumos!G111","v":20.45},{"$f":"TRUNC(D851*E851,2)","v":20.45}]
["SINAPI I 25951","FERTILIZANTE NPK - 10:10:10","kg",0.1,{"$f":"Insumos!G101","v":2.25},{"$f":"TRUNC(D852*E852,2)","v":0.22}]
["SINAPI I 25963","CALCARIO DOLOMITICO A (POSTO PEDREIRA/FORNECEDOR, SEM FRETE)","kg",0.15,{"$f":"Insumos!G71","v":0.08},{"$f":"TRUNC(D853*E853,2)","v":0.01}]
["SINAPI I 38125","FERTILIZANTE ORGANICO COMPOSTO, CLASSE A","kg",3,{"$f":"Insumos!G100","v":1.33},{"$f":"TRUNC(D854*E854,2)","v":3.99}]
["SUB-TOTAL - MATERIAL / EQUIPAMENTOS:",null,{"$f":"SUM(F851:F854)","v":24.67}]
["SINAPI C 88441","JARDINEIRO C/ENCARGOS COMPLEMENTARES","h",0.1,{"$f":"Planilha_M.O.!E31","v":20},{"$f":"TRUNC(D856*E856,2)","v":2}]
["SINAPI C 88316","SERVENTE C/ ENCARGOS COMPLEMENTARES","h",0.1,{"$f":"Planilha_M.O.!E18","v":17.11},{"$f":"TRUNC(D857*E857,2)","v":1.71}]
["SUB-TOTAL - MÃO-DE-OBRA:",null,{"$f":"SUM(F856:F857)","v":3.71}]
[]
[null,"CUSTO TOTAL:",null,null,null,{"$f":"+C855+C858","v":28.380000000000003}]
[]
[null,"BDI:","%",{"$f":"+$F$7","v":"22,15%"},null,{"$f":"TRUNC(F860*D862,2)","v":6.28}]
[]
[null,"PREÇO:",null,null,null,{"$f":"+F860+F862","v":34.660000000000004}]

{"sheet":"Memória_Cálculo","index":3,"n_rows":362,"n_cols":7,"rows_kept":362,"cut":false,"hidden":false,"merged":[[6,1,6,8],[7,1,7,8]]}
[]
[]
[]
[]
[]
["MEMÓRIA DE CÁLCULO"]
["OBJETO:","Obras de Aquisição e Instalação de Academias de Ginástica ao ar livre na Praça "]
[null,"Grêmio Futebol Portoalegrense (110/03)"]
[]
["1 EXECUÇÃO DE ACADEMIA AO AR LIVRE PRAÇA GRÊMIO FUTEBOL PORTOALEGRENSE "]
[]
["1.1 ART"]
["DEVERÁ SER ELABORADA APENAS UMA ART PARA AS TRÊS ACADEMIAS."]
[]
[]
["1.2 REMOÇÃO DE ENTULHOS COM CAÇAMBA 4M³"]
[]
["ACADEMIA"]
["LARGURA (M)","COMPRIMENTO (M)","ÁREA (M²)","ESPESSURA (M)","VOLUME","EMPLOAMENTO 25%","VOLUME REMOÇÃO"]
[9,11,{"$f":"B20*A20","v":99},0.08,{"$f":"D20*C20","v":7.92},{"$f":"0.25*E20","v":1.98},{"$f":"F20+E20","v":9.9}]
[]
["PASSEIO"]
["LARGURA (M)","COMPRIMENTO (M)","ÁREA (M²)","ESPESSURA (M)","VOLUME","EMPLOAMENTO 25%","VOLUME REMOÇÃO"]
[1.4,3,{"$f":"B24*A24","v":4.1999999999999993},0.1,{"$f":"D24*C24","v":0.41999999999999993},{"$f":"0.25*E24","v":0.10499999999999998},{"$f":"F24+E24","v":0.52499999999999991}]
[]
[{"$nulls":6},"VOLUME TOTAL (M³)"]
[{"$nulls":6},{"$f":"G24+G20","v":10.425000000000001}]
["2.1 TAPUME EM CHAPA DE COMPENSADO RESINADO (L=10,00; C=10,00m e H=2,20M)"]
[]
["LARGURA (M)","COMPRIMENTO (M)","PERÍMETRO (M)","ALTURA H=2,20M","ÁREA(M²)"]
[10,10,{"$f":"A31*2+B31*2","v":40},2.2000000000000002,{"$f":"D31*C31","v":88}]
[]
["2.2  LOCAÇÃO DE SANITÁRIO QUÍMICO E 2.3 FRETE"]
[]
["QUANTIDADE","PRAZO","LIMPEZA / SEMANAIS","FRETE IDA","FRETE VOLTA"]
[1,"30 DIAS",3,1,1]
[]
["2.6 PLACA DE OBRA (PARA CONSTRUCAO CIVIL) EM CHAPA GALVANIZADA *N. 22*, ADESIVADA, DE *2,0 X 1,125* M"]
[]
["LARGURA (M)","ALTURA (M)","ÁREA(M²)"]
[2,1.25,{"$f":"B41*A41","v":2.5}]
[]
[]
["2.7 SINALIZAÇÃO COM TELA PLÁSTICA LARANJA FIXADA EM CONE PLÁSTICO"]
[]
["ACADEMIA"]
["LARGURA 1 (M)","LARGURA 2 (M)","COMPRIMENTO 1","COMPRIMENTO 2"]
[11,11,13,13]
[]
["PASSEIO"]
["COMPRIMENTO 1 (M)","COMPRIMENTO 2 (M)",null,"TOTAL TELA(M)"]
[3,3,null,{"$f":"B52+A52+A48+B48+C48+D48","v":54}]
[]
[]
["2.8 LOCAÇÃO DE OBRA"]
[]
["PISO ACADEMIA"]
["LARGURA (M)","LARGURA (M)","COMPRIMENTO (M)","COMPRIMENTO (M)"]
[9,9,11,11]
[]
["PASSEIO"]
["COMPRIMENTO (M)","COMPRIMENTO (M)",null,"TOTAL LOCAÇÃO (M)"]
[6,3,null,{"$f":"B63+A63+A59+B59+C59+D59","v":49}]
[]
[]
["2.8 NIVELAMENTO"]
[]
["ACADEMIA ÁREA","PASSEIO ÁREA (M²)","GRAMA ÁREA","PODOTAIL ÁREA","TOTAL (M²)"]
[{"$f":"C106","v":99},{"$f":"B88","v":4.1999999999999993},{"$f":"C88","v":48.5},{"$f":"12*0.25*0.25","v":0.75},{"$f":"C69+B69+A69+D69","v":152.44999999999999}]
[]
[]
["3 ADMINISTRAÇÃO LOCAL"]
["ENGENHEIRO"]
["DIAS","MESES","HORAS / DIA","TOTAL","PERCENTUAL","COEFICIENTE"]
[22,1,2,{"$f":"C75*A75","v":44},100,{"$f":"D75/E75","v":0.44}]
[]
["ENCARREGADO"]
["PRAZO OBRA","MESES","PERCENTUAL","COEFICIENTE"]
["30 DIAS",1,100,{"$f":"B79/C79","v":0.01}]
[]
["VIGIA NOTURNO"]
["PRAZO OBRA","HORAS / DIA","TOTAL HORAS","PERCENTUAL","COEFICIENTE"]
[30,10,{"$f":"B83*A83","v":300},100,{"$f":"C83/D83","v":3}]
[null,null,null," "]
["4.1 MODELAGEM (MOVIMENTO DE TERRA ATÉ 15CM)"]
[]
["ACADEMIA ÁREA","PASSEIO ÁREA (M²)","GRAMA ÁREA","PODOTAIL ÁREA","TOTAL (M²)"]
[{"$f":"C106","v":99},{"$f":"C100","v":4.1999999999999993},{"$f":"C135","v":48.5},{"$f":"12*0.25*0.25","v":0.75},{"$f":"C88+B88+A88+D88","v":152.44999999999999}]
[]
["4.2 ATERRO MECÂNICO COM MATERIAL IMPORTADO COM COMPACTAÇÃO MECÂNICA"]
[]
["LARGURA (M)","COMPRIMENTO (M)","ÁREA (M²)","ALTURA ATERRO","VOLUME (M³)"]
[9,11,{"$f":"A93*B93","v":99},0.1,{"$f":"D93*C93","v":9.9}]
[]
[]
["5.1 EXECUÇÃO DE PASSEIO (CALÇADA) OU PISO DE CONCRETO COM CONCRETO MOLDADO IN LOCO, "]
["FEITO EM OBRA, ACABAMENTO CONVENCIONAL, ESPESSURA 8 CM, ARMADO"]
[]
["LARGURA (M)","COMPRIMENTO (M)","ÁREA(M²)"]
[1.4,3,{"$f":"B100*A100","v":4.1999999999999993}]
[]
[]
["5.2 PISO CONCRETO ARMADO E= 10 cm - ACADEMIA AO AR LIVRE"]
[]
["LARGURA","COMPRIMENTO","ÁREA (M²)"]
[9,11,{"$f":"A106*B106","v":99}]
[]
[]
["5.3 PISO PODOTÁTIL 25x25 cm"]
["QUATDADE PEÇAS","DIMENSÕES","COMPRIMENTO (M)"]
[12,0.25,{"$f":"B111*A111","v":3}]
[]
["8.1 PLANTIO DE GRAMA CATARINA COM COMPOSTO ORGANICO"]
[]
["LARGURA (M)","COMPRIMENTO (M)","ÁREA(M²)"]
[1,11,{"$f":"B116*A116","v":11}]
[]
["LARGURA (M)","COMPRIMENTO (M)","ÁREA(M²)"]
[1,11,{"$f":"B119*A119","v":11}]
[]
["LARGURA (M)","COMPRIMENTO (M)","ÁREA(M²)"]
[1,{"$f":"11-1.5","v":9.5},{"$f":"B122*A122","v":9.5}]
[]
["LARGURA (M)","COMPRIMENTO (M)","ÁREA(M²)"]
[1,11,{"$f":"B125*A125","v":11}]
[]
["PASSEIO"]
["LARGURA (M)","COMPRIMENTO (M)","ÁREA(M²)"]
[1,3,{"$f":"B129*A129","v":3}]
[]
["LARGURA (M)","COMPRIMENTO (M)","ÁREA(M²)"]
[1,3,{"$f":"B132*A132","v":3}]
[]
[null,null,"ATOTAL (M²)"]
[null,null,{"$f":"C116+C119+C122+C125+C129+C132","v":48.5}]
[]
["9 EXECUÇÃO DE ACADEMIA AO AR LIVRE PRAÇA GUIA LOPES (118/08)"]
["9.1 DEMOLIÇÃO DE MURETAS E CANTEIRO"]
["CANTEIRO DIREITA (CD)"]
["LARGURA 1 (M)","LARGURA 2 (M)","LARGURA 1 (M)","TOTAL (M)","ALTURA (M)"]
[6.05,6.23,6.04,{"$f":"C141+B141+A141","v":18.32},0.45]
[]
["VOLUME (M³)","EMPOLAMENTO 25%","REMOÇÃO SUBTOTAL (M³)"]
[{"$f":"D141*E141","v":8.2439999999999998},{"$f":"A144*0.25","v":2.0609999999999999},{"$f":"B144+A144","v":10.305}]
[]
[]
["9.2 REMOÇÃO DE ENTULHOS COM CAÇAMBA 4M³"]
[]
["REMOÇÃO DO MATERIAL ORIUNDO DO CANTEIROS INTEGRL (CD)"]
["TOTAL CANTEIRO CD",{"$f":"C144","v":10.305}]
[]
["REMOÇÃO DE 8 CM DE SAIBRO NA ÁREA DA ACADEMIA"]
["LARGURA (M)","COMPRIMENTO (M)","ALTURA(M)","VOLUME","EMPOL. 25%","TOTAL (M³)"]
[5.9,17.8,0.08,{"$f":"C154*B154*A154","v":8.401600000000002},{"$f":"D154*0.25","v":2.1004000000000005},{"$f":"E154+D154","v":10.502000000000002}]
[{"$nulls":6},"TOTAL (M³)"]
["REMOÇÃO DE 40 CM DE SOLO ORIUNDO DO CANTEIRO LADO DIREITO",{"$nulls":5},{"$f":"B150+F154+F158","v":39.013100000000001}]
["LARGURA (M)","COMPRIMENTO (M)","ALTURA(M)","VOLUME (M3)","EMPOL. 25%","TOTAL (M³)"]
[5.94,6.13,0.4,{"$f":"C158*B158*A158","v":14.56488},{"$f":"D158*0.25","v":3.6412200000000001},{"$f":"E158+D158","v":18.206099999999999}]
[]
["10.1 TAPUME EM CHAPA DE COMPENSADO RESINADO (L=10,00; C=10,00m e H=2,20M)"]
[]
["LARGURA (M)","COMPRIMENTO (M)","PERÍMETRO (M)","ALTURA H=2,20M","ÁREA(M²)"]
[10,10,{"$f":"A163*2+B163*2","v":40},2.2000000000000002,{"$f":"D163*C163","v":88}]
[]
[]
["10.6 PLACA DE OBRA (PARA CONSTRUCAO CIVIL) EM CHAPA GALVANIZADA *N. 22*, ADESIVADA, DE *2,0 X 1,125* M"]
[]
["LARGURA (M)","ALTURA (M)","ÁREA(M²)"]
[2,1.25,{"$f":"B169*A169","v":2.5}]
[]
[]
["10.7 SINALIZAÇÃO COM TELA PLÁSTICA LARANJA FIXADA EM CONE PLÁSTICO"]
[null,"COMPRIMENTO 1 (M)"]
[null,6.9]
[]
[null,"COMPRIMENTO 2 (M)"]
[null,6.9,null,"COMPRIMENTO TOTAL (M)"]
[null,null,null,{"$f":"B174+B177+B180+B183","v":49.400000000000006}]
[null,"COMPRIMENTO 3 (M)"]
[null,17.8]
[]
[null,"COMPRIMENTO 4 (M)"]
[null,17.8]
["SERÁ UTILIZADA NO PERÍMETRO DO PISO DE CONCRETO DA ACADEMIA"]
[]
[]
["10.8 LOCAÇÃO DE OBRA"]
[]
["PISO ACADEMIA"]
["LARGURA (M)","LARGURA (M)","COMPRIMENTO (M)","COMPRIMENTO (M)"]
[5.9,5.9,17.8,17.8]
[]
["SAIBRO"]
["COMPRIMENTO (M)",null,"TOTAL LOCAÇÃO (M)"]
[17.8,null,{"$f":"+A195+A191+B191+C191+D191","v":65.2}]
[]
[]
["10.9 NIVELAMENTO"]
[]
["ACADEMIA ÁREA (M²)","REPOSIÇÃO SAIBRO ROSA","TOTAL (M²)"]
[{"$f":"C240","v":105.02000000000001},{"$f":"B220","v":62.686000000000007},{"$f":"B201+A201","v":167.70600000000002}]
[]
[]
["11.1 ADMINISTRAÇÃO LOCAL"]
["ENGENHEIRO"]
["DIAS","MESES","HORAS / DIA","TOTAL","PERCENTUAL","COEFICIENTE"]
[22,1,2,{"$f":"C207*A207","v":44},100,{"$f":"D207/E207","v":0.44}]
[]
["ENCARREGADO"]
["PRAZO OBRA","MESES","PERCENTUAL","COEFICIENTE"]
["30 DIAS",1,100,{"$f":"B211/C211","v":0.01}]
[]
["VIGIA NOTURNO"]
["PRAZO OBRA","HOAS / DIA","TOTAL HORAS","PERCENTUAL","COEFICIENTE"]
[30,10,{"$f":"B215*A215","v":300},100,{"$f":"C215/D215","v":3}]
[null,null,null," "]
["12.1 MODELAGEM (MOVIMENTO DE TERRA ATÉ 15CM)"]
[]
["ACADEMIA ÁREA (M²)","RECOMPOSIÇÃO SAIBRO ROSA","TOTAL (M²)"]
[{"$f":"C240","v":105.02000000000001},{"$f":"E234","v":62.686000000000007},{"$f":"B220+A220","v":167.70600000000002}]
[]
[]
["12.2 ATERRO MECÂNICO COM MATERIAL IMPORTADO COM COMPACTAÇÃO MECÂNICA"]
[]
["LARGURA","COMPRIMENTO","ÁREA (M²)","ALTURA ATERRO","VOLUME (M³)"]
[5.9,17.8,{"$f":"A226*B226","v":105.02000000000001},0.1,{"$f":"D226*C226","v":10.502000000000002}]
[]
["13.1 REPOSIÇÃO DE SAIBRO ROSA - COMPACTAÇÃO MECÂNICA - E= 6 CM"]
[]
[]
["COMPRIMENTO 1 (M)","LARGURA (M)","ÁREA (M²)"]
[5.9,2.66,{"$f":"B232*A232","v":15.694000000000003}]
[{"$nulls":4},"ÁREA TOTAL (M²)"]
["COMPRIMENTO 2 (M)","LARGURA (M)","ÁREA (M²)",null,{"$f":"C235+C232","v":62.686000000000007}]
[17.8,2.64,{"$f":"B235*A235","v":46.992000000000004}]
[]
["13.2 PISO CONCRETO ARMADO E= 10 cm - ACADEMIA AO AR LIVRE"]
[]
["LARGURA","COMPRIMENTO","ÁREA (M²)"]
[5.9,17.8,{"$f":"A240*B240","v":105.02000000000001}]
[]
[]
["16.1 CHAPISCO APLICADO EM ALVENARIA (SEM PRESENÇA DE VÃOS)"]
[]
["LARGURA (M)","ALTURA (M)","ÁREA(M²)"]
[6.23,1.35,{"$f":"B246*A246","v":8.4105000000000008}]
[]
[]
["16.2 EMBOÇO OU MASSA ÚNICA EM ARGAMASSA TRAÇO 1:2:8, PREPARO MANUAL"]
[]
["LARGURA (M)","ALTURA (M)","ÁREA(M²)"]
[6.23,1.35,{"$f":"B252*A252","v":8.4105000000000008}]
[]
[]
["16.3 APLICAÇÃO MANUAL DE PINTURA COM TINTA LÁTEX ACRÍLICA EM PAREDES, DUAS DEMÃOS. AF_06/2014"]
[]
["LARGURA (M)","ALTURA (M)","ÁREA(M²)"]
[17.8,1.35,{"$f":"B258*A258","v":24.03}]
[]
["17 EXECUÇÃO DE ACADEMIA AO AR LIVRE PRAÇA SIMÕES LOPES NETO"]
[]
["17.1 REMOÇÃO BANCO S/ ENCOSTO - TIPO A"]
[]
["QUANTIDADE BANCOS SEM ENCOSTO TIPO A"]
["QTDADE"]
[1]
[]
[]
["17.2 REMOÇÃO DE ENTULHOS COM CAÇAMBA 4M³"]
["REFERE-SE AO DESCARTE DE ENTUHLO ORIUNDO DA DEMOLIÇÃO DE PARTE DO PASSEIO GRES"]
[]
["ÁREA TOTAL (M²)","ESPESSURA (M)","VOLUME (M³)","EMPLOLAM(25%)","TOTAL VOLUME (M³)"]
[{"$f":"C346","v":50},0.08,{"$f":"B273*A273","v":4},{"$f":"C273*0.24","v":0.96},{"$f":"D273+C273","v":4.96}]
[]
[]
["18.1 TAPUME EM CHAPA DE COMPENSADO RESINADO (L=7,70m; C=11,00 m e H=2,20M)"]
[]
["LARGURA (M)","COMPRIMENTO (M)","PERÍMETRO (M)","ALTURA H=2,20M","ÁREA(M²)"]
[7.7,11,{"$f":"A279*2+B279*2","v":37.4},2.2000000000000002,{"$f":"D279*C279","v":82.28}]
[]
[]
["18.6 PLACA DE OBRA (PARA CONSTRUCAO CIVIL) EM CHAPA GALVANIZADA *N. 22*, ADESIVADA, DE *2,0 X 1,125* M"]
[]
["LARGURA (M)","ALTURA (M)","ÁREA(M²)"]
[2,1.25,{"$f":"B285*A285","v":2.5}]
[]
[]
["18.7 SINALIZAÇÃO COM TELA PLÁSTICA LARANJA FIXADA EM CONE PLÁSTICO"]
[]
["LARGURA 1 (M)","COMPRIMENTO 1 (M)"]
[6,11]
[]
["LARGURA 2 (M)",null,"COMPRIM TOTAL"]
[6,null,{"$f":"A291+B291+A294","v":23}]
[]
[]
["18.8 LOCAÇÃO DE OBRA"]
[]
["PISO ACADEMIA"]
["LARGURA (M)","LARGURA (M)","COMPRIMENTO (M)","COMPRIMENTO (M)"]
[5,5,10,10]
[]
[]
[null,null,null,"TOTAL LOCAÇÃO (M)"]
[null,null,null,{"$f":"B305+A305+A301+B301+C301+D301","v":30}]
[]
["18.9 NIVELAMENTO"]
[]
["ACADEMIA ÁREA","GRAMA ÁREA","TOTAL (M²)"]
[{"$f":"C346","v":50},{"$f":"B335","v":21},{"$f":"B310+A310","v":71}]
[]
[]
["19.1 ADMINISTRAÇÃO LOCAL SIMÕES LOPES NETO"]
["ENGENHEIRO"]
["DIAS","MESES","HORAS / DIA","TOTAL","PERCENTUAL","COEFICIENTE"]
[22,1,2,{"$f":"C316*A316","v":44},100,{"$f":"D316/E316","v":0.44}]
[]
["ENCARREGADO"]
["PRAZO OBRA","MESES","PERCENTUAL","COEFICIENTE"]
["30 DIAS",1,100,{"$f":"B320/C320","v":0.01}]
[]
["VIGIA NOTURNO"]
["PRAZO OBRA","HOAS / DIA","TOTAL HORAS","PERCENTUAL","COEFICIENTE"]
[30,10,{"$f":"B324*A324","v":300},100,{"$f":"C324/D324","v":3}]
[]
["CONSUMO DE ENERGIA ELÉTRICA"]
["FOI CONSIDERADO 250 KW.H PARA EXECUÇÃO DA ACADEMIA QUE POSSUI DIMENSÕES INFERIORES AS DEMAIS"]
[]
["PRAZO OBRA","1% OBRA","ENERGIA","COEFICIENTE"]
[1,{"$f":"1/100","v":0.01},250,{"$f":"C330*B330","v":2.5}]
[null,null,null," "]
["20.1 MODELAGEM (MOVIMENTO DE TERRA ATÉ 15CM)"]
[]
["ACADEMIA ÁREA","GRAMA ÁREA","TOTAL (M²)"]
[{"$f":"C346","v":50},{"$f":"C362","v":21},{"$f":"B335+A335","v":71}]
[]
["CONSUMO DE AGUA TRATADA"]
["FOI CONSIDERADO 40 M³ DE AGUA PARA EXECUÇÃO DA ACADEMIA QUE POSSUI DIMENSÕES INFERIORES AS DEMAIS"]
[]
["PRAZO OBRA","1% OBRA","AGUA","COEFICIENTE"]
[1,{"$f":"1/100","v":0.01},40,{"$f":"C341*B341","v":0.4}]
[]
["21.1 PISO CONCRETO ARMADO E= 10 cm - ACADEMIA AO AR LIVRE"]
[]
["LARGURA","COMPRIMENTO","ÁREA (M²)"]
[5,10,{"$f":"A346*B346","v":50}]
[]
["24.1 PLANTIO DE GRAMA CATARINA COM COMPOSTO ORGANICO"]
[]
["LARGURA (M)","COMPRIMENTO (M)","ÁREA 1(M²)"]
[1,11,{"$f":"B351*A351","v":11}]
[]
["LARGURA (M)","COMPRIMENTO (M)","ÁREA 2 (M²)"]
[1,5,{"$f":"B354*A354","v":5}]
[]
["LARGURA (M)","COMPRIMENTO (M)","ÁREA 3 (M²)"]
[1,5,{"$f":"B357*A357","v":5}]
[]
["Não haverá recomposição de grama junto ao telamento"]
[]
["A área total é a soma das áreas:",null,"A TOTAL (M²)"]
[null,null,{"$f":"C351+C354+C357+C360","v":21}]

{"sheet":"Composições Aux. SINAPI","index":4,"n_rows":80,"n_cols":6,"rows_kept":80,"cut":false,"hidden":false,"merged":[[43,4,43,5],[44,4,44,5],[59,4,59,5],[45,4,45,5],[46,4,46,5],[48,4,48,5],[57,4,57,5],[47,4,47,5],[55,4,55,5],[54,4,54,5],[63,4,63,5],[64,4,64,5],[31,4,31,5],[32,4,32,5],[33,4,33,5],[34,4,34,5],[41,4,41,5],[36,4,36,5],[40,4,40,5],[35,4,35,5],[62,4,62,5],[49,4,49,5],[42,4,42,5],[51,4,51,5],[53,4,53,5],[60,4,60,5],[19,4,19,5],[17,4,17,5],[16,4,16,5],[28,4,28,5],[29,4,29,5],[24,4,24,5],[26,4,26,5],[79,4,79,5],[50,4,50,5],[65,4,65,5],[66,4,66,5],[67,4,67,5],[68,4,68,5],[73,4,73,5],[74,4,74,5],[56,4,56,5],[78,4,78,5],[71,4,71,5],[72,4,72,5],[76,4,76,5],[69,4,69,5],[70,4,70,5],[58,4,58,5],[0,0,0,5],[1,0,1,5],[2,0,2,5],[3,0,3,5],[4,0,4,2],[5,0,6,1],[5,4,6,4],[5,5,6,5],[7,0,7,5],[8,0,14,1],[8,2,14,2],[8,3,14,3],[8,4,14,5],[77,4,77,5],[52,4,52,5],[27,4,27,5],[75,4,75,5],[15,4,15,5],[18,4,18,5],[38,4,38,5],[39,4,39,5],[20,4,20,5],[21,4,21,5],[25,4,25,5],[23,4,23,5],[22,4,22,5],[30,4,30,5],[37,4,37,5],[61,4,61,5]]}
["COMPOSIÇÕES AUXILIARES"]
[]
["Data Base SINAPI: JUNHO 2021 - Data Base das Cotações: Junho 2021"]
[]
[]
[{"$f":"+Planilha_M.O.!$D$5","v":"s/desoneração"},null,"Leis Sociais Horistas:",{"$f":"+Planilha_M.O.!$D$7","v":1.111},"BDI=",{"$f":"+Planilha_M.O.!$F$7","v":"22,15%"}]
[null,null,"Leis Sociais Mensalistas:",{"$f":"+Planilha_M.O.!$D$8","v":0.69159999999999999}]
[]
[{"$f":"+E16","v":"JUNHO / 2021"},null,"Vem da aba Comp.SINAPI c_des.","Vem da aba Comp.SINAPI s_des.","Valor utilizado na composição"]
[]
[]
[]
[]
[]
[]
["Código SINAPI","Composição","Custo (c/desoneração)","Custo (s/desoneração)",{"$f":"+Planilha_M.O.!$E$17","v":"JUNHO / 2021"}]
[87292,"ARGAMASSA TRAÇO 1:2:8 (EM VOLUME DE CIMENTO, CAL E AREIA MÉDIA ÚMIDA) PARA EMBOÇO/MASSA ÚNICA/ASSENTAMENTO DE ALVENARIA DE VEDAÇÃO, PREPARO MECÂNICO COM BETONEIRA 400 L. AF_08/2019",399.47,410.14,{"$f":"IF(Planilha_M.O.!$D$5=\"c/desoneração\",C17,(IF(Planilha_M.O.!$D$5=\"s/desoneração\",D17)))","v":410.14}]
[87313,"ARGAMASSA TRAÇO 1:3 (EM VOLUME DE CIMENTO E AREIA GROSSA ÚMIDA) PARA CHAPISCO CONVENCIONAL, PREPARO MECÂNICO COM BETONEIRA 400 L. AF_08/2019",416.61,426.85,{"$f":"IF(Planilha_M.O.!$D$5=\"c/desoneração\",C18,(IF(Planilha_M.O.!$D$5=\"s/desoneração\",D18)))","v":426.85}]
[87335,"ARGAMASSA TRAÇO 1:2:8 (CIMENTO, CAL E AREIA MÉDIA) PARA EMBOÇO/MASSA ÚNICA/ASSENTAMENTO DE ALVENARIA DE VEDAÇÃO, PREPARO MECÂNICO",395.78,407.54,{"$f":"IF(Planilha_M.O.!$D$5=\"c/desoneração\",C19,(IF(Planilha_M.O.!$D$5=\"s/desoneração\",D19)))","v":407.54}]
[87369,"ARGAMASSA TRAÇO 1:2:8 (EM VOLUME DE CIMENTO, CAL E AREIA MÉDIA ÚMIDA) PARA EMBOÇO/MASSA ÚNICA/ASSENTAMENTO DE ALVENARIA DE VEDAÇÃO, PREPARO MANUAL. AF_08/2019",479.13,498.67,{"$f":"IF(Planilha_M.O.!$D$5=\"c/desoneração\",C20,(IF(Planilha_M.O.!$D$5=\"s/desoneração\",D20)))","v":498.67}]
[88629,"ARGAMASSA TRAÇO 1:3 (CIMENTO E AREIA MÉDIA), PREPARO MANUAL",513.4,528.49,{"$f":"IF(Planilha_M.O.!$D$5=\"c/desoneração\",C21,(IF(Planilha_M.O.!$D$5=\"s/desoneração\",D21)))","v":528.49}]
[88630,"ARGAMASSA TRAÇO 1:4 (CIMENTO E AREIA MÉDIA), PREPARO MECÂNICO COM BETONEIRA 400 L",372.59,380.55,{"$f":"IF(Planilha_M.O.!$D$5=\"c/desoneração\",C22,(IF(Planilha_M.O.!$D$5=\"s/desoneração\",D22)))","v":380.55}]
[88631,"ARGAMASSA TRAÇO 1:4 (EM VOLUME DE CIMENTO E AREIA MÉDIA ÚMIDA), PREPARO MANUAL",453.47,468.06,{"$f":"IF(Planilha_M.O.!$D$5=\"c/desoneração\",C23,(IF(Planilha_M.O.!$D$5=\"s/desoneração\",D23)))","v":468.06}]
[100578,"ASSENTAMENTO DE POSTE DE CONCRETO COM COMPRIMENTO NOMINAL DE 9 m",400.08,412.48,{"$f":"IF(Planilha_M.O.!$D$5=\"c/desoneração\",C24,(IF(Planilha_M.O.!$D$5=\"s/desoneração\",D24)))","v":412.48}]
[88830,"BETONEIRA 400 l, POTÊNCIA 2 cv, SEM CARREGADOR (chp)",1.65,1.65,{"$f":"IF(Planilha_M.O.!$D$5=\"c/desoneração\",C25,(IF(Planilha_M.O.!$D$5=\"s/desoneração\",D25)))","v":1.65}]
[88831,"BETONEIRA 400 l, POTÊNCIA 2 cv, SEM CARREGADOR (chi)",0.28000000000000003,0.28000000000000003,{"$f":"IF(Planilha_M.O.!$D$5=\"c/desoneração\",C26,(IF(Planilha_M.O.!$D$5=\"s/desoneração\",D26)))","v":0.28000000000000003}]
[91933,"CABO DE COBRE FLEXÍVEL ISOLADO, 10 mm², ANTI-CHAMA 0,6/1,0 kV",15.88,16.22,{"$f":"IF(Planilha_M.O.!$D$5=\"c/desoneração\",C27,(IF(Planilha_M.O.!$D$5=\"s/desoneração\",D27)))","v":16.22}]
[95676,"CAIXA EM CONCRETO PRÉ-MOLDADO PARA ABRIGO DE HIDRÔMETRO COM DN 20 (½\u0094)",92.66,93.49,{"$f":"IF(Planilha_M.O.!$D$5=\"c/desoneração\",C28,(IF(Planilha_M.O.!$D$5=\"s/desoneração\",D28)))","v":93.49}]
[91387,"CAMINHÃO BASCULANTE 10 M3, TRUCADO CABINE SIMPLES, PESO BRUTO TOTAL 23.000 KG, CARGA ÚTIL MÁXIMA 15.935 KG, DISTÂNCIA ENTRE EIXOS 4,80 M, POTÊNCIA 230 CV INCLUSIVE CAÇAMBA METÁLICA - CHI DIURNO. AF_06/2014",44.73,47.29,{"$f":"IF(Planilha_M.O.!$D$5=\"c/desoneração\",C29,(IF(Planilha_M.O.!$D$5=\"s/desoneração\",D29)))","v":47.29}]
[91386,"CAMINHÃO BASCULANTE 10 M3, TRUCADO CABINE SIMPLES, PESO BRUTO TOTAL 23.000 KG, CARGA ÚTIL MÁXIMA 15.935 KG, DISTÂNCIA ENTRE EIXOS 4,80 M, POTÊNCIA 230 CV INCLUSIVE CAÇAMBA METÁLICA - CHP DIURNO. AF_06/2014",183.24,185.8,{"$f":"IF(Planilha_M.O.!$D$5=\"c/desoneração\",C30,(IF(Planilha_M.O.!$D$5=\"s/desoneração\",D30)))","v":185.8}]
[91383,"CAMINHÃO BASCULANTE 10 M3, TRUCADO CABINE SIMPLES, PESO BRUTO TOTAL 23.000 KG, CARGA ÚTIL MÁXIMA 15.935 KG, DISTÂNCIA ENTRE EIXOS 4,80 M, POTÊNCIA 230 CV INCLUSIVE CAÇAMBA METÁLICA - MANUTENÇÃO. AF_06/2014",37.549999999999997,37.549999999999997,{"$f":"IF(Planilha_M.O.!$D$5=\"c/desoneração\",C31,(IF(Planilha_M.O.!$D$5=\"s/desoneração\",D31)))","v":37.549999999999997}]
[91533,"COMPACTADOR DE SOLOS DE PERCUSSÃO C/MOTOR A GASOLINA, POTÊNCIA 4 cv (chp)",29.27,32.03,{"$f":"IF(Planilha_M.O.!$D$5=\"c/desoneração\",C32,(IF(Planilha_M.O.!$D$5=\"s/desoneração\",D32)))","v":32.03}]
[91534,"COMPACTADOR DE SOLOS DE PERCUSSÃO C/MOTOR A GASOLINA, POTÊNCIA 4 cv (chi)",22.05,24.83,{"$f":"IF(Planilha_M.O.!$D$5=\"c/desoneração\",C33,(IF(Planilha_M.O.!$D$5=\"s/desoneração\",D33)))","v":24.83}]
[5953,"COMPRESSOR DE AR REBOCÁVEL, VAZÃO 189 PCM, PRESSÃO EFETIVA DE TRABALHO 102 PSI, MOTOR DIESEL, POTÊNCIA 63 CV - CHP DIURNO",41.39,41.39,{"$f":"IF(Planilha_M.O.!$D$5=\"c/desoneração\",C34,(IF(Planilha_M.O.!$D$5=\"s/desoneração\",D34)))","v":41.39}]
[5954,"COMPRESSOR DE AR REBOCÁVEL, VAZÃO 189 PCM, PRESSÃO EFETIVA DE TRABALHO 102 PSI, MOTOR DIESEL, POTÊNCIA 63 CV - CHI DIURNO",3.73,3.73,{"$f":"IF(Planilha_M.O.!$D$5=\"c/desoneração\",C35,(IF(Planilha_M.O.!$D$5=\"s/desoneração\",D35)))","v":3.73}]
[94962,"CONCRETO MAGRO PARA LASTRO, TRAÇO 1:4,5:4,5 (EM MASSA SECA DE CIMENTO/ AREIA MÉDIA/ BRITA 1) - PREPARO MECÂNICO COM BETONEIRA 400 L. AF_05/2021",286.89,294.52999999999997,{"$f":"IF(Planilha_M.O.!$D$5=\"c/desoneração\",C36,(IF(Planilha_M.O.!$D$5=\"s/desoneração\",D36)))","v":294.52999999999997}]
[94963,"CONCRETO fck = 15MPa, TRAÇO 1:3,4:3,5 (CIMENTO/ AREIA MÉDIA/ BRITA 1) - PREPARO MECÂNICO COM BETONEIRA 400 l",324.74,332.32,{"$f":"IF(Planilha_M.O.!$D$5=\"c/desoneração\",C37,(IF(Planilha_M.O.!$D$5=\"s/desoneração\",D37)))","v":332.32}]
[94964,"CONCRETO FCK = 20MPA, TRAÇO 1:2,7:3 (CIMENTO/ AREIA MÉDIA/ BRITA 1) - PREPARO MECÂNICO COM BETONEIRA 400 L. AF_07/2016",360.31,368.57,{"$f":"IF(Planilha_M.O.!$D$5=\"c/desoneração\",C38,(IF(Planilha_M.O.!$D$5=\"s/desoneração\",D38)))","v":368.57}]
[91283,"CORTADORA DE PISO, POTÊNCIA 13 hp, C/DISCO DE CORTE DIAMANTADO 350 mm (chp)",21.82,21.82,{"$f":"IF(Planilha_M.O.!$D$5=\"c/desoneração\",C39,(IF(Planilha_M.O.!$D$5=\"s/desoneração\",D39)))","v":21.82}]
[91285,"CORTADORA DE PISO, POTÊNCIA 13 hp, C/DISCO DE CORTE DIAMANTADO 350 mm (chi)",0.84,0.84,{"$f":"IF(Planilha_M.O.!$D$5=\"c/desoneração\",C40,(IF(Planilha_M.O.!$D$5=\"s/desoneração\",D40)))","v":0.84}]
[92791,"CORTE E DOBRA DE AÇO CA-60, DIÂMETRO DE 5,0 MM, UTILIZADO EM ESTRUTURAS DIVERSAS, EXCETO LAJES (4,2 mm, 5 mm, 6 mm e 7 mm)",13.82,14,{"$f":"IF(Planilha_M.O.!$D$5=\"c/desoneração\",C41,(IF(Planilha_M.O.!$D$5=\"s/desoneração\",D41)))","v":14}]
[92794,"CORTE E DOBRA DE AÇO CA-50, DIÂMETRO DE 10,0 MM, UTILIZADO EM ESTRUTURAS DIVERSAS, EXCETO LAJES",13.68,13.71,{"$f":"IF(Planilha_M.O.!$D$5=\"c/desoneração\",C42,(IF(Planilha_M.O.!$D$5=\"s/desoneração\",D42)))","v":13.71}]
[96977,"CORDOALHA DE COBRE NU 50 mm², ENTERRADA, SEM ISOLADOR",49.98,50.13,{"$f":"IF(Planilha_M.O.!$D$5=\"c/desoneração\",C43,(IF(Planilha_M.O.!$D$5=\"s/desoneração\",D43)))","v":50.13}]
[91917,"CURVA 90° PARA ELETRODUTO, PVC, ROSCÁVEL, DN 32 mm (1\")",13.83,14.99,{"$f":"IF(Planilha_M.O.!$D$5=\"c/desoneração\",C44,(IF(Planilha_M.O.!$D$5=\"s/desoneração\",D44)))","v":14.99}]
[91919,"CURVA 180° P/ELETRODUTO, PVC, ROSCÁVEL, DN 32 mm (1\"\u0094)",15.82,16.98,{"$f":"IF(Planilha_M.O.!$D$5=\"c/desoneração\",C45,(IF(Planilha_M.O.!$D$5=\"s/desoneração\",D45)))","v":16.98}]
[95282,"DESEMPENADEIRA DE CONCRETO, PESO DE 75KG, 4 PÁS, MOTOR A GASOLINA, POTÊNCIA 5,5 HP - CHP DIURNO",9.33,9.33,{"$f":"IF(Planilha_M.O.!$D$5=\"c/desoneração\",C46,(IF(Planilha_M.O.!$D$5=\"s/desoneração\",D46)))","v":9.33}]
[95283,"DESEMPENADEIRA DE CONCRETO, PESO DE 75KG, 4 PÁS, MOTOR A GASOLINA, POTÊNCIA 5,5 HP - CHI DIURNO",0.49,0.49,{"$f":"IF(Planilha_M.O.!$D$5=\"c/desoneração\",C47,(IF(Planilha_M.O.!$D$5=\"s/desoneração\",D47)))","v":0.49}]
[93673,"DISJUNTOR TRIPOLAR TIPO DIN, CORRENTE NOMINAL DE 50 A",91.7,94.12,{"$f":"IF(Planilha_M.O.!$D$5=\"c/desoneração\",C48,(IF(Planilha_M.O.!$D$5=\"s/desoneração\",D48)))","v":94.12}]
[91872,"ELETRODUTO RÍGIDO ROSCÁVEL, PVC, DN 32 mm (1\"), PARA CIRCUITOS TERMINAIS",14.14,14.97,{"$f":"IF(Planilha_M.O.!$D$5=\"c/desoneração\",C49,(IF(Planilha_M.O.!$D$5=\"s/desoneração\",D49)))","v":14.97}]
[93358,"ESCAVAÇÃO MANUAL DE VALA COM PROFUNDIDADE MENOR OU IGUAL A 1,30 M",60.72,67.680000000000007,{"$f":"IF(Planilha_M.O.!$D$5=\"c/desoneração\",C50,(IF(Planilha_M.O.!$D$5=\"s/desoneração\",D50)))","v":67.680000000000007}]
[93402,"GUINDAUTO HIDRÁULICO, CAP. 3.330 kg, INCLUSIVE CAMINHÃO TOCO (chp)",174.94,177.73,{"$f":"IF(Planilha_M.O.!$D$5=\"c/desoneração\",C51,(IF(Planilha_M.O.!$D$5=\"s/desoneração\",D51)))","v":177.73}]
[96986,"HASTE DE ATERRAMENTO 3/4\" PARA SPDA",100.88,102.57,{"$f":"IF(Planilha_M.O.!$D$5=\"c/desoneração\",C52,(IF(Planilha_M.O.!$D$5=\"s/desoneração\",D52)))","v":102.57}]
[89358,"JOELHO 90 GRAUS, PVC, SOLDÁVEL, DN 20MM - FORNECIMENTO E INSTALAÇÃO",5.89,6.38,{"$f":"IF(Planilha_M.O.!$D$5=\"c/desoneração\",C53,(IF(Planilha_M.O.!$D$5=\"s/desoneração\",D53)))","v":6.38}]
[89971,"KIT DE REGISTRO DE GAVETA BRUTO DE LATÃO ½\", INCLUSIVE CONEXÕES, ROSCÁVEL",49.13,50.53,{"$f":"IF(Planilha_M.O.!$D$5=\"c/desoneração\",C54,(IF(Planilha_M.O.!$D$5=\"s/desoneração\",D54)))","v":50.53}]
[99833,"LAVADORA DE ALTA PRESSÃO (LAVA-JATO) PARA ÁGUA FRIA, PRESSÃO DE OPERAÇÃO ENTRE 1400 E 1900 LIB/POL², VAZÃO MÁXIMA ENTRE 400 E 700 L/H - CHP DIURNO",1.43,1.43,{"$f":"IF(Planilha_M.O.!$D$5=\"c/desoneração\",C55,(IF(Planilha_M.O.!$D$5=\"s/desoneração\",D55)))","v":1.43}]
[92873,"LANÇAMENTO COM USO DE BALDES, ADENSAMENTO E ACABAMENTO DE CONCRETO EM ESTRUTURAS. AF_12/2015",154.5,172.47,{"$f":"IF(Planilha_M.O.!$D$5=\"c/desoneração\",C56,(IF(Planilha_M.O.!$D$5=\"s/desoneração\",D56)))","v":172.47}]
[99058,"LOCAÇÃO DE PONTO PARA REFERÊNCIA TOPOGRÁFICA",9.15,10.33,{"$f":"IF(Planilha_M.O.!$D$5=\"c/desoneração\",C57,(IF(Planilha_M.O.!$D$5=\"s/desoneração\",D57)))","v":10.33}]
[91885,"LUVA PARA ELETRODUTO, PVC, ROSCÁVEL, DN 32 mm (1\")",8.11,8.8800000000000008,{"$f":"IF(Planilha_M.O.!$D$5=\"c/desoneração\",C58,(IF(Planilha_M.O.!$D$5=\"s/desoneração\",D58)))","v":8.8800000000000008}]
[5795,"MARTELETE OU ROMPEDOR PNEUMÁTICO MANUAL, 28 KG, COM SILENCIADOR - CHP DIURNO",23.81,26.44,{"$f":"IF(Planilha_M.O.!$D$5=\"c/desoneração\",C59,(IF(Planilha_M.O.!$D$5=\"s/desoneração\",D59)))","v":26.44}]
[5952,"MARTELETE OU ROMPEDOR PNEUMÁTICO MANUAL, 28 KG, COM SILENCIADOR - CHI DIURNO",21.81,24.44,{"$f":"IF(Planilha_M.O.!$D$5=\"c/desoneração\",C60,(IF(Planilha_M.O.!$D$5=\"s/desoneração\",D60)))","v":24.44}]
[97064,"MONTAGEM E DESMONTAGEM DE ANDAIME TUBULAR TIPO \u0093TORRE\u0094 (EXCLUSIVE ANDAIME E LIMPEZA)",14.38,16.16,{"$f":"IF(Planilha_M.O.!$D$5=\"c/desoneração\",C61,(IF(Planilha_M.O.!$D$5=\"s/desoneração\",D61)))","v":16.16}]
[5940,"PÁ CARREGADEIRA SOBRE RODAS, POTÊNCIA LÍQUIDA 128 HP, CAPACIDADE DA CAÇAMBA 1,7 A 2,8 M3, PESO OPERACIONAL 11632 KG - CHP DIURNO. AF_06/2014",144.08000000000001,147.06,{"$f":"IF(Planilha_M.O.!$D$5=\"c/desoneração\",C62,(IF(Planilha_M.O.!$D$5=\"s/desoneração\",D62)))","v":147.06}]
[5942,"PÁ CARREGADEIRA SOBRE RODAS, POTÊNCIA LÍQUIDA 128 HP, CAPACIDADE DA CAÇAMBA 1,7 A 2,8 M3, PESO OPERACIONAL 11632 KG - CHI DIURNO. AF_06/2014",53.18,56.16,{"$f":"IF(Planilha_M.O.!$D$5=\"c/desoneração\",C63,(IF(Planilha_M.O.!$D$5=\"s/desoneração\",D63)))","v":56.16}]
[90668,"PROJETOR PNEUMÁTICO DE ARGAMASSA PARA CHAPISCO E REBOCO COM RECIPIENTE ACOPLADO",22.32,22.32,{"$f":"IF(Planilha_M.O.!$D$5=\"c/desoneração\",C64,(IF(Planilha_M.O.!$D$5=\"s/desoneração\",D64)))","v":22.32}]
[90669,"PROJETOR PNEUMÁTICO DE ARGAMASSA PARA CHAPISCO E REBOCO COM RECIPIENTE ACOPLADO, TIPO CANEQUINHA,",5.89,5.89,{"$f":"IF(Planilha_M.O.!$D$5=\"c/desoneração\",C65,(IF(Planilha_M.O.!$D$5=\"s/desoneração\",D65)))","v":5.89}]
[91277,"PLACA VIBRATÓRIA REVERSÍVEL, POTÊNCIA 5,5 cv (chp)",9.84,9.84,{"$f":"IF(Planilha_M.O.!$D$5=\"c/desoneração\",C66,(IF(Planilha_M.O.!$D$5=\"s/desoneração\",D66)))","v":9.84}]
[91278,"PLACA VIBRATÓRIA REVERSÍVEL, POTÊNCIA 5,5 cv (chi)",0.7,0.7,{"$f":"IF(Planilha_M.O.!$D$5=\"c/desoneração\",C67,(IF(Planilha_M.O.!$D$5=\"s/desoneração\",D67)))","v":0.7}]
[5678,"RETROESCAVADEIRA SOBRE RODAS, POTÊNCIA 88 hp (chp)",107.63,110.93,{"$f":"IF(Planilha_M.O.!$D$5=\"c/desoneração\",C68,(IF(Planilha_M.O.!$D$5=\"s/desoneração\",D68)))","v":110.93}]
[5679,"RETROESCAVADEIRA SOBRE RODAS, POTÊNCIA 88 hp (chi)",45.92,49.22,{"$f":"IF(Planilha_M.O.!$D$5=\"c/desoneração\",C69,(IF(Planilha_M.O.!$D$5=\"s/desoneração\",D69)))","v":49.22}]
[5684,"ROLO COMPACTADOR VIBRATÓRIO DE UM CILINDRO AÇO LISO, POTÊNCIA 80 hp, PESO OPERACIONAL MÁXIMO 8,1 T, LARGURA DE TRABALHO 1,68 m (chp)",108.62,110.98,{"$f":"IF(Planilha_M.O.!$D$5=\"c/desoneração\",C70,(IF(Planilha_M.O.!$D$5=\"s/desoneração\",D70)))","v":110.98}]
[5685,"ROLO COMPACTADOR VIBRATÓRIO DE UM CILINDRO AÇO LISO, POTÊNCIA 80 hp, PESO OPERACIONAL MÁXIMO 8,1 T, LARGURA DE TRABALHO 1,68 m (chi)",41.96,44.32,{"$f":"IF(Planilha_M.O.!$D$5=\"c/desoneração\",C71,(IF(Planilha_M.O.!$D$5=\"s/desoneração\",D71)))","v":44.32}]
[5867,"ROLO COMPACTADOR VIBRATÓRIO TANDEM AÇO LISO, POTÊNCIA 58 hp, PESO SEM/COM LASTRO 6,5 / 9,4 t, LARGURA DE TRABALHO 1,2 m (chp)",107.71,111.07,{"$f":"IF(Planilha_M.O.!$D$5=\"c/desoneração\",C72,(IF(Planilha_M.O.!$D$5=\"s/desoneração\",D72)))","v":111.07}]
[5869,"ROLO COMPACTADOR VIBRATÓRIO TANDEM AÇO LISO, POTÊNCIA 58 hp, PESO SEM/COM LASTRO 6,5 / 9,4 t, LARGURA DE TRABALHO 1,2 m (chi)",47.34,49.7,{"$f":"IF(Planilha_M.O.!$D$5=\"c/desoneração\",C73,(IF(Planilha_M.O.!$D$5=\"s/desoneração\",D73)))","v":49.7}]
[91692,"SERRA CIRCULAR DE BANCADA COM MOTOR ELÉTRICO POTÊNCIA DE 5HP, COM COIFA PARA DISCO 10\" - CHP DIURNO",24.05,26.83,{"$f":"IF(Planilha_M.O.!$D$5=\"c/desoneração\",C74,(IF(Planilha_M.O.!$D$5=\"s/desoneração\",D74)))","v":26.83}]
[91693,"SERRA CIRCULAR DE BANCADA COM MOTOR ELÉTRICO POTÊNCIA DE 5HP, COM COIFA PARA DISCO 10\" - CHI DIURNO",21.11,23.89,{"$f":"IF(Planilha_M.O.!$D$5=\"c/desoneração\",C75,(IF(Planilha_M.O.!$D$5=\"s/desoneração\",D75)))","v":23.89}]
[86913,"TORNEIRA CROMADA 1/2\" OU 3/4\" PARA TANQUE, PADRÃO POPULAR",27.28,27.71,{"$f":"IF(Planilha_M.O.!$D$5=\"c/desoneração\",C76,(IF(Planilha_M.O.!$D$5=\"s/desoneração\",D76)))","v":27.71}]
[95875,"TRANSPORTE COM CAMINHÃO BASCULANTE DE 10 M³, EM VIA URBANA PAVIMENTADA, DMT ATÉ 30 KM (UNIDADE: M3XKM)",1.68,1.71,{"$f":"IF(Planilha_M.O.!$D$5=\"c/desoneração\",C77,(IF(Planilha_M.O.!$D$5=\"s/desoneração\",D77)))","v":1.71}]
[89401,"TUBO, PVC, SOLDÁVEL, DN 20MM - FORNECIMENTO E INSTALAÇÃO",7.26,7.63,{"$f":"IF(Planilha_M.O.!$D$5=\"c/desoneração\",C78,(IF(Planilha_M.O.!$D$5=\"s/desoneração\",D78)))","v":7.63}]
[90586,"VIBRADOR DE IMERSÃO, DIÂMETRO DE PONTEIRA 45 mm, MOTOR ELÉTRICO TRIFÁSICO POTÊNCIA DE 2 CV - CHP DIURNO",1.79,1.79,{"$f":"IF(Planilha_M.O.!$D$5=\"c/desoneração\",C79,(IF(Planilha_M.O.!$D$5=\"s/desoneração\",D79)))","v":1.79}]
[90587,"VIBRADOR DE IMERSÃO, DIÂMETRO DE PONTEIRA 45 mm MOTOR ELÉTRICO TRIFÁSICO POTÊNCIA DE 2 CV - CHI DIURNO",0.39,0.39,{"$f":"IF(Planilha_M.O.!$D$5=\"c/desoneração\",C80,(IF(Planilha_M.O.!$D$5=\"s/desoneração\",D80)))","v":0.39}]

{"sheet":"Planilha_M.O.","index":5,"n_rows":42,"n_cols":6,"rows_kept":42,"cut":false,"hidden":false,"merged":[[39,4,39,5],[38,4,38,5],[22,4,22,5],[2,0,2,5],[0,0,0,5],[1,0,1,5],[6,0,7,1],[6,5,7,5],[16,4,16,5],[9,0,15,1],[9,2,15,2],[9,3,15,3],[3,0,3,5],[8,0,8,5],[9,4,15,5],[19,4,19,5],[31,4,31,5],[30,4,30,5],[18,4,18,5],[20,4,20,5],[27,4,27,5],[26,4,26,5],[25,4,25,5],[24,4,24,5],[23,4,23,5],[40,4,40,5],[41,4,41,5],[4,0,4,1],[4,4,4,5],[5,0,5,5],[37,4,37,5],[6,4,7,4],[17,4,17,5],[29,4,29,5],[28,4,28,5],[36,4,36,5],[35,4,35,5],[34,4,34,5],[33,4,33,5],[32,4,32,5],[21,4,21,5]]}
["PLANILHA MÃO-DE-OBRA"]
[]
[{"$f":"CONCATENATE(\"Data Base SINAPI: \",$E$17)","v":"Data Base SINAPI: JUNHO / 2021"}]
[]
[null,null,"SELECIONAR:","s/desoneração"]
[]
[{"$f":"D5","v":"s/desoneração"},null,"Leis Sociais Horistas:",{"$f":"IF($D$5=\"c/desoneração\",'Encargos Sociais'!C42,'Encargos Sociais'!E42)","v":1.111},"BDI=",{"$f":"IF($D$5=\"c/desoneração\",\"28,21%\",\"22,15%\")","v":"22,15%"}]
[null,null,"Leis Sociais Mensalistas:",{"$f":"IF($D$5=\"c/desoneração\",'Encargos Sociais'!D42,'Encargos Sociais'!F42)","v":0.69159999999999999}]
[]
[{"$f":"+E17","v":"JUNHO / 2021"},null,"Vem da aba Comp.SINAPI c_des.","Vem da aba Comp.SINAPI s_des."," Valor utilizado"]
[]
[]
[]
[]
[]
[]
["Código","Composição","Custo unitário (c/desoneração)","Custo unitário (s/desoneração)","JUNHO / 2021"]
[88316,"Servente",15.35,17.11,{"$f":"IF($D$5=\"c/desoneração\",C18,(IF($D$5=\"s/desoneração\",D18)))","v":17.11}]
[88238,"Ajudante de armador",14.11,15.67,15.67]
[88239,"Ajudante de carpinteiro",15.31,17.059999999999999,17.059999999999999]
[88253,"Auxiliar de topógrafo",11.98,13.69,13.69]
[88248,"Auxiliar de encanador",13.98,15.58,15.58]
[88251,"Auxiliar de serralheiro",14.83,16.489999999999998,16.489999999999998]
[88309,"Pedreiro",18.48,20.71,20.71]
[88310,"Pintor",19.48,21.7,21.7]
[88262,"Carpinteiro",18.28,20.5,20.5]
[88260,"Calceteiro",17.309999999999999,19.37,19.37]
[88323,"Telhadista",18.64,20.93,20.93]
[88245,"Armador",18.38,20.6,20.6]
[88315,"Serralheiro",18.38,20.6,20.6]
[88441,"Jardineiro",17.850000000000001,20,20]
[88267,"Encanador",18.149999999999999,20.39,20.39]
[88281,"Motorista de caminhão",19.59,22.14,22.14]
[88377,"Operador de betoneira",18.37,20.74,20.74]
[88297,"Operador de máq. e equip.",21.02,23.8,23.8]
[88298,"Operador de martelete",20.02,22.65,22.65]
[93572,"Encarregado (mês)",6799.05,7828.88,7828.88]
[90778,"Engenheiro Civil de Obra",92.87,107.35,107.35]
[90781,"Topógrafo",27.62,31.8,{"$f":"IF($D$5=\"c/desoneração\",C39,(IF($D$5=\"s/desoneração\",D39)))","v":31.8}]
[88326,"VIGIA NOTURNO COM ENCARGOS COMPLEMENTARES",19.920000000000002,22.41,{"$f":"IF($D$5=\"c/desoneração\",C40,(IF($D$5=\"s/desoneração\",D40)))","v":22.41}]
[88264,"ELETRICISTA COM ENCARGOS COMPLEMENTARES",20.11,22.61,{"$f":"IF($D$5=\"c/desoneração\",C41,(IF($D$5=\"s/desoneração\",D41)))","v":22.61}]
[88247,"AUXILIAR DE ELETRICISTA COM ENCARGOS COMPLEMENTARES",15.41,17.170000000000002,{"$f":"IF($D$5=\"c/desoneração\",C42,(IF($D$5=\"s/desoneração\",D42)))","v":17.170000000000002}]

{"sheet":"Planilha Cotações","index":6,"n_rows":158,"n_cols":9,"rows_kept":158,"cut":false,"hidden":false,"merged":[[35,0,35,2],[38,0,38,2],[35,8,38,8],[36,0,36,2],[37,0,37,2],[23,0,23,2],[24,0,24,2],[25,0,25,2],[41,0,41,2],[41,8,43,8],[47,0,47,2],[48,0,48,2],[42,0,42,2],[43,0,43,2],[152,0,152,2],[152,8,154,8],[135,0,135,2],[135,8,137,8],[136,0,136,2],[137,0,137,2],[153,0,153,2],[154,0,154,2],[157,0,157,2],[52,0,52,2],[140,0,140,2],[144,0,144,2],[148,0,148,2],[46,0,46,2],[46,8,48,8],[51,0,51,2],[51,8,53,8],[131,0,131,2],[56,0,56,2],[57,0,57,2],[58,0,58,2],[61,0,61,2],[62,0,62,2],[63,0,63,2],[66,0,66,2],[67,0,67,2],[68,0,68,2],[71,0,71,2],[72,0,72,2],[73,0,73,2],[56,8,58,8],[61,8,63,8],[0,0,0,8],[1,0,1,8],[2,0,2,8],[29,8,32,8],[32,0,32,2],[29,0,29,2],[26,0,26,2],[30,0,30,2],[31,0,31,2],[13,0,13,2],[13,8,15,8],[14,0,14,2],[15,0,15,2],[18,0,18,2],[18,8,20,8],[19,0,19,2],[20,0,20,2],[23,8,26,8],[8,0,8,2],[8,8,10,8],[3,1,3,8],[126,10,126,11],[127,10,127,11],[128,10,128,11],[126,0,126,2],[126,8,128,8],[127,0,127,2],[128,0,128,2],[66,8,68,8],[71,8,73,8],[76,0,76,2],[76,8,78,8],[77,0,77,2],[78,0,78,2],[101,8,103,8],[102,0,102,2],[103,0,103,2],[81,0,81,2],[81,8,83,8],[82,0,82,2],[83,0,83,2],[86,0,86,2],[86,8,88,8],[87,0,87,2],[88,0,88,2],[35,10,35,11],[36,10,36,11],[106,10,106,11],[117,0,117,2],[118,0,118,2],[113,0,113,2],[111,0,111,2],[121,0,121,2],[112,10,112,11],[121,8,123,8],[122,0,122,2],[123,0,123,2],[116,0,116,2],[116,8,118,8],[111,10,111,11],[108,0,108,2],[107,0,107,2],[111,8,113,8],[112,0,112,2],[91,0,91,2],[91,8,93,8],[92,0,92,2],[93,0,93,2],[53,0,53,2],[37,10,37,11],[38,10,38,11],[107,10,107,11],[108,10,108,11],[135,10,135,11],[137,10,137,11],[136,10,136,11],[9,0,9,2],[10,0,10,2],[106,0,106,2],[106,8,108,8],[96,0,96,2],[96,8,98,8],[97,0,97,2],[98,0,98,2],[101,0,101,2],[113,10,113,11],[23,10,23,11],[24,10,24,11],[25,10,25,11],[26,10,26,11],[18,10,18,11],[19,10,19,11],[20,10,20,11]]}
["PLANILHA DE COTAÇÕES DE INSUMOS"]
["Data das Cotações: Junho2021"]
[]
["OBJETO:",{"$f":"+PO!$B$9","v":"Obras de Aquisição e Instalação de Academias de Ginástica ao ar livre na Praça Grêmio Futebol Portoalegrense (110/03), Praça Guia Lopes (118/08) e Praça Simões Lopes Neto (125/06)"}]
["DATA:",{"$f":"IF(PO!$B$10=\"\",\"\",PO!$B$10)","v":"2021-09-14"}]
["ART nº:",{"$f":"IF(PO!$B$11=\"\",\"\",PO!$B$11)","v":""}]
[]
[16,"CAIBRO CEDRINHO 5 x 7 cm","m","CNPJ","Telefone","Contato","Data","Valor","Valor Média"]
[{"$f":"+Cotações!$D$7","v":"Mondai Madeiras"},null,null,"01.434.693/0001-93","3587-1643","Anderson R.","2021-06-15",20,{"$f":"Cotações!M11","v":22.2}]
[{"$f":"+Cotações!$F$7","v":"Cunha Madeiras"},null,null,"14.071.368/0001-55","3364-2778","Fábio","2021-06-15",24.4]
["SCHREINER MADEIRA",null,null,"16.701.304/0001-16","41-3543-1316","Carol","2021-07-07",41.25]
[]
[{"$f":"+Cotações!A34","v":44},"Tábua itaúba lixada e aplainada 3,5x19x1,80","pç","CNPJ","Telefone","Contato","Data","Valor","Valor Mediana"]
[{"$f":"+Cotações!$D$7","v":"Mondai Madeiras"},null,null,"01.434.693/0001-93","3587-1643","Anderson R.","2021-06-15",{"$f":"+Cotações!D34","v":130.5},{"$f":"Cotações!N34","v":140.80000000000001}]
[{"$f":"+Cotações!$F$7","v":"Cunha Madeiras"},null,null,"14.071.368/0001-55","3364-2778","Fábio","2021-06-15",{"$f":"+Cotações!F34","v":200}]
["SCHREINER MADEIRA",null,null,"16.701.304/0001-16","41-3543-1316","Carol","2021-07-07",{"$f":"+Cotações!H34","v":140.80000000000001}]
[]
[{"$f":"+Cotações!A35","v":45},"Tábua itaúba lixada e aplainada 3,5x19x2,00","pç","CNPJ","Telefone","Contato","Data","Valor","Valor Mediana"]
[{"$f":"+Cotações!$D$7","v":"Mondai Madeiras"},null,null,"01.434.693/0001-93","3587-1643","Anderson R.","2021-06-15",{"$f":"+Cotações!D35","v":145},{"$f":"Cotações!N35","v":145}]
[{"$f":"+Cotações!$F$7","v":"Cunha Madeiras"},null,null,"14.071.368/0001-55","3364-2778","Fábio","2021-06-15",{"$f":"+Cotações!F35","v":200}]
["SCHREINER MADEIRA",null,null,"16.701.304/0001-16","41-3543-1316","Carol","2021-07-07",{"$f":"+Cotações!H35","v":140.80000000000001}]
[]
[{"$f":"+Cotações!A43","v":50},"Parafuso francês zincado 5/16\" x 2 1/2\" c/ porca","un","CNPJ","Telefone","Contato","Data","Valor","Valor Média"]
[{"$f":"+Cotações!$D$40","v":"SL Parafusos Ltda"},null,null,"06.046.959/0001-44",{"$f":"+Cotações!$E$40","v":"3411-9800"},"Carina","2021-06-30",{"$f":"+Cotações!D43","v":1.39},{"$f":"Cotações!M43","v":1.06}]
[{"$f":"+Cotações!$F$40","v":"Guido A. Jacobus"},null,null,"92.690.106/0001-82",{"$f":"+Cotações!$G$40","v":"3024-1200"},"Jéferson","2021-07-21",{"$f":"+Cotações!F43","v":0.44}]
[{"$f":"+Cotações!$H$40","v":"Central de Parafusos"},null,null,"91.526.467/0001-25",{"$f":"+Cotações!$I$40","v":"3341-9353"},"Alexandre","2021-06-15",{"$f":"+Cotações!H43","v":1.17}]
[{"$f":"+Cotações!$J$40","v":"Brasil dos Parafusos"},null,null,"10.878.757/0001-36",{"$f":"+Cotações!$K$40","v":"3326-1946"},"Marta Lopes","2021-06-17",{"$f":"+Cotações!J43","v":1.24}]
[]
[{"$f":"+Cotações!A44","v":51},"Parafuso francês zincado 5/16\" x 4\" c/ porca","un","CNPJ","Telefone","Contato","Data","Valor","Valor Média"]
[{"$f":"+Cotações!$D$40","v":"SL Parafusos Ltda"},null,null,"06.046.959/0001-44",{"$f":"+Cotações!$E$40","v":"3411-9800"},"Carina","2021-06-30",{"$f":"+Cotações!D44","v":1.91},{"$f":"Cotações!M44","v":1.47}]
[{"$f":"+Cotações!$F$40","v":"Guido A. Jacobus"},null,null,"92.690.106/0001-82",{"$f":"+Cotações!$G$40","v":"3024-1200"},"Jéferson","2021-07-21",{"$f":"+Cotações!F44","v":0.61}]
[{"$f":"+Cotações!$H$40","v":"Central de Parafusos"},null,null,"91.526.467/0001-25",{"$f":"+Cotações!$I$40","v":"3341-9353"},"Alexandre","2021-06-15",{"$f":"+Cotações!H44","v":1.65}]
[{"$f":"+Cotações!$J$40","v":"Brasil dos Parafusos"},null,null,"10.878.757/0001-36",{"$f":"+Cotações!$K$40","v":"3326-1946"},"Marta Lopes","2021-06-17",{"$f":"+Cotações!J44","v":1.72}]
[]
[{"$f":"+Cotações!A51","v":58},"Parafuso sextavado aço zincado 1/4\" x 2\" c/ porca","un","CNPJ","Telefone","Contato","Data","Valor","Valor Média"]
[{"$f":"+Cotações!$D$40","v":"SL Parafusos Ltda"},null,null,"06.046.959/0001-44",{"$f":"+Cotações!$E$40","v":"3411-9800"},"Carina","2021-06-30",{"$f":"+Cotações!D51","v":0.84650000000000003},{"$f":"Cotações!M51","v":0.59}]
[{"$f":"+Cotações!$F$40","v":"Guido A. Jacobus"},null,null,"92.690.106/0001-82",{"$f":"+Cotações!$G$40","v":"3024-1200"},"Jéferson","2021-07-21",{"$f":"+Cotações!F51","v":0.24}]
[{"$f":"+Cotações!$H$40","v":"Central de Parafusos"},null,null,"91.526.467/0001-25",{"$f":"+Cotações!$I$40","v":"3341-9353"},"Alexandre","2021-06-15",{"$f":"+Cotações!H51","v":0.6}]
[{"$f":"+Cotações!$J$40","v":"Brasil dos Parafusos"},null,null,"10.878.757/0001-36",{"$f":"+Cotações!$K$40","v":"3326-1946"},"Marta Lopes","2021-06-17",{"$f":"+Cotações!J51","v":0.68}]
[]
[{"$f":"+Cotações!A85","v":82},"Abdominal Simples","un","CNPJ","Telefone","Contato","Data","Valor","Valor Média"]
[{"$f":"+Cotações!$D$84","v":"Ziober"},null,null,"08.374.053/0001-84",{"$f":"+Cotações!$E$84","v":"44 3029-4410"},"Solaine Teline","2021-08-05",{"$f":"Cotações!D85","v":5610},{"$f":"Cotações!N85","v":4690}]
[{"$f":"+Cotações!$F$84","v":"Milla Equip. Met."},null,null,"10.555.495/0001-79",{"$f":"+Cotações!$G$84","v":"19 3363-1051"},"Tatiana Demétrio","2021-08-03",{"$f":"+Cotações!F85","v":4510}]
[{"$f":"+Cotações!$H$84","v":"Flex"},null,null,"13.898.616/0001-73",{"$f":"+Cotações!$I$84","v":"17 3223-2766"},"Fernanda","2021-08-02",{"$f":"+Cotações!H85","v":4690}]
[]
[{"$f":"+Cotações!A86","v":83},"Adução e abdução de pernas duplo","un","CNPJ","Telefone","Contato","Data","Valor","Valor Média"]
[{"$f":"+Cotações!$D$84","v":"Ziober"},null,null,"08.374.053/0001-84",{"$f":"+Cotações!$E$84","v":"44 3029-4410"},"Solaine Teline","2021-08-05",{"$f":"+Cotações!D86","v":11490},{"$f":"Cotações!N86","v":9150}]
[{"$f":"+Cotações!$F$84","v":"Milla Equip. Met."},null,null,"10.555.495/0001-79",{"$f":"+Cotações!$G$84","v":"19 3363-1051"},"Tatiana Demétrio","2021-08-03",{"$f":"+Cotações!F86","v":9150}]
[{"$f":"+Cotações!$H$84","v":"Flex"},null,null,"13.898.616/0001-73",{"$f":"+Cotações!$I$84","v":"17 3223-2766"},"Fernanda","2021-08-02",{"$f":"+Cotações!H86","v":6940}]
[]
[{"$f":"+Cotações!A87","v":84},"Esqui triplo conjugado","un","CNPJ","Telefone","Contato","Data","Valor","Valor Média"]
[{"$f":"+Cotações!$D$84","v":"Ziober"},null,null,"08.374.053/0001-84",{"$f":"+Cotações!$E$84","v":"44 3029-4410"},"Solaine Teline","2021-08-05",{"$f":"+Cotações!D87","v":18000},{"$f":"Cotações!M87","v":16140}]
[{"$f":"+Cotações!$F$84","v":"Milla Equip. Met."},null,null,"10.555.495/0001-79",{"$f":"+Cotações!$G$84","v":"19 3363-1051"},"Tatiana Demétrio","2021-08-03",{"$f":"+Cotações!F87","v":21430}]
[{"$f":"+Cotações!$H$84","v":"Flex"},null,null,"13.898.616/0001-73",{"$f":"+Cotações!$I$84","v":"17 3223-2766"},"Fernanda","2021-08-02",{"$f":"+Cotações!H87","v":8990}]
[]
[{"$f":"+Cotações!A88","v":85},"Jogo de barras","un","CNPJ","Telefone","Contato","Data","Valor","Valor Média"]
[{"$f":"+Cotações!$D$84","v":"Ziober"},null,null,"08.374.053/0001-84",{"$f":"+Cotações!$E$84","v":"44 3029-4410"},"Solaine Teline","2021-08-05",{"$f":"+Cotações!D88","v":9600},{"$f":"Cotações!M88","v":9359.33}]
[{"$f":"+Cotações!$F$84","v":"Milla Equip. Met."},null,null,"10.555.495/0001-79",{"$f":"+Cotações!$G$84","v":"19 3363-1051"},"Tatiana Demétrio","2021-08-03",{"$f":"+Cotações!F88","v":11778}]
[{"$f":"+Cotações!$H$84","v":"Flex"},null,null,"13.898.616/0001-73",{"$f":"+Cotações!$I$84","v":"17 3223-2766"},"Fernanda","2021-08-02",{"$f":"+Cotações!H88","v":6700}]
[]
[{"$f":"+Cotações!A89","v":86},"Multiexercitador conjugado 6 funções","un","CNPJ","Telefone","Contato","Data","Valor","Valor Média"]
[{"$f":"+Cotações!$D$84","v":"Ziober"},null,null,"08.374.053/0001-84",{"$f":"+Cotações!$E$84","v":"44 3029-4410"},"Solaine Teline","2021-08-05",{"$f":"+Cotações!D89","v":22200},{"$f":"Cotações!M89","v":16191.33}]
[{"$f":"+Cotações!$F$84","v":"Milla Equip. Met."},null,null,"10.555.495/0001-79",{"$f":"+Cotações!$G$84","v":"19 3363-1051"},"Tatiana Demétrio","2021-08-03",{"$f":"+Cotações!F89","v":17184}]
[{"$f":"+Cotações!$H$84","v":"Flex"},null,null,"13.898.616/0001-73",{"$f":"+Cotações!$I$84","v":"17 3223-2766"},"Fernanda","2021-08-02",{"$f":"+Cotações!H89","v":9190}]
[]
[{"$f":"+Cotações!A90","v":87},"Peitoral duplo","un","CNPJ","Telefone","Contato","Data","Valor","Valor Mediana"]
[{"$f":"+Cotações!$D$84","v":"Ziober"},null,null,"08.374.053/0001-84",{"$f":"+Cotações!$E$84","v":"44 3029-4410"},"Solaine Teline","2021-08-05",{"$f":"+Cotações!D90","v":14220},{"$f":"+Insumos!G44","v":9790}]
[{"$f":"+Cotações!$F$84","v":"Milla Equip. Met."},null,null,"10.555.495/0001-79",{"$f":"+Cotações!$G$84","v":"19 3363-1051"},"Tatiana Demétrio","2021-08-03",{"$f":"+Cotações!F90","v":9790}]
[{"$f":"+Cotações!$H$84","v":"Flex"},null,null,"13.898.616/0001-73",{"$f":"+Cotações!$I$84","v":"17 3223-2766"},"Fernanda","2021-08-02",{"$f":"+Cotações!H90","v":7700}]
[]
[{"$f":"+Cotações!A91","v":88},"Placa orientativa (ATI)","un","CNPJ","Telefone","Contato","Data","Valor","Valor Média"]
[{"$f":"+Cotações!$D$84","v":"Ziober"},null,null,"08.374.053/0001-84",{"$f":"+Cotações!$E$84","v":"44 3029-4410"},"Solaine Teline","2021-08-05",{"$f":"+Cotações!D91","v":8130},{"$f":"Cotações!M91","v":7695.33}]
[{"$f":"+Cotações!$F$84","v":"Milla Equip. Met."},null,null,"10.555.495/0001-79",{"$f":"+Cotações!$G$84","v":"19 3363-1051"},"Tatiana Demétrio","2021-08-03",{"$f":"+Cotações!F91","v":9966}]
[{"$f":"+Cotações!$H$84","v":"Flex"},null,null,"13.898.616/0001-73",{"$f":"+Cotações!$I$84","v":"17 3223-2766"},"Fernanda","2021-08-02",{"$f":"+Cotações!H91","v":4990}]
[]
[{"$f":"+Cotações!A92","v":89},"Pressão de pernas triplo conjugado","un","CNPJ","Telefone","Contato","Data","Valor","Valor Média"]
[{"$f":"+Cotações!$D$84","v":"Ziober"},null,null,"08.374.053/0001-84",{"$f":"+Cotações!$E$84","v":"44 3029-4410"},"Solaine Teline","2021-08-05",{"$f":"+Cotações!D92","v":10860},{"$f":"Cotações!M92","v":9472}]
[{"$f":"+Cotações!$F$84","v":"Milla Equip. Met."},null,null,"10.555.495/0001-79",{"$f":"+Cotações!$G$84","v":"19 3363-1051"},"Tatiana Demétrio","2021-08-03",{"$f":"+Cotações!F92","v":10706}]
[{"$f":"+Cotações!$H$84","v":"Flex"},null,null,"13.898.616/0001-73",{"$f":"+Cotações!$I$84","v":"17 3223-2766"},"Fernanda","2021-08-02",{"$f":"+Cotações!H92","v":6850}]
[]
[{"$f":"+Cotações!A93","v":90},"Puxador duplo","un","CNPJ","Telefone","Contato","Data","Valor","Valor Mediana"]
[{"$f":"+Cotações!$D$84","v":"Ziober"},null,null,"08.374.053/0001-84",{"$f":"+Cotações!$E$84","v":"44 3029-4410"},"Solaine Teline","2021-08-05",{"$f":"+Cotações!D93","v":14220},{"$f":"+Insumos!G47","v":10428}]
[{"$f":"+Cotações!$F$84","v":"Milla Equip. Met."},null,null,"10.555.495/0001-79",{"$f":"+Cotações!$G$84","v":"19 3363-1051"},"Tatiana Demétrio","2021-08-03",{"$f":"+Cotações!F93","v":10428}]
[{"$f":"+Cotações!$H$84","v":"Flex"},null,null,"13.898.616/0001-73",{"$f":"+Cotações!$I$84","v":"17 3223-2766"},"Fernanda","2021-08-02",{"$f":"+Cotações!H93","v":7690}]
[]
[{"$f":"+Cotações!A94","v":91},"Remada (APC)","un","CNPJ","Telefone","Contato","Data","Valor","Valor Mediana"]
[{"$f":"+Cotações!$D$84","v":"Ziober"},null,null,"08.374.053/0001-84",{"$f":"+Cotações!$E$84","v":"44 3029-4410"},"Solaine Teline","2021-08-05",{"$f":"+Cotações!D94","v":8340},{"$f":"Cotações!N94","v":5940}]
[{"$f":"+Cotações!$F$84","v":"Milla Equip. Met."},null,null,"10.555.495/0001-79",{"$f":"+Cotações!$G$84","v":"19 3363-1051"},"Tatiana Demétrio","2021-08-03",{"$f":"+Cotações!F94","v":5940}]
[{"$f":"+Cotações!$H$84","v":"Flex"},null,null,"13.898.616/0001-73",{"$f":"+Cotações!$I$84","v":"17 3223-2766"},"Fernanda","2021-08-02",{"$f":"+Cotações!H94","v":3890}]
[]
[{"$f":"+Cotações!A95","v":92},"Simulador de caminhada triplo conjugado","un","CNPJ","Telefone","Contato","Data","Valor","Valor Média"]
[{"$f":"+Cotações!$D$84","v":"Ziober"},null,null,"08.374.053/0001-84",{"$f":"+Cotações!$E$84","v":"44 3029-4410"},"Solaine Teline","2021-08-05",{"$f":"+Cotações!D95","v":16740},{"$f":"Cotações!M95","v":13224.66}]
[{"$f":"+Cotações!$F$84","v":"Milla Equip. Met."},null,null,"10.555.495/0001-79",{"$f":"+Cotações!$G$84","v":"19 3363-1051"},"Tatiana Demétrio","2021-08-03",{"$f":"+Cotações!F95","v":15134}]
[{"$f":"+Cotações!$H$84","v":"Flex"},null,null,"13.898.616/0001-73",{"$f":"+Cotações!$I$84","v":"17 3223-2766"},"Fernanda","2021-08-02",{"$f":"+Cotações!H95","v":7800}]
[]
[{"$f":"+Cotações!A96","v":93},"Simulador de remo","un","CNPJ","Telefone","Contato","Data","Valor","Valor Mediana"]
[{"$f":"+Cotações!$D$84","v":"Ziober"},null,null,"08.374.053/0001-84",{"$f":"+Cotações!$E$84","v":"44 3029-4410"},"Solaine Teline","2021-08-05",{"$f":"+Cotações!D96","v":6660},{"$f":"+Insumos!G50","v":5640}]
[{"$f":"+Cotações!$F$84","v":"Milla Equip. Met."},null,null,"10.555.495/0001-79",{"$f":"+Cotações!$G$84","v":"19 3363-1051"},"Tatiana Demétrio","2021-08-03",{"$f":"+Cotações!F96","v":5240}]
[{"$f":"+Cotações!$H$84","v":"Flex"},null,null,"13.898.616/0001-73",{"$f":"+Cotações!$I$84","v":"17 3223-2766"},"Fernanda","2021-08-02",{"$f":"+Cotações!H96","v":5640}]
[]
[{"$f":"+Cotações!A97","v":94},"Voador peitoral e voador dorsal (APC)","un","CNPJ","Telefone","Contato","Data","Valor","Valor Mediana"]
[{"$f":"+Cotações!$D$84","v":"Ziober"},null,null,"08.374.053/0001-84",{"$f":"+Cotações!$E$84","v":"44 3029-4410"},"Solaine Teline","2021-08-05",{"$f":"+Cotações!D97","v":13170},{"$f":"+Insumos!G51","v":6200}]
[{"$f":"+Cotações!$F$84","v":"Milla Equip. Met."},null,null,"10.555.495/0001-79",{"$f":"+Cotações!$G$84","v":"19 3363-1051"},"Tatiana Demétrio","2021-08-03",{"$f":"+Cotações!F97","v":6200}]
[{"$f":"+Cotações!$H$84","v":"Flex"},null,null,"13.898.616/0001-73",{"$f":"+Cotações!$I$84","v":"17 3223-2766"},"Fernanda","2021-08-02",{"$f":"+Cotações!H97","v":3890}]
[]
[{"$f":"+Cotações!A105","v":100},"Piso Podotátil 25 x 25 cm","un","CNPJ","Telefone","Contato","Data","Valor","Valor Mediana"]
[{"$f":"+Cotações!$D$103","v":"DPS"},null,null,"18.710.671/0001-01",{"$f":"+Cotações!$E$103","v":"3499-1536"},"Janaína Guim.","2021-06-15",{"$f":"+Cotações!D105","v":3.5},{"$f":"+Insumos!G155","v":3.5}]
[{"$f":"+Cotações!$F$103","v":"Incorevest"},null,null,"10.975.310/0001-85",{"$f":"+Cotações!$G$103","v":"3062-5119"},"Manoel","2021-06-15",{"$f":"+Cotações!F105","v":3.5}]
[{"$f":"+Cotações!J103","v":"RF Rede Pallet"},null,null,"27.657.284/0001-40",{"$f":"+Cotações!K103","v":"3059-7270"},"Débora","2021-01-21",{"$f":"+Cotações!J105","v":4.2}]
[]
[{"$f":"+Cotações!A115","v":106},"Microfibra de polipropileno","sc","CNPJ","Telefone","Contato","Data","Valor","Valor Mediana"]
[{"$f":"+Cotações!$D$114","v":"Construtec"},null,null,"02.062.999/0001-29",{"$f":"+Cotações!$E$114","v":"3012-2333"},"Eliandra","2021-06-15",{"$f":"+Cotações!D115","v":33},{"$f":"Cotações!N115","v":23.2}]
[{"$f":"+Cotações!$F$114","v":"Reis e Reis"},null,null,"00.320.025/0001-72",{"$f":"+Cotações!$G$114","v":"12 3966-9977"},"Romildo Mesquita","2021-03-31",21.65]
[{"$f":"+Cotações!$H$114","v":"TecMachine"},null,null,"10.913.018/0001-38",{"$f":"+Cotações!$I$114","v":"11 4643-4846"},"Noemi","2021-06-15",25]
[]
[{"$f":"+Cotações!A117","v":107},"Granilha para argamassa de alta resistência (Piso duro)","kg","CNPJ","Telefone","Contato","Data","Valor",{"$f":"IF(#REF!=\"NÃO\",\"Valor adotado\",\"Valor Atualizado\")","v":{"$error":"#REF!"}}]
[{"$f":"+Cotações!$D$116","v":"Mineração Peixoto"},null,null,"89.493.506/0001-93",{"$f":"+Cotações!$E$116","v":"51 3678-1020"},"Jean","2019-04-24",{"$f":"+Cotações!D117","v":0.74},{"$f":"+Insumos!#REF!","v":{"$error":"#REF!"}}]
[{"$f":"+Cotações!$F$116","v":"Grani Torre"},null,null,"49.042.302/0001-11",{"$f":"+Cotações!$G$116","v":"11 2246-1250"},"Tamara","2019-04-09",{"$f":"+Cotações!F117","v":0.65}]
[{"$f":"+Cotações!$H$116","v":"Polipiso"},null,null,"08.114.238/0001-50",{"$f":"+Cotações!$I$116","v":"99116-4697"},"Orivaldo","2019-04-09",{"$f":"+Cotações!H117","v":0.77}]
[]
[{"$f":"+Cotações!A119","v":108},"Fundo p/ galvanizado","l","CNPJ","Telefone","Contato","Data","Valor","Valor Média"]
[{"$f":"+Cotações!$D$118","v":"Constinta"},null,null,"06.102.585/0001-37",{"$f":"+Cotações!$E$118","v":"3341-6344"},"Ana Bárbara","2021-06-16",{"$f":"+Cotações!D119","v":35.270000000000003},{"$f":"+Insumos!G108","v":34.81}]
[{"$f":"+Cotações!$H$118","v":"Porto Cores"},null,null,"30.061.635/0001-60",{"$f":"+Cotações!$I$118","v":"3346-3339"},"Fabrício","2021-06-16",{"$f":"+Cotações!H119","v":37.22}]
[{"$f":"+Cotações!$J$118","v":"Aquarela Tintas"},null,null,"92.321.785/0004-65",{"$f":"+Cotações!$K$118","v":"3223-0133"},"Anderson","2021-06-16",{"$f":"+Cotações!J119","v":31.94}]
[]
[{"$f":"+Cotações!A121","v":109},"Manta Geotêxtil para cura do concreto","m²","CNPJ","Telefone","Contato","Data","Valor",{"$f":"IF(#REF!=\"NÃO\",\"Valor adotado\",\"Valor Atualizado\")","v":{"$error":"#REF!"}}]
[{"$f":"+Cotações!$D$120","v":"Drenamac"},null,null,"05.672.634/0001-04",{"$f":"+Cotações!$E$120","v":"3029-7593"},"Rafael","2019-04-11",{"$f":"+Cotações!D121","v":2.2000000000000002},{"$f":"+Insumos!#REF!","v":{"$error":"#REF!"}}]
[{"$f":"+Cotações!$F$120","v":"Drenotec"},null,null,"21.003.970/0002-00",{"$f":"+Cotações!$G$120","v":"3119-1244"},"Mary","2019-04-11",{"$f":"+Cotações!F121","v":2.5}]
[{"$f":"+Cotações!$H$120","v":"Geofoco"},null,null,"16.953.066/0001-36",{"$f":"+Cotações!$I$120","v":"0800-378-8500"},"Jéssica","2019-04-12",{"$f":"+Cotações!H121","v":2.1}]
[]
[{"$f":"+Cotações!A123","v":110},"Papeleira metálica basculante H-30","un","CNPJ","Telefone","Contato","Data","Valor","Valor *"]
[{"$f":"+Cotações!$D$122","v":"Prod Equipam. MB"},null,null,"00.929.345/0001-24",{"$f":"+Cotações!$E$122","v":"3377-2035"},"Jean","2021-06-17",900,{"$f":"+Insumos!G132","v":900}]
[null,"* Único fornecedor"]
[]
[{"$f":"+Cotações!A129","v":113},"Caçamba 4,00 m3","un","CNPJ","Telefone","Contato","Data","Valor","Valor Média"]
[{"$f":"+Cotações!$D$128","v":"Gaúcha"},null,null,"08.101.767/0001-19",{"$f":"+Cotações!$E$128","v":"3245-3500"},"Viviane","2021-06-14",{"$f":"+Cotações!D129","v":480},443.33]
[{"$f":"+Cotações!$F$128","v":"Pouco Entulho"},null,null," 25.215.615/0001-66",{"$f":"+Cotações!$G$128","v":"51 99859-2250"},"Luciana","2021-06-17",{"$f":"+Cotações!F129","v":400}]
[{"$f":"+Cotações!$H$128","v":"Tirentulho"},null,null,"05.551.367/0001-17",{"$f":"+Cotações!$I$128","v":"3475-2222"},"Francieli Bissolotti","2021-06-15",{"$f":"+Cotações!H129","v":450}]
[]
[{"$f":"+Cotações!A134","v":116},"Taxa instalação água DMAE","cj","CNPJ","Telefone","Contato","Data","Valor","Valor*"]
[{"$f":"+Cotações!$D$133","v":"DMAE"},null,null,"92.924.901/0001-98",{"$f":"+Cotações!$E$133","v":"3289-9537"},"Ricardo","2021-01-05",{"$f":"+Cotações!D134","v":465.36},{"$f":"Cotações!D134","v":465.36}]
[null,"*Tarifa municipal"]
[]
[{"$f":"+Cotações!A136","v":118},"Água tratada","m³","CNPJ","Telefone","Contato","Data","Valor","Valor*"]
[{"$f":"+Cotações!$D$133","v":"DMAE"},null,null,"92.924.901/0001-98",{"$f":"+Cotações!$E$133","v":"3289-9537"},"Ricardo","2021-01-05",{"$f":"+Cotações!D136","v":4.0199999999999996},{"$f":"Cotações!D136","v":4.0199999999999996}]
[null,"*Tarifa municipal"]
[]
[{"$f":"+Cotações!A137","v":119},"Esgoto cloacal","m³","CNPJ","Telefone","Contato","Data","Valor","Valor*"]
[{"$f":"+Cotações!$D$133","v":"DMAE"},null,null,"92.924.901/0001-98",{"$f":"+Cotações!$E$133","v":"3289-9537"},"Ricardo","2021-01-05",{"$f":"+Cotações!D137","v":3.2159999999999997},{"$f":"Cotações!D137","v":3.2159999999999997}]
[null,"*Tarifa municipal"]
[]
[{"$f":"+Cotações!A139","v":122},"Laje de Grês 90x45","un","CNPJ","Telefone","Contato","Data","Valor","Valor Média"]
[{"$f":"+Cotações!$D$138","v":"Rodrigo Paz"},null,null,"16.975.098/0001-32",{"$f":"+Cotações!$E$138","v":"3318-1010"},"Rodrigo","2021-03-31",{"$f":"+Cotações!D139","v":8},{"$f":"Cotações!N139","v":8}]
[{"$f":"+Cotações!$F$138","v":"Alicerce da Const"},null,null,"11.831.448/0001-73",{"$f":"+Cotações!$G$138","v":"3318-1010"},"Kassiele","2021-07-02",{"$f":"+Cotações!F139","v":14.9}]
[{"$f":"+Cotações!$H$138","v":"Maico Pedras"},null,null,"03.599.794/0001-40",{"$f":"+Cotações!$I$138","v":"99817-3559"},"Maico","2021-06-15",{"$f":"+Cotações!H139","v":6}]
[]
[{"$f":"+Cotações!A150","v":128},"ART","un","CNPJ","Telefone","Contato","Data","Valor","Valor Atual"]
[{"$f":"+Cotações!$D$149","v":"CREA-RS"},null,null,"92.695.790/0001-95","3320-2100","Site","2021-01-05",{"$f":"+Cotações!D150","v":226.5},{"$f":"+Insumos!G38","v":226}]

{"sheet":"Insumos","index":7,"n_rows":235,"n_cols":8,"rows_kept":235,"cut":false,"hidden":false,"merged":[[5,3,5,4],[5,0,5,1],[232,3,232,4],[6,0,6,5],[4,0,4,1],[5,5,5,7],[4,5,4,7],[234,3,234,4],[231,0,233,2],[234,0,234,2],[233,3,233,4],[231,3,231,4],[0,0,0,7],[2,0,2,7],[1,0,1,7],[3,0,3,7],[4,3,4,4]]}
["PLANILHA DE INSUMOS"]
[]
["Data Base SINAPI: JUNHO / 2021 - Data das Cotações: JULHO / 2021"]
[]
["L. S. Horistas:",null,{"$f":"+Planilha_M.O.!$D$7","v":1.111},"Selecionar"]
["L. S. Mensalistas:",null,{"$f":"+Planilha_M.O.!$D$8","v":0.69159999999999999},"MEDIANA"]
[]
["Item","Código","Insumo","Un","Tipo","Origem","Valor","Observações"]
[1,43053,"Aço CA-25 8,0 mm","kg","MAT","SINAPI",11.51]
[{"$f":"+A9+1","v":2},43054,"Aço CA-25 10,0 mm","kg","MAT","SINAPI",12.89]
[{"$f":"+A10+1","v":3},43054,"Aço CA-25 12,5 mm","kg","MAT","SINAPI",12.89]
[{"$f":"+A11+1","v":4},43054,"Aço CA-25 16,0 mm","kg","MAT","SINAPI",12.89]
[{"$f":"+A12+1","v":5},43054,"Aço CA-25 20,0 mm","kg","MAT","SINAPI",12.89]
[{"$f":"+A13+1","v":6},34449,"Aço CA-50  1/4\" (6,3 mm) - 0,248 kg/m","kg","MAT","SINAPI",14.07]
[{"$f":"+A14+1","v":7},32,"Aço CA-50  1/4\" (6,3 mm) - 0,248 kg/m - Vergalhão","kg","MAT","SINAPI",12.65]
[8,33,"Aço CA-50 5/16\" (8,0 mm) - 0,393 kg/m - Vergalhão","kg","MAT","SINAPI",12.73]
[{"$f":"+A16+1","v":9},43058,"Aço CA-50  10 mm (3/8\") dobrado e cortado - 0,624 kg/m","kg","MAT","SINAPI",11.94]
[10,43058,"Aço CA-50  5/8\" (16 mm) - 1,570 kg/m","kg","MAT","SINAPI",11.94]
[11,43061,"Aço CA-60 4,2mm - 0,109 kg/m","kg","MAT","SINAPI",11.89]
[12,43059,"Aço CA-60 4,2mm - 0,109 kg/m - Vergalhão","kg","MAT","SINAPI",11.35]
[13,43061,"Aço CA-60 5,0 mm - 0,157 kg/m","kg","MAT","SINAPI",11.89]
[14,43062,"Aço CA-60 6,0 mm - 0,222 kg/m","kg","MAT","SINAPI",12.58]
[15,43059,"ACO CA-60, 4,2 MM, OU 5,0 MM, OU 6,0 MM, OU 7,0 MM, VERGALHAO","kg","MAT","SINAPI",11.35]
[16,122,"Adesivo Plástico para PVC, frasco com 850 g","un","MAT","SINAPI",83.11]
[{"$f":"+A24+1","v":17},10527,"Andaime metálico, tipo torre, largura de 1 a 1,5 m e altura de 1 m locação","mxmês","MAT","SINAPI",23.5]
[18,43131,"Arame Galvanizado 8 BWG (0,101 kg/m)","kg","MAT","SINAPI",27.77]
[19,43131,"Arame Galvanizado 10 BWG (0,0713 kg/m)","kg","MAT","SINAPI",27.77]
[20,43130,"Arame Galvanizado 12 BWG (0,048 kg / m)","kg","MAT","SINAPI",23.91]
[21,43132,"ARAME RECOZIDO 16 BWG, D = 1,65 MM (0,016 KG/M) OU 18 BWG, D = 1,25 MM (0,01 KG/M)","kg","MAT","SINAPI",25.83]
[22,366,"Areia fina","m³","MAT","SINAPI",65]
[23,367,"Areia grossa","m³","MAT","SINAPI",60]
[24,370,"Areia média","m³","MAT","SINAPI",63.5]
[25,1381,"Argamassa Colante AC-I","kg","MAT","SINAPI",0.5]
[26,38546,"ARGAMASSA USINADA AUTOADENSAVEL E AUTONIVELANTE PARA CONTRAPISO, INCLUI BOMBEAMENTO","m³","MAT","SINAPI",376.44]
[27,6081,"Argila ou Barro para aterro ou reaterro","m³","MAT","SINAPI",31.59]
[28,1094,"ARMAÇÃO VERTICAL C/HASTE E CONTRA-PINO, EM CHAPA DE FG 3/16\", C/1 ESTRIBO","un","MAT","SINAPI",13.98]
[29,11267,"ARRUELA LISA, DE LATÃO POLIDO, DIÂMETRO NOMINAL 5/8\", DIÂMETRO DO FURO = 17 mm","un","MAT","SINAPI",0.8]
[30,{"$f":"+Cotações!A150","v":128},"ART","un","MAT","Cotação",{"$f":"TRUNC((IF($D$6=\"MÉDIA\",Cotações!M150,Cotações!N150)))","v":226}]
[31,{"$f":"+Cotações!A85","v":82},"(ATI) Abdominal","un","MAT","Cotação",{"$f":"Cotações!M85","v":4936.66}]
[32,{"$f":"+Cotações!A86","v":83},"(ATI) Adução e abdução de pernas duplo","un","MAT","Cotação",{"$f":"Cotações!M86","v":9193.33}]
[33,{"$f":"+Cotações!A87","v":84},"(ATI) Esqui triplo conjugado","un","MAT","Cotação",{"$f":"Cotações!M87","v":16140}]
[34,{"$f":"+Cotações!A88","v":85},"(ATI) Jogo de barras","un","MAT","Cotação",{"$f":"Cotações!M88","v":9359.33}]
[35,{"$f":"+Cotações!A89","v":86},"(ATI) Multiexercitador conjugado 6 funções","un","MAT","Cotação",{"$f":"Cotações!M89","v":16191.33}]
[36,{"$f":"+Cotações!A90","v":87},"(ATI) Peitoral duplo","un","MAT","Cotação",{"$f":"Cotações!N90","v":9790}]
[37,{"$f":"+Cotações!A91","v":88},"(ATI) Placa orientativa","un","MAT","Cotação",{"$f":"Cotações!M91","v":7695.33}]
[38,{"$f":"+Cotações!A92","v":89},"(ATI) Pressão de pernas triplo conjugado","un","MAT","Cotação",{"$f":"Cotações!M92","v":9472}]
[39,{"$f":"+Cotações!A93","v":90},"(ATI) Puxador duplo","un","MAT","Cotação",{"$f":"TRUNC((IF($D$6=\"MÉDIA\",Cotações!M93,Cotações!N93)))","v":10428}]
[40,{"$f":"+Cotações!A94","v":91},"(APC) Remada","un","MAT","Cotação",{"$f":"Cotações!N94","v":5940}]
[41,{"$f":"+Cotações!A95","v":92},"(ATI) Simulador de caminhada triplo conjugado","un","MAT","Cotação",{"$f":"Cotações!M95","v":13224.66}]
[42,{"$f":"+Cotações!A96","v":93},"(ATI) Simulador de remo","un","MAT","Cotação",{"$f":"TRUNC((IF($D$6=\"MÉDIA\",Cotações!M96,Cotações!N96)))","v":5640}]
[43,{"$f":"+Cotações!A97","v":94},"(APC) Voador peitoral e voador dorsal","un","MAT","Cotação",{"$f":"Cotações!N97","v":6200}]
[44,546,"Barra de ferro chata, retangular (qualquer bitola)","kg","MAT","SINAPI",9.8699999999999992]
[45,563,"Barra ferro chato 1 1/2\" x 3/8\"","m","MAT","SINAPI",28.31]
[46,547,"Barra ferro chato 2\" x 3/8\"","kg","MAT","SINAPI",37.78]
[47,{"$f":"+Cotações!A99","v":95},"Basalto irregular","m²","MAT","Cotação",{"$f":"Cotações!N99","v":60}]
[48,{"$f":"+Cotações!A100","v":96},"Basalto  irregular meio retalhão","m²","MAT","Cotação",{"$f":"TRUNC((IF($D$6=\"MÉDIA\",Cotações!M100,Cotações!N100)))","v":115}]
[49,{"$f":"+Cotações!A101","v":97},"Basalto regular talhado","m²","MAT","Cotação",{"$f":"Cotações!N101","v":87.5}]
[50,{"$f":"+Cotações!A102","v":98},"Basalto regular serrado","m²","MAT","Cotação",{"$f":"TRUNC((IF($D$6=\"MÉDIA\",Cotações!M102,Cotações!N102)))","v":115}]
[51,36155,"Bloco concreto tipo holandês cor natural - 6 cm - 35 MPa","m²","MAT","SINAPI",31.66]
[52,38783,"BLOCO CERAMICO DE VEDACAO COM FUROS NA HORIZONTAL, 11,5 X 19 X 19 CM - 4,5 MPA (NBR 15270)","un","MAT","SINAPI",0.96]
[53,20086,"Bucha de redução de PVC, longa 50 x 40 mm, esgoto predial","un","MAT","SINAPI",2.79]
[54,4375,"Bucha nylon S-6 4,2 x 38","un","MAT","SINAPI",0.16]
[55,4376,"Bucha nylon S-8 4,8 x 45","un","MAT","SINAPI",0.31]
[56,11950,"BUCHA NYLON S/ABA S6, C/PARAFUSO DE 4,2 x 40 mm EM AÇO ZINCADO C/ROSCA SOBERBA","un","MAT","SINAPI",0.37]
[57,41954,"Cabo de aço galvanizado, diâmetro 9,53 mm","kg","MAT","SINAPI",75.64]
[58,{"$f":"+Cotações!A129","v":113},"Caçamba 4,00 m³","un","MAT","Cotação",{"$f":"Cotações!M129","v":443.33}]
[59,4400,"CAIBRO NAO APARELHADO, *6 X 8* CM, EM MACARANDUBA, ANGELIM OU EQUIVALENTE DA REGIAO - BRUTA","m","MAT","SINAPI",16.87]
[60,4430,"Caibro de madeira não aparelhada 5 x 6 cm","m","MAT","SINAPI",10.6]
[61,34643,"CAIXA INSPEÇÃO EM POLIETILENO PARA ATERRAMENTO E PÁRA RAIOS DIÂMETRO = 300 mm","un","MAT","SINAPI",20.079999999999998]
[62,39809,"CAIXA P/MEDIDOR POLIFÁSICO, EM POLICARBONATO/TERMOPLÁSTICO, P/1 DISJUNTOR","un","MAT","SINAPI",138.18]
[63,25963,"CALCARIO DOLOMITICO A (POSTO PEDREIRA/FORNECEDOR, SEM FRETE)","kg","MAT","SINAPI",0.08]
[{"$f":"+A71+1","v":64},4777,"Cantoneira aço (abas iguais) qualquer bitola, espessura entre 1/8\" e 1/4\"","kg","MAT","SINAPI",10.65]
[{"$f":"+A72+1","v":65},4777,"Cantoneira ferro 1 1/4\" x 3/16\"","kg","MAT","SINAPI",10.65]
[66,4777,"Cantoneira ferro 1 1/2\" x 1/4\"","kg","MAT","SINAPI",10.65]
[67,11046,"CHAPA DE ACO GALVANIZADA BITOLA GSG 18, E = 1,25 MM (10,00 KG/M2)","kg","MAT","SINAPI",15.77]
[68,11049,"CHAPA DE ACO GALVANIZADA BITOLA GSG 22, E = 0,80 MM (6,40 KG/M2)","kg","MAT","SINAPI",16.43]
[69,11051,"CHAPA DE ACO GALVANIZADA BITOLA GSG 26, E = 0,50 MM (4,00 KG/M2)","kg","MAT","SINAPI",17.25]
[70,1355,"Chapa compensado resinado 14 mm","m²","MAT","SINAPI",28.72]
[71,1347,"Chapa de madeira compensada plastificada 12 mm","m²","MAT","SINAPI",27.6]
[72,1342,"Chapa compensado plastificado 14 mm","m²","MAT","SINAPI",71.14]
[73,1333,"Chapa de aço 1/2\"","kg","MAT","SINAPI",12.53]
[74,1330,"Chapa de aço 1/4\"","kg","MAT","SINAPI",12.41]
[75,34353,"CIMENTO COLA AC-2","kg","MAT","SINAPI",0.98]
[76,1379,"Cimento Portland CP-II 32","kg","MAT","SINAPI",0.65]
[77,1527,"Concreto usinado bombeável, fck=25 MPa, slump = 100 +/- 20 mm, inclui serviço de bombeamento","m³","MAT","SINAPI",384.28]
[78,34498,"Cone de sinalização em PVC flexível, h=70/76 cm","un","MAT","SINAPI",114.77]
[79,11864,"CONECTOR METÁLICO TIPO PARAFUSO FENDIDO (SPLIT BOLT), PARA CABOS ATÉ 95 mm2","un","MAT","SINAPI",29.18]
[80,{"$f":"+Cotações!A76","v":76},"Corrente aço galvanizado 5 mm elo longo 22 x 45 mm","kg","MAT","Cotação",{"$f":"Cotações!M76","v":23.08}]
[81,{"$f":"+Cotações!A144","v":125},"Cuba inox p/bebedouro 38 cm","un","MAT","Cotação",{"$f":"Cotações!M144","v":189.7}]
[82,1970,"Curva PVC longa 90 esgoto predial 100 mm","un","MAT","SINAPI",55.87]
[83,2692,"Desmoldante p/formas de madeira","l","MAT","SINAPI",4.46]
[{"$f":"+A91+1","v":84},25931,"DISCO DE CORTE DIAMANTADO SEGMENTADO DIAMETRO DE 180 MM PARA ESMERILHADEIRA 7 \"","un","MAT","SINAPI",92.37]
[85,2421,"Dobradiça ferro galvanizado 4\" x 3\"","un","MAT","SINAPI",23.91]
[86,11002,"ELETRODO REVESTIDO AWS - E6013, DIAMETRO IGUAL A 2,50 MM","kg","MAT","SINAPI",41.2]
[{"$f":"A94+1","v":87},2705,"ENERGIA ELÉTRICA ATÉ 2000 kWh INDUSTRIAL, SEM DEMANDA","kWh","MAT","SINAPI",0.91]
[{"$f":"A95+1","v":88},6141,"ENGATE/RABICHO FLEXIVEL PLASTICO (PVC OU ABS) BRANCO 1/2 \" X 30 CM","un","MAT","SINAPI",4.91]
[89,39017,"Espaçador circular em plástico, 4,2 a 12,5 mm","m","MAT","SINAPI",0.13]
[90,10886,"EXTINTOR DE INCENDIO PORTATIL COM CARGA DE AGUA PRESSURIZADA DE 10 L, CLASSE A","un","MAT","SINAPI",183.75]
[91,10891,"EXTINTOR DE INCENDIO PORTATIL COM CARGA DE PO QUIMICO SECO (PQS) DE 4 KG, CLASSE BC","un","MAT","SINAPI",177.69]
[92,38125,"Fertilizante orgânico composto, classe A","kg","MAT","SINAPI",1.33]
[93,25951,"FERTILIZANTE NPK - 10:10:10","kg","MAT","SINAPI",2.25]
[94,12815,"Fita crepe rolo 25 mm x 50 m","un","MAT","SINAPI",7.28]
[95,14153,"FITA METÁLICA PERFURADA, L = 18 mm, ROLO DE 30 m, CARGA RECOMENDADA = 30 kgf","un","MAT","SINAPI",52.81]
[96,3148,"Fita veda rosca em rolos de 18 mm x 50 m","un","MAT","SINAPI",18.399999999999999]
[97,42015,"Fita zebrada","m","MAT","SINAPI",1.1200000000000001]
[98,{"$f":"+Cotações!A83","v":81},"Fradinho em ferro fundido","un","MAT","Cotação",{"$f":"Cotações!M83","v":314}]
[99,7307,"Fundo anticorrosivo tipo zarcão","l","MAT","SINAPI",29.63]
[{"$f":"+A107+1","v":100},{"$f":"+Cotações!A119","v":108},"Fundo p/galvanizado","l","MAT","Cotação",{"$f":"Cotações!M119","v":34.81}]
[101,6086,"Fundo sintético nivelador branco fosco","gl","MAT","SINAPI",90.88]
[102,4011,"GEOTEXTIL NAO TECIDO AGULHADO DE FILAMENTOS CONTINUOS 100%","m²","MAT","SINAPI",6.75]
[103,3322,"Grama catarina (Grama São Carlos)","m²","MAT","SINAPI",20.45]
[104,{"$f":"+Cotações!A12","v":20},"Guia cedrinho 2,5 x 10 cm","m","MAT","Cotação",{"$f":"Cotações!N12","v":14.37}]
[105,{"$f":"+Cotações!A13","v":22},"Guia cedrinho 2,5 x 20 cm","m","MAT","Cotação",{"$f":"Cotações!N13","v":28.75}]
[106,3398,"ISOLADOR DE PORCELANA, TIPO ROLDANA, DIMENSÕES DE 72 x 72 mm","un","MAT","SINAPI",4.7699999999999996]
[107,3505,"Joelho PVC roscável 90⁰ 3/4\"","un","MAT","SINAPI",4.6399999999999997]
[108,{"$f":"+Cotações!A139","v":122},"Laje de grês 90 x 45 cm","un","MAT","Cotação",{"$f":"Cotações!M139","v":9.6300000000000008}]
[109,{"$f":"+Cotações!A104","v":99},"Lajota concreto","m²","MAT","Cotação",{"$f":"Cotações!N104","v":32.9}]
[110,{"$f":"+Cotações!A37","v":46},"Laminado melamínico fosco esp = 2,8 mm","m²","MAT","Cotação",{"$f":"Cotações!N37","v":32.25}]
[111,3768,"Lixa p/ferro","fl","MAT","SINAPI",3.37]
[112,3767,"Lixa p/madeira","fl","MAT","SINAPI",0.79]
[113," 89.50.09","BANHEIRO QUIMICO 2 MANUT. 2 ROLOS PAPEL HIGIENICO","mês","MAT","SUDECAP",680]
[114,3777,"LONA PLASTICA PESADA PRETA, E = 150 MICRA","m²","MAT","SINAPI",1.47]
[115,4011,"Manta Bidim RT-10","m²","MAT","SINAPI",5.29]
[116,3288,"Meia cana cedrinho 2,5 x 2,5 cm","m","MAT","SINAPI",4.29]
[117,4059,"Meio-fio pré-moldado, comp. 1 m, 30 x 15/12 cm (h x l1/l2)","m","MAT","SINAPI",22.86]
[118,{"$f":"+Cotações!A115","v":106},"Microfibra de polipropileno","sc","MAT","Cotação",{"$f":"Cotações!N115","v":23.2}]
[119,4107,"Mourão de concreto reto, 10 x 10 cm, h= 2,30 m","un","MAT","SINAPI",43.99]
[120,36797,"Mourão de concreto curvo, 10 x 10 cm, h= 2,60 m + curva de 0,40 m","un","MAT","SINAPI",46.66]
[121,4211,"Nipel PVC roscável 3/4\"","un","MAT","SINAPI",1.93]
[122,7252,"LOCACAO DE NIVEL OPTICO, COM PRECISAO DE 0,7 MM, AUMENTO DE 32X","un","MAT","SINAPI",2.0299999999999998]
[{"$f":"+A129+1","v":122},4227,"Óleo lubrificante para motores","l","MAT","SINAPI",1.93]
[{"$f":"+A131+1","v":123},{"$f":"+Cotações!A123","v":110},"Papeleira externa metálica H-30","un","MAT","Cotação",{"$f":"TRUNC((IF($D$6=\"MÉDIA\",Cotações!M123,Cotações!N123)))","v":900}]
[124,{"$f":"+Cotações!A41","v":48},"Parafuso aço inox 1/4\" x 3\" c/porca","un","MAT","Cotação",{"$f":"Cotações!M41","v":2.0299999999999998}]
[125,{"$f":"+Cotações!A42","v":49},"Parafuso francês zincado 5/16\" x 2\" c/porca","un","MAT","Cotação",{"$f":"Cotações!M42","v":0.91}]
[126,{"$f":"+Cotações!A43","v":50},"Parafuso francês zincado 5/16\" x 2 1/2\" c/porca","un","MAT","Cotação",{"$f":"Cotações!M43","v":1.06}]
[127,{"$f":"+Cotações!A44","v":51},"Parafuso francês zincado 5/16\" x 4\" c/porca","un","MAT","Cotação",{"$f":"Cotações!M44","v":1.47}]
[128,{"$f":"+Cotações!A45","v":52},"Parafuso francês zincado 5/16\" x 5\" c/porca","un","MAT","Cotação",{"$f":"Cotações!M45","v":1.74}]
[129,{"$f":"+Cotações!A46","v":53},"Parafuso inox auto atarraxante 4,8 x 70","un","MAT","Cotação",{"$f":"Cotações!N46","v":1.01}]
[{"$f":"+A138+1","v":130},{"$f":"+Cotações!A47","v":54},"Parafuso inox auto atarraxante 4,8 x 100","un","MAT","Cotação",{"$f":"Cotações!M47","v":2.52}]
[{"$f":"+A139+1","v":131},4346,"PARAFUSO FERRO POLIDO, SEXTAVADO, D=5/8\", C/PORCA E ARRUELA DE PRESSÃO MÉDIA","un","MAT","SINAPI",6.93]
[132,4356,"Parafuso rosca soberba 4,8 x 45 mm","un","MAT","SINAPI",0.16]
[{"$f":"+A141+1","v":133},4332,"Parafuso sextavado aço zincado 3/8\"x 2\"","un","MAT","SINAPI",0.68]
[134,{"$f":"+Cotações!A48","v":55},"Parafuso sextavado aço zincado 1/2\" x 1 1/2\"","un","MAT","Cotação",{"$f":"Cotações!M48","v":1.7}]
[135,{"$f":"+Cotações!A49","v":56},"Parafuso sextavado aço zincado 1/2\" x 3 1/2\"","un","MAT","Cotação",{"$f":"Cotações!M49","v":3.38}]
[136,{"$f":"+Cotações!A51","v":58},"Parafuso sextavado aço zincado c/porca 1/4\" x 2\"","un","MAT","Cotação",{"$f":"Cotações!M51","v":0.59}]
[137,4385,"Paralelepípedo granítico ou basáltico","un","MAT","SINAPI",1.52]
[138,4813,"PLACA DE OBRA (PARA CONSTRUCAO CIVIL) EM CHAPA GALVANIZADA *N. 22*","un","MAT","SINAPI",225]
[139,4720,"Pedra britada nº 0","m³","MAT","SINAPI",63.85]
[140,4721,"Pedra britada nº 1","m³","MAT","SINAPI",55.3]
[141,4718,"PEDRA BRITADA N. 2 (19 A 38 MM) POSTO PEDREIRA/FORNECEDOR, SEM FRETE","m³","MAT","SINAPI",55.6]
[142,{"$f":"+Cotações!A142","v":124},"Pedra de alicerce 20 x 20 x 20 cm","un","MAT","Cotação",{"$f":"Cotações!M142","v":5.25}]
[143,{"$f":"+Cotações!A140","v":123},"Pedra de grês 43 x 21 x 12 cm","un","MAT","Cotação",{"$f":"Cotações!M140","v":2.09}]
[144,4708,"PEDRA PORTUGUESA OU PETIT PAVE, BRANCA OU PRETA","m²","MAT","SINAPI",217.56]
[145,37395,"PINO DE ACO COM FURO, HASTE = 27 MM (ACAO DIRETA)","m","MAT","SINAPI",38.39]
[146,{"$f":"+Cotações!A105","v":100},"Piso podotátil 25x25 cm","un","MAT","Cotação",{"$f":"Cotações!N105","v":3.5}]
[147,{"$f":"+Cotações!A127","v":112},"Placa de granito","un","MAT","Cotação",{"$f":"Cotações!M127","v":697.5}]
[148,4813,"PLACA DE OBRA (PARA CONSTRUCAO CIVIL) EM CHAPA GALVANIZADA *N. 22*, ADESIVADA, DE *2,0 X 1,125* M","m²","MAT","SINAPI",225]
[149,4741,"Pó de pedra","m³","MAT","SINAPI",52.24]
[150,2745,"PONTALETE ROLIÇO SEM TRATAMENTO, D = 8 A 11 CM, H = 3 M, EM EUCALIPTO OU EQUIVALENTE DA REGIAO - BRUTA (PARA ESCORAMENTO)","m","MAT","SINAPI",3.39]
[151,4491,"PONTALETE EM PINUS 7,5 x 7,5 cm","m","MAT","SINAPI",4.07]
[152,4339,"Porca sextavada aço zincado 1/2\"","un","MAT","SINAPI",0.34]
[153,4342,"Porca sextavada aço zincado 3/8\"","un","MAT","SINAPI",0.14000000000000001]
[154,39997,"PORCA ZINCADA, SEXTAVADA, DIÂMETRO 1/4\"","un","MAT","SINAPI",0.2]
[155,20247,"Prego de aço 15 x 15 c/cabeça","kg","MAT","SINAPI",22.47]
[156,5074,"Prego de aço 15 x 18 c/cabeça","kg","MAT","SINAPI",22.74]
[157,5075,"PREGO DE AÇO 18 x 30 C/CABEÇA","kg","MAT","SINAPI",21.11]
[158,5068,"PREGO DE ACO POLIDO COM CABECA 17 X 21 (2 X 11)","kg","MAT","SINAPI",21.11]
[159,5073,"Prego de aço 17 x 24 c/cabeça","kg","MAT","SINAPI",20.68]
[{"$f":"+A168+1","v":160},40304,"Prego de aço 17 x 27 c/cabeça dupla","kg","MAT","SINAPI",25.05]
[161,5061,"PREGO DE AÇO 18 x 27 C/CABEÇA","kg","MAT","SINAPI",20.75]
[162,39027,"Prego de aço 19 x 36 c/cabeça","kg","MAT","SINAPI",20.27]
[163,5044,"POSTE DE CONCRETO CIRCULAR, 200 kg, H = 9 m","un","MAT","SINAPI",920.7]
[164,20043,"REDUÇÃO EXCÊNTRICA PVC P/ ESGOTO PREDIAL 100 x 50 mm","un","MAT","SINAPI",8.94]
[165,6016,"REGISTRO GAVETA BRUTO EM LATÃO FORJADO, BITOLA 3/4\"","un","MAT","SINAPI",32.79]
[166,{"$f":"+Cotações!A107","v":101},"Saibro rosa - posto obra","m³","MAT","Cotação",{"$f":"Cotações!M107","v":59}]
[167,{"$f":"+Cotações!A8","v":27},"Sarrafo cedrinho 2,5 x 2,5 cm","m","MAT","Cotação",{"$f":"Cotações!N8","v":4.5999999999999996}]
[168,{"$f":"+Cotações!A9","v":28},"Sarrafo cedrinho 2,5 x 5,0 cm","m","MAT","Cotação",{"$f":"Cotações!N9","v":7.5}]
[169,4417,"Sarrafo de madeira não aparelhada 2,5x7 cm","m","MAT","SINAPI",32.79]
[170,4460,"Sarrafo não aparelhado 2,5x10 cm","m","MAT","SINAPI",7.48]
[171,4512," SARRAFO DE MADEIRA NAO APARELHADA 2,5 X 5 CM (1 X 2 \") PINUS, MISTA OU EQUIVALENTE DA REGIAO","m","MAT","SINAPI",0.98]
[172,4517,"Sarrafo pinus 2,5 x 7,5 cm","m","MAT","SINAPI",1.53]
[173,5318,"Solvente Diluente a base de aguarrás","l","MAT","SINAPI",17.98]
[174,6193,"Tábua de madeira não aparelhada cedrinho 2,5 x 20 cm","m","MAT","SINAPI",14.98]
[175,6189,"Tábua de madeira não aparelhada cedrinho 2,5 x 30 cm","m","MAT","SINAPI",21.86]
[176,{"$f":"+Cotações!$A$154","v":130},"Tabuleiro p/mesa de damas 40 x 40 cm","un","MAT","Cotação",{"$f":"TRUNC((IF($D$6=\"MÉDIA\",Cotações!M154,Cotações!N154)))","v":950},"VALOR ATUALIZADO"]
[177,1163,"CAP OU TAMPAO DE FERRO GALVANIZADO, COM ROSCA BSP, DE 3/4\"","un","MAT","SINAPI",5.43]
[178,1164,"Tampão de ferro galvanizado de 1 1/4\"","un","MAT","SINAPI",12.08]
[179,1165,"Tampão de ferro galvanizado de 1 1/2\"","un","MAT","SINAPI",14.92]
[180,1166,"Tampão de ferro galvanizado de 2\"","un","MAT","SINAPI",21.55]
[181,1169,"Tampão de ferro galvanizado de 2 1/2\"","un","MAT","SINAPI",41.16]
[182,1168,"Tampão de ferro galvanizado de 3\"","un","MAT","SINAPI",55.4]
[183,34558,"TELA DE ACO SOLDADA GALVANIZADA/ZINCADA PARA ALVENARIA, FIO D = *1,20 A 1,70* MM, MALHA 15 X 15 MM, (C X L) *50 X 10,5* CM","m²","MAT","SINAPI",5.76]
[184,37411,"TELA DE ACO SOLDADA GALVANIZADA/ZINCADA PARA ALVENARIA, FIO D = *1,24 MM, MALHA 25 X 25 MM","m²","MAT","SINAPI",33.5]
[185,37524,"TELA PLASTICA LARANJA, TIPO TAPUME PARA SINALIZACAO, MALHA RETANGULAR, ROLO 1.20 X 50 M (L X C)","m","MAT","SINAPI",2.06]
[186,7155,"Tela de aço soldada CA-60 4,2 mm 10 x 10 cm (Q-138)","m²","MAT","SINAPI",35.270000000000003]
[187,7158,"TELA DE ARAME GALVANIZADA QUADRANGULAR / LOSANGULAR, FIO 2,77 MM (12 BWG), MALHA 5 X 5 CM, H = 2 M","m²","MAT","SINAPI",23.48]
[188,21141,"Tela de aço soldada CA-60 4,2 mm 15 x 15 cm (Q-92)","m²","MAT","SINAPI",24.18]
[189,7156,"Tela de aço soldada CA-60 5,0 mm 10 x 10 cm (Q-196)","m²","MAT","SINAPI",51.7]
[190,7258,"TIJOLO CERAMICO MACICO *5 X 10 X 20* CM","un","MAT","SINAPI",0.62]
[191,10617,"Tijolo cerâmico refratário 6,3 x 11,4 x 22,9 cm","un","MAT","SINAPI",5.05]
[192,34401,"TIJOLO CERÂMICO LAMINADO 5,5 x 11 x 23 cm","un","MAT","SINAPI",1.71]
[193,7311,"TINTA ESMALTE SINTETICO PREMIUM ACETINADO","l","MAT","SINAPI",28.37]
[194,7348,"Tinta acrílica premium para piso","l","MAT","SINAPI",17.12]
[195,7356,"TINTA ACRILICA PREMIUM, COR BRANCO FOSCO","l","MAT","SINAPI",25.69]
[196,7292,"Tinta esmalte sintético brilhante","l","MAT","SINAPI",27.61]
[197,7293,"Tinta grafite","l","MAT","SINAPI",30.39]
[198,35693,"TINTA LÁTEX ACRÍLICA ECONÔMICA, COR BRANCA","l","MAT","SINAPI",11.78]
[199,21009,"Tubo aço galvanizado c/costura 3/4\", 2,25 mm","m","MAT","SINAPI",30.9]
[200,21010,"Tubo aço galvanizado c/costura 1\", 2,65 mm","m","MAT","SINAPI",41.49]
[201,21011,"Tubo aço galvanizado c/costura 1 1/4\", 2,65 mm","m","MAT","SINAPI",60.47]
[202,21012,"Tubo aço galvanizado c/costura 1 1/2\", 3,00 mm","m","MAT","SINAPI",77.03]
[203,21013,"Tubo aço galvanizado c/costura 2\", 3,00 mm","m","MAT","SINAPI",87.2]
[204,21014,"Tubo aço galvanizado c/costura 2 1/2\", 3,35 mm","m","MAT","SINAPI",140.66]
[205,21015,"Tubo aço galvanizado c/costura 3\", 3,35 mm","m","MAT","SINAPI",140.18]
[206,21016,"Tubo aço galvanizado c/costura 4\", 3,75 mm","m","MAT","SINAPI",203.16]
[207,7745,"Tubo PA-1 PB 400 mm","m","MAT","SINAPI",78.55]
[208,9833,"Tubo PVC, flexível, corrugado, perfurado, DN 110 mm, para drenagem","m","MAT","SINAPI",9.51]
[{"$f":"+A217+1","v":209},9837,"Tubo PVC p/esgoto predial 75 mm","m","MAT","SINAPI",15.63]
[210,9836,"Tubo PVC p/esgoto predial 100 mm","m","MAT","SINAPI",17.64]
[211,9868,"TUBO PVC SOLDÁVEL 25 mm","m","MAT","SINAPI",4.91]
[212,9869,"TUBO PVC SOLDÁVEL 32mm","m","MAT","SINAPI",11.02]
[213,9859,"TUBO PVC ROSCÁVEL 3/4\"","m","MAT","SINAPI",13.24]
[214,20065,"Tubo PVC p/esgoto predial 150 mm","m","MAT","SINAPI",45.13]
[215,41930,"Tubo coletor de esgoto PVC, JEI, DN 200 mm","m","MAT","SINAPI",142.47]
[216,{"$f":"+Cotações!A125","v":111},"Válvula de mictório anti-vandalismo alta pressão","un","MAT","Cotação",{"$f":"Cotações!N125","v":413.9}]
[217,10478,"VERNIZ POLIURETANO BRILHANTE PARA MADEIRA, COM FILTRO SOLAR, USO INTERNO E EXTERNO","l","MAT","SINAPI",30.97]
[218,39996,"VERGALHÃO ZINCADO ROSCA TOTAL, 1/4 \" (6,3 mm)","m","MAT","SINAPI",5.38]
[219,4481,"VIGA NAO APARELHADA *8 X 16* CM EM MACARANDUBA, ANGELIM OU EQUIVALENTE DA REGIAO - BRUTA","m","MAT","SINAPI",43.33]
[220,35272,"VIGA NAO APARELHADA *6 X 20* CM, EM MACARANDUBA, ANGELIM OU EQUIVALENTE DA REGIAO","m","MAT","SINAPI",40.479999999999997]
[]
[]
["Totais",null,null,"SINAPI",null,{"$f":"+COUNTIF($F$9:$F$230,\"SINAPI\")","v":171}]
[null,null,null,"SUDECAP",null,1]
[null,null,null,"Cotação",null,{"$f":"+COUNTIF($F$9:$F$230,\"Cotação\")","v":49}]
["Total Final",{"$nulls":4},{"$f":"F232+F234+F233","v":221}]

{"sheet":"Cotações","index":8,"n_rows":154,"n_cols":14,"rows_kept":154,"cut":false,"hidden":false,"merged":[[102,0,102,2],[116,7,116,8],[116,5,116,6],[100,7,100,8],[125,11,125,13],[123,11,123,13],[84,11,96,11],[86,5,86,6],[84,5,84,6],[96,3,96,4],[98,3,98,4],[86,3,86,4],[88,3,88,4],[99,3,99,4],[105,0,105,2],[92,3,92,4],[92,7,92,8],[93,5,93,6],[93,3,93,4],[94,3,94,4],[84,9,84,10],[91,7,91,8],[85,7,85,8],[98,7,98,8],[129,11,129,13],[105,7,105,8],[106,7,106,8],[104,7,104,8],[105,11,105,13],[113,9,113,10],[101,9,101,10],[86,9,86,10],[96,7,96,8],[95,7,95,8],[97,11,97,13],[121,11,121,13],[94,7,94,8],[94,9,94,10],[95,9,95,10],[100,9,100,10],[99,9,99,10],[127,11,127,13],[93,7,93,8],[128,9,128,10],[119,11,119,13],[117,11,117,13],[102,11,102,13],[90,7,90,8],[132,5,132,6],[130,7,130,8],[108,9,108,10],[127,9,127,10],[133,9,133,10],[131,9,131,10],[130,9,130,10],[137,9,137,10],[122,9,122,10],[133,7,133,8],[121,7,121,8],[118,7,118,8],[109,7,109,8],[133,5,133,6],[117,5,117,6],[122,5,122,6],[126,9,126,10],[132,7,132,8],[110,7,110,8],[120,5,120,6],[152,0,152,2],[152,11,152,13],[151,3,151,4],[151,5,151,6],[151,9,151,10],[146,0,146,2],[139,5,139,6],[148,0,148,2],[149,5,149,6],[143,3,143,4],[145,3,145,4],[145,7,145,8],[145,9,145,10],[144,11,144,13],[145,5,145,6],[150,5,150,6],[150,7,150,8],[150,9,150,10],[150,11,150,13],[149,9,149,10],[149,7,149,8],[146,11,146,13],[146,5,146,6],[146,7,146,8],[153,7,153,8],[153,9,153,10],[150,0,150,2],[153,3,153,4],[153,5,153,6],[74,0,74,2],[81,0,81,2],[144,0,144,2],[141,3,141,4],[151,7,151,8],[128,3,128,4],[138,3,138,4],[140,7,140,8],[138,5,138,6],[139,3,139,4],[128,5,128,6],[135,3,135,4],[147,3,147,4],[149,3,149,4],[141,7,141,8],[143,7,143,8],[89,7,89,8],[104,3,104,4],[103,5,103,6],[55,5,55,6],[65,7,65,8],[64,7,64,8],[78,7,78,8],[76,7,76,8],[56,3,56,4],[61,5,61,6],[78,3,78,4],[75,3,75,4],[65,5,65,6],[75,5,75,6],[59,7,59,8],[58,3,58,4],[61,3,61,4],[55,7,55,8],[58,7,58,8],[57,7,57,8],[73,5,73,6],[76,3,76,4],[73,3,73,4],[67,5,67,6],[67,3,67,4],[76,5,76,6],[78,5,78,6],[80,3,80,4],[75,7,75,8],[84,7,84,8],[84,3,84,4],[72,3,72,4],[82,3,82,4],[82,7,82,8],[72,9,72,10],[70,9,70,10],[80,7,80,8],[80,5,80,6],[78,9,78,10],[132,0,132,2],[69,5,69,6],[63,5,63,6],[88,5,88,6],[89,5,89,6],[64,5,64,6],[88,7,88,8],[107,0,107,2],[124,5,124,6],[131,5,131,6],[103,3,103,4],[95,3,95,4],[100,3,100,4],[99,5,99,6],[114,7,114,8],[112,7,112,8],[131,7,131,8],[128,7,128,8],[126,7,126,8],[109,5,109,6],[118,3,118,4],[103,7,103,8],[124,7,124,8],[120,7,120,8],[95,5,95,6],[137,0,137,2],[140,0,140,2],[142,0,142,2],[124,9,124,10],[120,9,120,10],[119,9,119,10],[134,3,134,4],[126,3,126,4],[124,3,124,4],[131,3,131,4],[136,3,136,4],[130,5,130,6],[133,3,133,4],[121,9,121,10],[132,9,132,10],[123,9,123,10],[136,9,136,10],[126,5,126,6],[141,9,141,10],[139,9,139,10],[138,9,138,10],[141,5,141,6],[122,3,122,4],[148,11,148,13],[148,5,148,6],[148,7,148,8],[148,9,148,10],[147,5,147,6],[147,7,147,8],[147,9,147,10],[146,9,146,10],[135,7,135,8],[135,9,135,10],[135,5,135,6],[143,5,143,6],[143,9,143,10],[136,5,136,6],[136,7,136,8],[142,11,142,13],[140,11,140,13],[137,11,137,13],[139,7,139,8],[140,9,140,10],[138,7,138,8],[47,7,47,8],[51,7,51,8],[50,3,50,4],[36,5,36,6],[36,7,36,8],[37,0,37,2],[39,0,39,2],[41,3,41,4],[43,5,43,6],[44,5,44,6],[47,5,47,6],[46,5,46,6],[46,3,46,4],[41,7,41,8],[40,7,40,8],[45,7,45,8],[48,7,48,8],[46,7,46,8],[42,3,42,4],[43,3,43,4],[40,3,40,4],[45,3,45,4],[47,3,47,4],[43,7,43,8],[60,0,60,2],[64,9,64,10],[65,9,65,10],[70,5,70,6],[31,3,31,4],[33,3,33,4],[38,3,38,4],[36,3,36,4],[34,5,34,6],[49,3,49,4],[53,3,53,4],[49,5,49,6],[54,5,54,6],[53,5,53,6],[50,5,50,6],[51,3,51,4],[48,3,48,4],[54,3,54,4],[32,3,32,4],[34,3,34,4],[50,7,50,8],[68,0,68,2],[44,3,44,4],[51,5,51,6],[83,0,83,2],[82,5,82,6],[90,5,90,6],[112,3,112,4],[130,3,130,4],[129,0,129,2],[85,5,85,6],[87,5,87,6],[101,3,101,4],[85,3,85,4],[87,3,87,4],[92,5,92,6],[94,5,94,6],[118,5,118,6],[89,3,89,4],[119,0,119,2],[121,0,121,2],[123,0,123,2],[127,0,127,2],[106,5,106,6],[121,5,121,6],[110,5,110,6],[114,3,114,4],[97,0,97,2],[91,3,91,4],[91,5,91,6],[90,3,90,4],[118,9,118,10],[104,9,104,10],[103,9,103,10],[115,9,115,10],[114,9,114,10],[101,5,101,6],[100,5,100,6],[99,7,99,8],[98,9,98,10],[96,9,96,10],[101,7,101,8],[108,7,108,8],[105,5,105,6],[104,5,104,6],[106,3,106,4],[108,3,108,4],[108,5,108,6],[110,3,110,4],[109,3,109,4],[98,5,98,6],[96,5,96,6],[87,7,87,8],[60,11,60,13],[26,9,26,10],[40,5,40,6],[66,11,66,13],[42,9,42,10],[47,9,47,10],[44,9,44,10],[43,9,43,10],[52,9,52,10],[45,9,45,10],[51,9,51,10],[50,9,50,10],[49,9,49,10],[48,9,48,10],[28,7,28,8],[29,7,29,8],[31,7,31,8],[42,7,42,8],[27,7,27,8],[45,5,45,6],[56,5,56,6],[48,5,48,6],[86,7,86,8],[6,0,6,2],[8,9,8,10],[8,7,8,8],[7,3,7,4],[6,11,6,13],[7,9,7,10],[7,7,7,8],[7,5,7,6],[8,5,8,6],[8,3,8,4],[9,11,9,13],[10,3,10,4],[44,7,44,8],[25,7,25,8],[24,7,24,8],[24,5,24,6],[25,5,25,6],[32,5,32,6],[42,5,42,6],[31,5,31,6],[41,5,41,6],[33,5,33,6],[38,7,38,8],[38,5,38,6],[34,7,34,8],[33,7,33,8],[30,7,30,8],[35,9,35,10],[37,9,37,10],[25,9,25,10],[27,9,27,10],[18,7,18,8],[16,7,16,8],[17,7,17,8],[0,0,0,13],[4,0,4,13],[2,10,2,12],[5,9,5,10],[41,9,41,10],[38,9,38,10],[36,9,36,10],[34,9,34,10],[16,9,16,10],[15,9,15,10],[29,9,29,10],[33,9,33,10],[32,9,32,10],[30,9,30,10],[31,9,31,10],[32,7,32,8],[13,0,13,2],[23,3,23,4],[22,3,22,4],[19,9,19,10],[18,9,18,10],[39,11,39,13],[37,11,37,13],[9,0,9,2],[113,11,113,13],[106,9,106,10],[110,9,110,10],[105,9,105,10],[109,9,109,10],[111,11,111,13],[112,9,112,10],[115,11,115,13],[116,9,116,10],[107,11,107,13],[120,3,120,4],[116,3,116,4],[122,7,122,8],[111,0,111,2],[125,0,125,2],[113,0,113,2],[115,0,115,2],[117,0,117,2],[114,5,114,6],[112,5,112,6],[83,11,83,13],[81,9,81,10],[83,9,83,10],[81,11,81,13],[82,9,82,10],[80,9,80,10],[75,9,75,10],[73,9,73,10],[54,7,54,8],[69,7,69,8],[69,9,69,10],[72,7,72,8],[70,7,70,8],[79,9,79,10],[26,7,26,8],[19,7,19,8],[52,11,52,13],[35,11,35,13],[23,9,23,10],[22,9,22,10],[53,9,53,10],[54,9,54,10],[63,7,63,8],[62,3,62,10],[21,9,21,10],[20,9,20,10],[20,3,20,4],[25,3,25,4],[26,5,26,6],[40,9,40,10],[21,5,21,6],[30,3,30,4],[27,3,27,4],[28,5,28,6],[26,3,26,4],[24,3,24,4],[21,3,21,4],[29,5,29,6],[13,11,13,13],[24,9,24,10],[63,9,63,10],[14,9,14,10],[17,9,17,10],[28,9,28,10],[19,5,19,6],[28,3,28,4],[29,3,29,4],[18,3,18,4],[23,5,23,6],[16,5,16,6],[15,5,15,6],[18,5,18,6],[19,3,19,4],[16,3,16,4],[17,3,17,4],[27,5,27,6],[23,7,23,8],[22,7,22,8],[21,7,21,8],[20,7,20,8],[20,5,20,6],[22,5,22,6],[30,5,30,6],[56,9,56,10],[66,9,66,10],[52,0,52,2],[62,0,62,2],[81,7,81,8],[79,7,79,8],[79,5,79,6],[79,3,79,4],[46,9,46,10],[77,0,77,2],[64,3,64,4],[65,3,65,4],[69,3,69,4],[58,5,58,6],[59,5,59,6],[59,3,59,4],[63,3,63,4],[61,7,61,8],[66,0,66,2],[70,3,70,4],[73,7,73,8],[67,7,67,8],[72,5,72,6],[55,3,55,4],[56,7,56,8],[57,3,57,4],[35,0,35,2],[77,11,77,13],[74,11,74,13],[67,9,67,10],[76,9,76,10],[61,9,61,10],[58,9,58,10],[57,9,57,10],[63,12,63,13],[64,12,64,13],[65,12,65,13],[68,11,68,13],[71,11,71,13],[62,11,62,13],[53,7,53,8],[49,7,49,8],[57,5,57,6],[55,9,55,10],[60,9,60,10],[59,9,59,10],[71,0,71,2],[12,3,12,4],[13,9,13,10],[11,7,11,8],[11,5,11,6],[12,5,12,6],[14,3,14,4],[17,5,17,6],[6,9,6,10],[11,9,11,10],[10,5,10,6],[10,7,10,8],[14,5,14,6],[14,7,14,8],[12,7,12,8],[15,3,15,4],[12,9,12,10],[15,7,15,8],[11,3,11,4],[9,9,9,10]]}
["COTAÇÕES DE INSUMOS"]
[]
["*Na célula comentário com o nome do fornecedor, e-mail e data da cotação.",{"$nulls":9},"Data Cotações:",null,null,"Junho / 2021"]
[]
[]
["Código","Insumo","un","Fornecedor 1","Fone","Fornecedor 2","Fone","Fornecedor 3","Fone","Reserva",null,"Observações","Média","Mediana"]
[null,null,null,"Mondai Madeiras","3587-1643","Cunha Madeiras","3364-2778","Madereira Guarujá","3246-5955"]
[27,"Sarrafo cedrinho 2,5 x 2,5 cm","m",4,null,4.9000000000000004,null,4.5999999999999996,{"$nulls":4},{"$f":"TRUNC((AVERAGE(D8,F8,H8)),2)","v":4.5},{"$f":"TRUNC((MEDIAN(D8:I8)),2)","v":4.5999999999999996}]
[{"$f":"+A8+1","v":28},"Sarrafo cedrinho 2,5 x 5,0 cm","m",7.5,null,8.1,null,6.2,{"$nulls":4},{"$f":"TRUNC((AVERAGE(D9,F9,H9)),2)","v":7.26},{"$f":"TRUNC((MEDIAN(D9:I9)),2)","v":7.5}]
[null,null,null,"Mondai Madeiras","3587-1643","Cunha Madeiras","3364-2778","Schreiner Madeiras","41-3543-1316"]
[{"$f":"+A9+1","v":29},"CAIBRO CEDRINHO 5 x 7 cm","m",20,null,24.4,null,41.25,{"$nulls":4},{"$f":"TRUNC((AVERAGE(D11,F11)),2)","v":22.2},{"$f":"TRUNC((MEDIAN(D11:I11)),2)","v":24.4}]
[20,"Guia cedrinho 2,5 x 10 cm","m",12.5,null,16.3,null,14.37,{"$nulls":4},{"$f":"TRUNC((AVERAGE(D12,F12,H12)),2)","v":14.39},{"$f":"TRUNC((MEDIAN(D12:I12)),2)","v":14.37}]
[22,"Guia cedrinho 2,5 x 20 cm","m",25,null,32.5,null,28.75,{"$nulls":4},{"$f":"TRUNC((AVERAGE(D13,F13,H13)),2)","v":28.75},{"$f":"TRUNC((MEDIAN(D13:I13)),2)","v":28.75}]
[null,null,null,"Mad. Guarujá","(51) 3246-5944","Cunha Madeiras","3364-2778","Schreiner Madeiras","(47) 991164445"]
[25,"Tábua itaúba lixada e aplainada 2,5x20x5,50","pç",245,null,343.8,null,246.4,null,null,null,"Bitolas das tábuas brutas:",{"$f":"TRUNC((AVERAGE(D15,F15,H15)),2)","v":278.39999999999998},{"$f":"TRUNC((MEDIAN(D15:I15)),2)","v":246.4}]
[26,"Tábua itaúba lixada e aplainada 3x22x3,00","pç",267,null,375,null,264,null,null,null,"Esp.: 2,5 , 4 , 5 , 8 , 10 , 15 cm",{"$f":"TRUNC((AVERAGE(D16,F16,H16)),2)","v":302},{"$f":"TRUNC((MEDIAN(D16:I16)),2)","v":267}]
[{"$f":"+A16+1","v":27},"Tábua itaúba lixada e aplainada 3x22x4,00","pç",356,null,500,null,352,null,null,null,"Larg.: 5, 7, 10, 15, 20, 25, 30 cm",{"$f":"TRUNC((AVERAGE(D17,F17,H17)),2)","v":402.66},{"$f":"TRUNC((MEDIAN(D17:I17)),2)","v":356}]
[28,"Tábua itaúba lixada e aplainada 3x22x4,50","pç",401,null,562.5,null,396,null,null,null,"Comp.: 1, 1,5 , 2, 2,5 , 3, 3,5 , 4, 4,5 , 5, 5,5 m",453.16,401]
[29,"Tábua itaúba lixada e aplainada 3x30x3,00","pç",321,null,450,null,325.60000000000002,{"$nulls":4},365.53,{"$f":"TRUNC((MEDIAN(D19:I19)),2)","v":325.60000000000002}]
[30,"Tábua itaúba lixada e aplainada 3,5x15x5,50","pç",295,null,412.5,null,290.39999999999998,{"$nulls":4},332.63,295]
[31,"Tábua itaúba lixada e aplainada 3,5x25x2,00","pç",223,null,250,null,176,null,null,null," ",216.33,223]
[32,"Tábua itaúba lixada e aplainada 4x10x4,00","pç",142.55000000000001,null,200,null,140.80000000000001,{"$nulls":4},161.11000000000001,142.55000000000001]
[33,"Tábua itaúba lixada e aplainada 4x10x5,50","pç",196,null,275,null,193.6,{"$nulls":4},221.53,196]
[34,"Tábua itaúba lixada e aplainada 4x30x3,00","pç",321,null,450,null,325.60000000000002,{"$nulls":4},365.53,325.60000000000002]
[35,"Tábua itaúba lixada e aplainada 4x30x4,00","pç",430,null,600,null,431.2,{"$nulls":4},487.06,431.2]
[36,"Tábua itaúba lixada e aplainada 4x30x4,50","pç",485,null,675,null,484,{"$nulls":4},548,485]
[{"$f":"+A26+1","v":37},"Sarrafo itaúba 2,5x5","m",13.3,null,15,null,11,{"$nulls":4},13.1,13.3]
[38,"Caibro itaúba 5x5","m",26.7,null,24,null,26.4,{"$nulls":4},25.7,26.4]
[39,"Caibro itaúba 5x7","m",33.5,null,36,null,35.200000000000003,{"$nulls":4},34.9,35.200000000000003]
[40,"Caibro itaúba 5x10","m",45,null,48,null,44,{"$nulls":4},45.66,45]
[41,"Tábua itaúba 4x15","m",55,null,72,null,52.8,{"$nulls":4},59.93,55]
[42,"Tábua itaúba 4x25","m",112,null,120,null,88,{"$nulls":4},106.66,112]
[43,"Tábua itaúba 4x30","m",107,null,144,null,105.6,{"$nulls":4},118.86,107]
[44,"Tábua itaúba lixada e aplainada 3,5x19x1,80","pç",130.5,null,200,null,140.80000000000001,{"$nulls":4},157.1,140.80000000000001]
[45,"Tábua itaúba lixada e aplainada 3,5x19x2,00","pç",145,null,200,null,140.80000000000001,{"$nulls":4},161.93,145]
[null,null,null,"Delei Madeiras","3395-1868","Madelei","3373-8888","Cofel","3222-2255"]
[{"$f":"+A35+1","v":46},"Laminado melamínico texturizado chapa 1,25 x 3,08 m esp=0,8 mm","m²",25.71,null,32.25,null,40.26,null,null,null,"Dividir o valor pela área da chapa (3,85 m²)",{"$f":"TRUNC((AVERAGE(D37,F37,H37)),2)","v":32.74},{"$f":"TRUNC((MEDIAN(D37:K37)),2)","v":32.25}]
[null,null,null,"Mariani","3403-2222","Flosul","51 3681-0100","MSA","3556-3711"]
[{"$f":"+A37+1","v":47},"Tora eucalipto tratada d=20 cm","m",57,null,28.41,null,30.1,null,null,null,"Total=frete/m+tora  (frete/ 99 m (cancha de bocha))",{"$f":"TRUNC((AVERAGE(F39,H39)),2)","v":29.25},{"$f":"TRUNC((MEDIAN(D39:K39)),2)","v":30.1}]
[null,null,null,"SL Parafusos Ltda","3411-9800","Guido A. Jacobus","3024-1200","Central de Parafusos","3341-9353","Brasil dos Parafusos","3326-1946"]
[{"$f":"+A39+1","v":48},"Parafuso aço inox 1/4\" x 3\" c/porca","un",{"$f":"1.71","v":1.71},null,3.18,null,0.85,null,2.4,null,"Acrescentar o valor da porca quando vier separado (R$ ___)",{"$f":"TRUNC((AVERAGE(D41,F41,H41,J41)),2)","v":2.0299999999999998},{"$f":"TRUNC((MEDIAN(D41:K41)),2)","v":2.0499999999999998}]
[49,"Parafuso francês zincado 5/16\" x 2\" c/porca","un",1.2,null,0.38,null,1,null,1.0900000000000001,null,null,{"$f":"TRUNC((AVERAGE(D42,F42,H42,J42)),2)","v":0.91},{"$f":"TRUNC((MEDIAN(D42:K42)),2)","v":1.04}]
[50,"Parafuso francês zincado 5/16\" x 2 1/2\" c/ porca","un",1.39,null,0.44,null,1.17,null,1.24,null,null,{"$f":"TRUNC((AVERAGE(D43,F43,H43,J43)),2)","v":1.06},{"$f":"TRUNC((MEDIAN(D43:K43)),4)","v":1.2050000000000001}]
[51,"Parafuso francês zincado 5/16\" x 4\" c/ porca","un",1.91,null,0.61,null,1.65,null,1.72,null,null,1.47,1.68]
[52,"Parafuso francês zincado 5/16\" x 5\" c/porca","un",2.25,null,0.71,null,2,null,2.0099999999999998,null,null,1.74,2]
[53,"Parafuso inox auto atarraxante 4,8 x 70 cabeça chata","un",0.88,null,0.62,null,1.88,null,1.1399999999999999,null,null,1.1299999999999999,1.01]
[54,"Parafuso inox auto atarraxante 4,8 x 100 cabeça chata","un",2.3199999999999998,null,"-",null,"-",null,2.73,null,null,{"$f":"TRUNC((AVERAGE(D47,F47,H47,J47)),2)","v":2.52},2.52]
[55,"Parafuso sextavado aço zincado 1/2\" x 1 1/2\"","un",{"$f":"1.96","v":1.96},null,0.7,null,2.2000000000000002,null,1.97,null,null,1.7,1.96]
[56,"Parafuso sextavado aço zincado 1/2\" x 3 1/2\"","un",4.4800000000000004,null,1.46,null,4,null,3.6,null,null,3.38,3.8]
[57,"Parafuso sextavado aço zincado 1/2\" x 8\"","un",10.66,null,3.33,null,"-",null,9.8800000000000008,null,null,7.95,9.8800000000000008]
[58,"Parafuso sextavado aço zincado 1/4\" x 2\" c/ porca","un",{"$f":"0.52+32.65/100","v":0.84650000000000003},null,0.24,null,0.6,null,0.68,null,"Acrescentar o valor da porca quando vier separado (R$ ___)",0.59,{"$f":"TRUNC((MEDIAN(D51:K51)),4)","v":0.64}]
[59,"Parafuso sextavado rosca soberba 1/4\" x 30 mm","un",0.42,null,0.13,null,0.4,null,0.38,null,null,0.33,0.39]
[null,null,null,"Gerdau","3373-2500","Arcelor Mittal","2121-7777","Sidersul","3041-6565"]
[{"$f":"+A52+1","v":60},"Barra ferro chato 7/8\" x 1/8\"","kg",4.63,null,4.1399999999999997,null,4.96,{"$nulls":4},{"$f":"TRUNC((AVERAGE(D54,F54,H54)),2)","v":4.57},{"$f":"TRUNC((MEDIAN(D54:I54)),2)","v":4.63}]
[61,"Barra ferro chato 7/8\" x 1/4\"","kg",4.67,null,4.3499999999999996,null,4.96,{"$nulls":4},4.66,4.67]
[62,"Barra ferro chato 1 1/4\" x 1/4\"","kg",4.67,null,4.1399999999999997,null,4.96,{"$nulls":4},4.59,4.67]
[63,"Barra ferro chato 2\" x 1/8\"","kg",5.21,null,4.83,null,4.96,{"$nulls":4},5,4.96]
[64,"Chapa aço 1/2\"","kg",4.1399999999999997,null,5.08,null,4.95,{"$nulls":4},4.72,4.95]
[65,"Chapa aço 1/4\"","kg",4.1399999999999997,null,5.08,null,4.95,{"$nulls":4},4.72,4.95]
[66,"Chapa aço 3/16\"","kg",4.1399999999999997,null,5.08,null,4.95,{"$nulls":4},4.72,4.95]
[null,null,null,"Redinox","3020-0707","Steel Sul","3059-8744","Galeazi","4042-8322"]
[{"$f":"+A60+1","v":67},"Chapa aço inox e=1,00 mm (AISI 304)","m²",156,null,164.5,null,199.62,{"$nulls":4},{"$f":"TRUNC((AVERAGE(D62,F62,H62)),2)","v":173.37},{"$f":"TRUNC((MEDIAN(D62:K62)),2)","v":164.5}]
[null,null,null,"Chapas aço + galvanização"]
[{"$f":"+A62+1","v":68},"Chapa galvanizada 1/2\"","kg",{"$nulls":8},"Insumo 71 + galvanização/kg (R$ 2,30)",{"$f":"TRUNC(IF(Cotações!M58<Cotações!N58,Cotações!M58,Cotações!N58)+((IF(Cotações!$M$68<Cotações!$N$68,Cotações!$M$68,Cotações!$N$68))),2)","v":7.12}]
[{"$f":"+A64+1","v":69},"Chapa galvanizada 1/4\"","kg",{"$nulls":8},"Insumo 72 + galvanização/kg (R$ 2,30)",{"$f":"TRUNC(IF(Cotações!M59<Cotações!N59,Cotações!M59,Cotações!N59)+((IF(Cotações!$M$68<Cotações!$N$68,Cotações!$M$68,Cotações!$N$68))),2)","v":7.12}]
[{"$f":"+A65+1","v":70},"Chapa galvanizada 3/16\"","kg",{"$nulls":8},"Insumo 73 + galvanização/kg (R$ 2,30)",{"$f":"TRUNC(IF(Cotações!M60<Cotações!N60,Cotações!M60,Cotações!N60)+((IF(Cotações!$M$68<Cotações!$N$68,Cotações!$M$68,Cotações!$N$68))),2)","v":7.12}]
[null,null,null,"Beretta","3479-2222","ATN","3470-0000","Bento Sul","54 3453-5053"]
[{"$f":"+A66+1","v":71},"Processo de Galvanização","kg",2.5,null,2.5,null,2.2000000000000002,null,null,null,"preço por kg de chapa + 10% relativo ao peso total após galvanização",{"$f":"TRUNC((AVERAGE(D68,F68,H68)),2)","v":2.4},{"$f":"TRUNC((MEDIAN(D68:K68)),2)","v":2.5}]
[null,null,null,"Sulfer","3470-4004","Scharlau","3091-1525","Global Aço","3470-3522","Imp. Americana","3337-4611"]
[{"$f":"+A68+1","v":72},"Cumeeira galvalume ondulada 0,50 mm","un",28.6,null,29.34,null,30,null,23.6,null,"Cumeeira com 1 m de comprimento",{"$f":"TRUNC((AVERAGE(D70,F70,H70,J70)),2)","v":27.88},{"$f":"TRUNC((MEDIAN(D70:K70)),2)","v":28.97}]
[73,"Telha galvalume ondulada 0,50 mm x 1,03 m x 1 m","m",34.9,null,26.3,null,30,null,23.6,null,null,{"$f":"TRUNC((AVERAGE(D71,F71,H71,J71)),2)","v":28.7},{"$f":"TRUNC((MEDIAN(D71:K71)),2)","v":28.15}]
[null,null,null,"Sulfer","3470-4004","Aço Tubo","2126-9400","Açoduto","3058-5353","Ipiranga","3303-2100"]
[{"$f":"+A71+1","v":74},"Tubo aço carbono 6\" e=6,35 mm (NBR 6591)","m","-",null,206.34,null,182.35,null,150.15,null,"tubo condutor",{"$f":"TRUNC((AVERAGE(F73,H73,J73)),2)","v":179.61},{"$f":"TRUNC((MEDIAN(D73:K73)),2)","v":182.35}]
[75,"Tubo ferro preto quadrado 7x7 cm esp=3,00 mm","m",73.709999999999994,null,"-",null,56,null,40.6,null,"tubo / 6,00 m",{"$f":"TRUNC((AVERAGE(D74,H74,J74)),2)","v":56.77},{"$f":"TRUNC((MEDIAN(D74:K74)),2)","v":56}]
[null,null,null,"FG","3358-1213",null,null,"CPM Representações",null,"RAV Correntes","54-3019-1436"]
[{"$f":"+A74+1","v":76},"Corrente aço galvanizado d=5 mm elo longo 22x45 mm","kg",23.6,null,null,null,22.23,null,23.43,null,"Na próxima atualização utilizar elo curto e=6 mm 22x40 mm",{"$f":"TRUNC((AVERAGE(D76,H76,J76)),2)","v":23.08},{"$f":"TRUNC((MEDIAN(D76:K76)),2)","v":23.43}]
[77,"Disco de Corte MR832 - 7\" - Norton uso geral","un",22.9,null,26.34,null,16.5,{"$nulls":4},{"$f":"TRUNC((AVERAGE(D77,F77)),2)","v":24.62},{"$f":"TRUNC((MEDIAN(D77:K77)),2)","v":22.9}]
[null,null,null,"Telas Caxias","3364-1688","Rio Branco","3466-8095","Renovar","3342-7711","Sul Tela","3372-1475"]
[{"$f":"+A77+1","v":78},"Esticador de arame","un",5,null,"-",null,5,null,7,null,null,{"$f":"TRUNC((AVERAGE(D79,F79,H79,J79)),2)","v":5.66},{"$f":"TRUNC((MEDIAN(D79:K79)),2)","v":5}]
[{"$f":"+A79+1","v":79},"Tela arame galvanizado 5x5 cm fio 12 BWG","m²",22,null,21,null,26.5,null,28.6,null,null,{"$f":"TRUNC((AVERAGE(D80,F80,H80,J80)),2)","v":24.52},{"$f":"TRUNC((MEDIAN(D80:K80)),2)","v":24.25}]
[{"$f":"+A80+1","v":80},"Tela arame galvanizado 4x4 cm fio 10 BWG","m²",33,null,49,null,63,null,"-",null,null,{"$f":"TRUNC((AVERAGE(D81,F81,H81)),2)","v":48.33},{"$f":"TRUNC((MEDIAN(D81:K81)),2)","v":49}]
[null,null,null,"Fundição Silva Três Rios","(24) 2255-3130","Fundição Zenah","(54) 3228-5669"]
[{"$f":"+A81+1","v":81},"Fradinho em ferro fundido","un",314,null,600,{"$nulls":6},{"$f":"TRUNC((AVERAGE(D83)),2)","v":314},{"$f":"TRUNC((MEDIAN(D83:K83)),2)","v":457}]
[null,null,null,"Ziober","44 3029-4410","Milla Equip. Met.","19 3363-1051","Flex","17 3223-2766"]
[{"$f":"+A83+1","v":82},"Abdominal Simples","un",5610,null,4510,null,4690,null,null,null,"Galvanizados",{"$f":"TRUNC((AVERAGE(D85,F85:I85)),2)","v":4936.66},{"$f":"TRUNC((MEDIAN(D85:I85)),2)","v":4690}]
[{"$f":"+A85+1","v":83},"Adução e abdução de pernas duplo","un",11490,null,9150,null,6940,{"$nulls":4},{"$f":"TRUNC((AVERAGE(D86,F86:I86)),2)","v":9193.33},{"$f":"TRUNC((MEDIAN(D86:I86)),2)","v":9150}]
[84,"Esqui triplo conjugado","un",18000,null,21430,null,8990,{"$nulls":4},16140,18000]
[85,"Jogo de barras","un",9600,null,11778,null,6700,{"$nulls":4},9359.33,9600]
[86,"Multiexercitador conjugado 6 funções","un",22200,null,17184,null,9190,{"$nulls":4},16191.33,17184]
[87,"Peitoral duplo","un",14220,null,9790,null,7700,{"$nulls":4},10570,9790]
[88,"Placa orientativa (ATI)","un",8130,null,9966,null,4990,{"$nulls":4},7695.33,8130]
[89,"Pressão de pernas triplo conjugado","un",10860,null,10706,null,6850,{"$nulls":4},9472,10706]
[90,"Puxador duplo","un",14220,null,10428,null,7690,{"$nulls":4},10779.33,10428]
[91,"Remada (APC)","un",8340,null,5940,null,3890,{"$nulls":4},6056.66,5940]
[92,"Simulador de caminhada triplo conjugado","un",16740,null,15134,null,7800,{"$nulls":4},13224.66,15134]
[93,"Simulador de remo","un",6660,null,5240,null,5640,{"$nulls":4},5846.66,5640]
[{"$f":"+A96+1","v":94},"Voador peitoral e voador dorsal (APC)","un",13170,null,6200,null,3890,{"$nulls":4},7753.33,6200]
[null,null,null,"Shopping de Pedras","3249-1111","Eládio","3328-5858","São Cristóvão","54 3477-1305","Coloretti","54 3477-1369"]
[{"$f":"+A97+1","v":95},"Basalto Irregular","m²",60,null,50,null,97,null,60,null,null,{"$f":"TRUNC((AVERAGE(D99,F99,H99,J99)),2)","v":66.75},{"$f":"TRUNC((MEDIAN(D99:K99)),2)","v":60}]
[{"$f":"+A99+1","v":96},"Basalto Irregular meio retalhão","m²",110,null,150,null,107,null,120,null,null,{"$f":"TRUNC((AVERAGE(D100,F100,H100,J100)),2)","v":121.75},{"$f":"TRUNC((MEDIAN(D100:K100)),2)","v":115}]
[{"$f":"+A100+1","v":97},"Basalto Regular talhado",{"$f":"C100","v":"m²"},95,null,110,null,77,null,80,null,null,90.5,87.5]
[{"$f":"+A101+1","v":98},"Basalto Regular serrado ","m²",110,null,120,null,163,null,98,null,null,122.75,115]
[null,null,null,"DPS","3499-1536","Incorevest","3062-5119",null,null,"RF Rede Pallet","3059-7270"]
[{"$f":"+A102+1","v":99},"Lajota de concreto 45x45cm esp.=2,5cm","m²",32.9,null,52,null,null,null,25.9,null,null,{"$f":"TRUNC((AVERAGE(D104,F104,J104)),2)","v":36.93},{"$f":"TRUNC((MEDIAN(D104:K104)),2)","v":32.9}]
[{"$f":"+A104+1","v":100},"Piso Podotátil 25 x 25 cm","un",3.5,null,3.5,null,null,null,4.2,null,null,{"$f":"TRUNC((AVERAGE(D105,F105,J105)),2)","v":3.73},{"$f":"TRUNC((MEDIAN(D105:K105)),2)","v":3.5}]
[null,null,null,"Simil - Maquitel","3403-3232"]
[{"$f":"+A105+1","v":101},"Saibro rosa - posto obra","m³",59,{"$nulls":7},"Fazer média dos fretes (Centro, Ipanema, Sarandi)",{"$f":"TRUNC((AVERAGE(D107)),2)","v":59},59]
[null,null,null,"Rossatto","3250-5076","Jardins da Aldeia","3488-6251","Gramados Vargas","3367-2625","Canoas Garden","3472-4931"]
[{"$f":"+A107+1","v":102},"Composto Orgânico","m³",180,null,130,null,120,null,160,null,null,{"$f":"TRUNC((AVERAGE(D109,F109,H109,J109)),2)","v":147.5},145]
[{"$f":"+A109+1","v":103},"Grama catarina (Axonopus compressus)","m²",9.5,null,12,null,8,null,12,null,null,{"$f":"TRUNC((AVERAGE(D110,F110,H110,J110)),2)","v":10.37},10.75]
[{"$f":"+A110+1","v":104},"Grama de campo ( 1ª qualidade)",{"$f":"C110","v":"m²"},"-",null,6,null,6,null,6.5,null,null,{"$f":"TRUNC((AVERAGE(F111,H111,J111)),2)","v":6.16},6]
[null,null,null,"Sulcopy","2103-4660","Impacto","3334-9900","Sul10","4061-1001","Pino","3012-9090"]
[{"$f":"+A111+1","v":105},"Placa em lona impressa c/ 6 m²","m²",80,null,50,null,70,null,51.75,null,"Solicitar valor de placa com 6,00 m/2 (Dividir valor por 6)",{"$f":"TRUNC((AVERAGE(D113,F113,H113,J113)),2)","v":62.93},60.87]
[null,null,null,"Construtec","3012-2333","Reis e Reis","12 3966-9977","TecMachine","11 4643-4846"]
[{"$f":"+A113+1","v":106},"Microfibra de polipropileno (sc 600 g)","sc",33,null,21.65,null,23.2,null,null,null,"Saco de 600 g (600 g/m³ de concreto)",{"$f":"TRUNC((AVERAGE(D115,F115,H115)),2)","v":25.95},23.2]
[null,null,null,"Mineração Peixoto","51 3678-1020","Grani Torre","11 2246-1250","Polipiso","99116-4697"]
[{"$f":"+A115+1","v":107},"Argamassa de alta resistência (Piso duro)","kg",0.74,null,0.65,null,0.77,null,null,null,"Frete para 1800,00 kg",{"$f":"TRUNC((AVERAGE(D117,F117,H117)),2)","v":0.72},0.74]
[null,null,null,"Constinta","3341-6344",null,null,"Porto Cores","3346-3339","Aquarela Tintas","3223-0133"]
[{"$f":"+A117+1","v":108},"Fundo p/ galvanizado","l",35.270000000000003,null,null,null,37.22,null,31.94,null,null,{"$f":"TRUNC((AVERAGE(D119,H119,J119)),2)","v":34.81},{"$f":"TRUNC((MEDIAN(D119,H119,J119)),2)","v":35.270000000000003}]
[null,null,null,"Drenamac","3029-7593","Drenotec","3119-1244","Geofoco","0800-378-8500"]
[{"$f":"+A119+1","v":109},"Manta Geotêxtil para cura do concreto","m²",2.2000000000000002,null,2.5,null,2.1,null,null,null,"Bidim CC-10",{"$f":"TRUNC((AVERAGE(D121,F121,H121)),2)","v":2.2599999999999998},{"$f":"TRUNC((MEDIAN(D121:K121)),2)","v":2.2000000000000002}]
[null,null,null,"Prod Equipam. MB","3377-2035"]
[{"$f":"+A121+1","v":110},"Papeleira metálica basculante H-30","un",900,{"$nulls":8},{"$f":"TRUNC((AVERAGE(D123)),2)","v":900},900]
[null,null,null,"Elevato","3349-0200","SIA","3375-3800","Mil Torneiras","3371-3200"]
[{"$f":"+A123+1","v":111},"Válvula de mictório anti-vandalismo alta pressão Docol","un",557.80999999999995,null,362.1,null,413.9,{"$nulls":4},{"$f":"TRUNC((AVERAGE(D125,F125,H125)),2)","v":444.6},413.9]
[null,null,null,"Lourenço Mármores","3217-1323","De Grandi","3307-7724","Bello","3217-5900","Belotto","3541-5521"]
[{"$f":"+A125+1","v":112},"Placa de granito","un",550,null,650,null,840,null,750,null,null,{"$f":"TRUNC((AVERAGE(D127,F127,H127,J127)),2)","v":697.5},700]
[null,null,null,"Gaúcha","3245-3500","Pouco Entulho","51 99859-2250","Tirentulho","3475-2222"]
[{"$f":"+A127+1","v":113},"Caçamba 4,00 m3","un",480,null,400,null,450,null,null,null,"Média Centro com Zona Sul               caliça e terra",{"$f":"TRUNC((AVERAGE(D129,F129,H129)),2)","v":443.33},450]
[null,null,null,"Transguga","3337-6060","Britas do Sul","3245-2093","Areia Norte","3340-9032","Balinha","3434-0059"]
[{"$f":"+A129+1","v":114},"Areia Peneirada - posto obra","m³",65,null,90,null,65,null,70,null,null,{"$f":"TRUNC((AVERAGE(D131,F131,H131,J131)),2)","v":72.5},{"$f":"TRUNC((MEDIAN(D131:K131)),2)","v":67.5}]
[{"$f":"+A131+1","v":115},"Brita 1 ou 2 - posto obra","m³",65,null,75,null,65,null,65,null,null,{"$f":"TRUNC((AVERAGE(D132,F132,H132,J132)),2)","v":67.5},65]
[null,null,null,"DMAE","3289-9537"]
[{"$f":"+A132+1","v":116},"Taxa instalação água DMAE","cj",465.36,{"$nulls":7},"Engª Ana",{"$f":"TRUNC((AVERAGE(D134)),2)","v":465.36},465.36]
[{"$f":"+A134+1","v":117},"Taxa instalação esgoto DMAE","cj",300.94,{"$nulls":8},{"$f":"TRUNC((AVERAGE(D135)),2)","v":300.94},300.94]
[{"$f":"+A135+1","v":118},"Água tratada","m³",4.0199999999999996,{"$nulls":8},{"$f":"TRUNC((AVERAGE(D136)),2)","v":4.0199999999999996},4.0199999999999996]
[{"$f":"+A136+1","v":119},"Esgoto cloacal","m³",{"$f":"0.8*D136","v":3.2159999999999997},{"$nulls":8},{"$f":"TRUNC((AVERAGE(D137)),2)","v":3.21},3.21]
[null,null,null,"Rodrigo Paz","3318-1010","Alicerce da Const","3318-1010","Maico Pedras","99817-3559"]
[122,"Laje de Grês 90x45","un",8,null,14.9,null,6,{"$nulls":4},{"$f":"TRUNC((AVERAGE(D139,F139,H139)),2)","v":9.6300000000000008},{"$f":"TRUNC((MEDIAN(D139:I139)),2)","v":8}]
[{"$f":"+A139+1","v":123},"Pedra de Grês 43x21x12","un",1.9,null,2.2000000000000002,null,2.2799999999999998,null,2,null,null,{"$f":"TRUNC((AVERAGE(D140,F140,H140,J140)),2)","v":2.09},{"$f":"TRUNC((MEDIAN(D140:K140)),2)","v":2.1}]
[null,null,null,"Ponte Pedras","11 4485-3034","Balinha","3434-0059"]
[{"$f":"+A140+1","v":124},"Pedra de Alicerce","un",6,null,4.5,{"$nulls":6},{"$f":"TRUNC((AVERAGE(D142,F142)),2)","v":5.25},{"$f":"TRUNC((MEDIAN(D142:G142)),2)","v":5.25}]
[null,null,null,"Supreme","3012-9962","Via Inox","3275-1111","Magazine do Inox","3060-2074","Stilo Elevato","3333-8200"]
[{"$f":"+A142+1","v":125},"Cuba Inox polida d=38 cm c/válvula 3 1/2\"","un",249,null,169.9,null,150.19999999999999,null,301.02999999999997,null,null,{"$f":"TRUNC((AVERAGE(D144,F144,H144)),2)","v":189.7},{"$f":"TRUNC((MEDIAN(D144:K144)),2)","v":209.45}]
[null,null,null,"RZ","3212-7911","Copyserv","3212-1612","DWG","3022-7978","MI Digital","3574-8012"]
[{"$f":"+A144+1","v":126},"Plotagem","m²",11.89,null,12,null,10.7,null,10.58,null,"PB, Papel sulfite, gramatura",{"$f":"TRUNC((AVERAGE(D146,F146,H146,J146)),2)","v":11.29},{"$f":"TRUNC((MEDIAN(D146:K146)),2)","v":11.29}]
[null,null,null,"Sinduscon","Site"]
[{"$f":"+A146+1","v":127},"CUB-RS R 16-N","un",1477.13,{"$nulls":8},{"$f":"TRUNC((AVERAGE(D148)),2)","v":1477.13},{"$f":"TRUNC((MEDIAN(D148:K148)),2)","v":1477.13}]
[null,null,null,"CREA-RS","Site"]
[{"$f":"+A148+1","v":128},"ART","un",226.5,{"$nulls":8},{"$f":"TRUNC((AVERAGE(D150)),2)","v":226.5},{"$f":"TRUNC((MEDIAN(D150:K150)),2)","v":226.5}]
[null,null,null,"PMPA","Site"]
[{"$f":"+A150+1","v":129},"UFM","un",4.1771000000000003,{"$nulls":8},{"$f":"TRUNC((AVERAGE(D152)),2)","v":4.17},{"$f":"TRUNC((MEDIAN(D152:K152)),2)","v":4.17}]
[null,null,null,"Casa do Granito","3233-0052","La Pietra","3334-6544","Bonapedras","3012-4393","AGPetrea","3126-3792"]
[{"$f":"+A152+1","v":130},"Tabuleiro damas","un",1500,null,320,null,1601.8,null,400,null,null,{"$f":"TRUNC((AVERAGE(D154,F154,H154,J154)),2)","v":955.45},{"$f":"TRUNC((MEDIAN(D154:K154)),2)","v":950}]

{"sheet":"BDI","index":9,"n_rows":40,"n_cols":6,"rows_kept":40,"cut":false,"hidden":false,"merged":[[46,0,46,3],[37,0,37,5],[0,0,0,5],[2,0,2,5],[8,3,8,5],[7,1,7,5],[6,1,6,5],[5,1,5,5],[4,1,4,5],[1,0,1,3],[3,0,3,3],[10,3,10,5],[20,3,20,5],[19,3,19,5],[18,3,18,5],[17,3,17,5],[26,0,26,3],[22,3,22,5],[21,3,21,5],[24,0,24,5],[16,0,16,2],[23,0,23,3],[22,0,22,2],[17,0,17,2],[18,0,18,2],[19,0,19,2],[21,0,21,2],[25,0,25,3],[20,0,20,2],[16,3,16,5],[10,0,10,2],[11,0,11,2],[9,0,9,3],[15,0,15,2],[8,0,8,2],[12,0,12,2],[13,0,13,2],[14,0,14,2],[11,3,11,5],[15,3,15,5],[14,3,14,5],[13,3,13,5],[12,3,12,5],[30,0,30,3],[29,0,29,3],[28,0,28,3],[27,0,27,3],[41,0,41,3],[42,0,42,3],[40,0,40,3],[39,0,39,5],[31,0,35,5],[36,0,36,3],[38,3,38,4]]}
["Composição do BDI"]
[]
["*Conforme Decreto nº 19.224, de 25 de novembro de 2015 (PMPA)"]
[]
["TOMADOR:","PREFEITURA MUNICIPAL DE PORTO ALEGRE"]
["OBJETO:",{"$f":"+PO!B9","v":"Obras de Aquisição e Instalação de Academias de Ginástica ao ar livre na Praça Grêmio Futebol Portoalegrense (110/03), Praça Guia Lopes (118/08) e Praça Simões Lopes Neto (125/06)"}]
["DATA:",{"$f":"IF(PO!$B$10=\"\",\"\",PO!$B$10)","v":"2021-09-14"},{"$f":"IF(PO!$C$10=\"\",\"\",PO!$C$10)","v":""},{"$f":"IF(PO!$C$10=\"\",\"\",PO!$C$10)","v":""},{"$f":"IF(PO!$C$10=\"\",\"\",PO!$C$10)","v":""},{"$f":"IF(PO!$C$10=\"\",\"\",PO!$C$10)","v":""}]
["ART:",{"$f":"IF(PO!$B$11=\"\",\"\",PO!$B$11)","v":""}]
["CONTRIBUIÇÃO PREVIDENCIÁRIA:",null,null,{"$f":"IF(Planilha_M.O.!$D$5=\"c/desoneração\",\"Orçamento COM DESONERAÇÃO (Lei 13.161/2015)\",\"Orçamento SEM DESONERAÇÃO (Lei 13.161/2015)\")","v":"Orçamento SEM DESONERAÇÃO (Lei 13.161/2015)"}]
[]
["TIPO DE OBRA",null,null,"Contratação de obras e serviços de INFRAESTRUTURA, incluindo pavimentação, iluminação pública, praças, saneamento, sistemas de água, esgoto cloacal e pluvial e seus respectivos serviços de conservação e manutenção"]
["Parcelas"]
["(AC) - Administração Central",null,null,4.03]
["(S) + (G) - Seguro e Garantia",null,null,0.65]
["(R) - Risco",null,null,1.33]
["(DF) - Despesas Financeiras",null,null,1.52]
["(L) - Lucro",null,null,8]
["(I1) - PIS",null,null,0.65]
["(I2) - COFINS",null,null,3]
["(I3) - ISSQN",null,null,1.2]
["(I4) - Contrib. Previdenciária",null,null,4.5]
["BDI Calculado, incluindo I4 - com desoneração",null,null,0.28210000000000002]
["BDI Calculado, desconsiderando I4 - sem desoneração",null,null,0.2215]
[]
["Os valores de BDI foram calculados com o emprego da fórmula abaixo (Acórdão 2622/2013 - TCU):"]
[]
[]
[]
[]
[]
[]
["Declaro para os devidos fins que, conforme legislação tributária municipal, a base de cálculo para o ISS das atividades Pavimentação, Iluminação Pública, Praças, Saneamento, Sistemas de água, Esgoto Cloacal e Pluvial e seus respectivos serviços de conservação e manutenção é de 30%, com a respectiva alíquota de 4%."]
[]
[]
[]
[]
[]
["Declaro para os devidos fins que o detalhamento de encargos sociais atende ao estabelecido no SINAPI/RS de"]
[null,null,{"$f":"CONCATENATE(Planilha_M.O.!$E$17,\",\")","v":"JUNHO / 2021,"},"sendo utilizada a opção ",null,{"$f":"IF(Planilha_M.O.!$D$5=\"c/desoneração\",\"com desoneração,\",\"sem desoneração,\")","v":"sem desoneração,"}]
["e que esta é a alternativa mais adequada para a Administração Pública."]

{"sheet":"Quadro_Comparativo","index":10,"n_rows":17,"n_cols":2,"rows_kept":17,"cut":false,"hidden":false,"merged":[]}
[]
[]
[]
[]
[]
["Obras de Aquisição e Instalação de Academias de Ginástica ao ar livre na Praça Grêmio Futebol "]
["Portoalegrense (110/03), Praça Guia Lopes (118/08) e Praça Simões Lopes Neto (125/06)"]
[]
["QUADRO COMPARATIVO"]
[]
[null,"VALOR"]
["ORCAMENTO COM DESONERAÇÃO BDI 28,21%",382966.13]
[]
["ORCAMENTO SEM DESONERAÇÃO BDI 22,15%",{"$f":"PO!L156","v":376995.68}]
[]
["O ORÇAMENTO MAIS VANTAJOSO PARA O MUNICÍPIO PMPA FOI O SEM DESONERAÇÃO"]
["DA FOLHA DE PAGAMENTO."]

{"sheet":"Encargos Sociais","index":11,"n_rows":42,"n_cols":6,"rows_kept":42,"cut":false,"hidden":false,"merged":[[41,0,41,1],[0,0,0,5],[4,0,4,5],[5,2,5,3],[5,4,5,5],[5,0,6,0],[5,1,6,1],[1,0,1,5],[30,0,30,5],[18,0,18,5],[7,0,7,5],[3,0,3,5],[37,0,37,5],[2,3,2,4]]}
["Composição dos Encargos Sociais"]
[]
[null,null,null,"Mês de referência:",null,"JUNHO/21"]
[]
["ENCARGOS SOCIAIS SOBRE A MÃO-DE-OBRA"]
["Código","Descrição","Com Desoneração",null,"Sem Desoneração"]
[null,null,"Horista","Mensalista","Horista","Mensalista"]
["GRUPO A"]
["A1","INSS",0,0,0.2,0.2]
["A2","SESI",1.4999999999999999E-2,1.4999999999999999E-2,1.4999999999999999E-2,1.4999999999999999E-2]
["A3","SENAI",0.01,0.01,0.01,0.01]
["A4","INCRA",2E-3,2E-3,2E-3,2E-3]
["A5","SEBRAE",6.0000000000000001E-3,6.0000000000000001E-3,6.0000000000000001E-3,6.0000000000000001E-3]
["A6","Salário Educação",2.5000000000000001E-2,2.5000000000000001E-2,2.5000000000000001E-2,2.5000000000000001E-2]
["A7","Seguro Contra Acidentes de Trabalho",0.03,0.03,0.03,0.03]
["A8","FGTS",0.08,0.08,0.08,0.08]
["A9","SECONCI",0,0,0,0]
["A","Total",{"$f":"SUM(C9:C17)","v":0.16799999999999998},{"$f":"SUM(D9:D17)","v":0.16799999999999998},0.36800000000000005,0.36800000000000005]
["GRUPO B"]
["B1","Repouso Semanal Remunerado",0.17929999999999999,0,0.17929999999999999,0]
["B2","Feriados",4.24E-2,0,4.24E-2,0]
["B3","Auxílio - Enfermidade",1.2500000000000001E-2,9.1000000000000004E-3,1.2500000000000001E-2,9.1000000000000004E-3]
["B4","13º Salário",0.1077,8.3299999999999999E-2,0.1077,8.3299999999999999E-2]
["B5","Licença Paternidade",6.9999999999999999E-4,5.9999999999999995E-4,6.9999999999999999E-4,5.9999999999999995E-4]
["B6","Faltas Justificadas",7.1999999999999998E-3,5.5999999999999999E-3,7.1999999999999998E-3,5.5999999999999999E-3]
["B7","Dias de Chuvas",1.5299999999999999E-2,0,1.5299999999999999E-2,0]
["B8","Auxílio Acidente de Trabalho",1.1000000000000001E-3,8.9999999999999998E-4,1.1000000000000001E-3,8.9999999999999998E-4]
["B9","Férias Gozadas",7.3999999999999996E-2,5.7200000000000001E-2,7.3999999999999996E-2,5.7200000000000001E-2]
["B10","Salário Maternidade",2.9999999999999997E-4,2.9999999999999997E-4,2.9999999999999997E-4,2.9999999999999997E-4]
["B","Total",{"$f":"SUM(C20:C29)","v":0.44049999999999995},{"$f":"SUM(D20:D29)","v":0.157},0.44049999999999995,0.157]
["GRUPO C"]
["C1","Aviso Prévio Indenizado",4.2799999999999998E-2,3.32E-2,4.2799999999999998E-2,3.32E-2]
["C2","Aviso Prévio Trabalhado",1E-3,8.0000000000000004E-4,1E-3,8.0000000000000004E-4]
["C3","Férias Indenizadas",5.2900000000000003E-2,4.0899999999999999E-2,5.2900000000000003E-2,4.0899999999999999E-2]
["C4","Depósito Rescisão Sem Justa Causa",3.6299999999999999E-2,2.81E-2,3.6299999999999999E-2,2.81E-2]
["C5","Indenização Adicional",3.5999999999999999E-3,2.8E-3,3.5999999999999999E-3,2.8E-3]
["C","Total",{"$f":"SUM(C32:C36)","v":0.1366},{"$f":"SUM(D32:D36)","v":0.10579999999999999},0.1366,0.10579999999999999]
["GRUPO D"]
["D1","Reincidência de Grupo A sobre Grupo B",{"$f":"ROUND((C18*C30),4)","v":7.3999999999999996E-2},{"$f":"ROUND((D18*D30),4)","v":2.64E-2},0.16209999999999999,5.7799999999999997E-2]
["D2","Reincidência de Grupo A sobre Aviso Prévio Trabalhado e Reincidência do FGTS sobre Aviso Prévio Indenizado",{"$f":"ROUND(((C18*C33)+(C16*C32)),4)","v":3.5999999999999999E-3},{"$f":"ROUND(((D18*D33)+(D16*D32)),4)","v":2.8E-3},3.8E-3,3.0000000000000001E-3]
["D","Total",{"$f":"SUM(C39:C40)","v":7.7600000000000002E-2},{"$f":"SUM(D39:D40)","v":2.92E-2},0.16589999999999999,6.08E-2]
["TOTAL (A+B+C+D)",null,{"$f":"+C18+C30+C37+C41+0.0001","v":0.82279999999999986},{"$f":"+D18+D30+D37+D41","v":0.45999999999999996},1.111,0.69159999999999999]

{"sheet":"Curva ABC","index":12,"n_rows":95,"n_cols":6,"rows_kept":95,"cut":false,"hidden":false,"merged":[[9,5,10,5],[2,1,2,5],[0,0,0,5],[9,0,10,0],[9,1,10,1],[9,2,10,2],[9,3,10,3],[9,4,10,4]]}
["CURVA ABC"]
[]
["OBJETO:",{"$f":"+PO!$B$9","v":"Obras de Aquisição e Instalação de Academias de Ginástica ao ar livre na Praça Grêmio Futebol Portoalegrense (110/03), Praça Guia Lopes (118/08) e Praça Simões Lopes Neto (125/06)"}]
["DATA:",{"$f":"IF(PO!$B$10=\"\",\"\",PO!$B$10)","v":"2021-09-14"}]
["ART nº:",{"$f":"IF(PO!$B$11=\"\",\"\",PO!$B$11)","v":""}]
[null,null,null,"A=70% DO VALOR DO ORÇAMENTO"]
[null,null,null,"B=20% DO VALOR DO ORÇAMENTO"]
[null,null,null,"C=10% DO VALOR DO ORÇAMENTO"]
[]
["ITEM","DESCRIÇÃO DAS ATIVIDADES","VALOR DO SERVIÇO","%","% Acumulado","ABC"]
[]
[]
["3.1","ADMINISTRAÇÃO LOCAL",{"$f":"PO!L31","v":24761.29},{"$f":"C13/$C$95","v":6.5680566949732705E-2},{"$f":"E12+D13","v":6.5680566949732705E-2},{"$f":"IF(OR(E13<0.71,D13>0.71),\"A\",(IF(OR(E13<0.91,D13>0.21),\"B\",\"C\")))","v":"A"}]
["11.1","ADMINISTRAÇÃO LOCAL",{"$f":"PO!L80","v":24761.29},6.5680566949732705E-2,0.13136113389946541,{"$f":"IF(OR(E14<0.71,D14>0.71),\"A\",(IF(OR(E14<0.91,D14>0.21),\"B\",\"C\")))","v":"A"}]
["19.1","ADMINISTRAÇÃO LOCAL SIMÕES LOPES NETO",{"$f":"PO!L129","v":24617.4},6.5298891488623986E-2,0.19666002538808941,{"$f":"IF(OR(E15<0.71,D15>0.71),\"A\",(IF(OR(E15<0.91,D15>0.21),\"B\",\"C\")))","v":"A"}]
["15.3","ESQUI TRIPLO CONJUGADO - GALVANIZADO",{"$f":"PO!L97","v":18380.59},4.8755439319622992E-2,0.24541546470771242,"A"]
["7.2","SIMULADOR DE CAMINHADA TRIPLO CONJUGADO - GALVANIZADO",{"$f":"PO!L48","v":15065.84},3.9962898248595329E-2,0.28537836295630775,"A"]
["15.2","SIMULADOR DE CAMINHADA TRIPLO CONJUGADO - GALVANIZADO",{"$f":"PO!L96","v":15065.84},3.9962898248595329E-2,0.32534126120490309,"A"]
["23.2","SIMULADOR DE CAMINHADA TRIPLO CONJUGADO - GALVANIZADO",{"$f":"PO!L144","v":15065.84},3.9962898248595329E-2,0.36530415945349842,"A"]
["13.2","PISO CONCRETO ARMADO E= 10 cm - ACADEMIA AO AR LIVRE",{"$f":"PO!L88","v":12424.91},3.2957698613416485E-2,0.39826185806691489,"A"]
["5.2","PISO CONCRETO ARMADO E= 10 cm - ACADEMIA AO AR LIVRE",{"$f":"PO!L39","v":11712.69},3.1068499246463526E-2,0.42933035731337843,"A"]
["7.5","JOGO DE BARRAS",{"$f":"PO!L51","v":10945.66},2.9033913598161133E-2,0.45836427091153958,"A"]
["15.5","PRESSÃO DE PERNAS TRIPLO CONJUGADO - GALVANIZADO",{"$f":"PO!L99","v":10857.79},2.8800834004251732E-2,0.48716510491579129,"A"]
["7.4","ADUÇÃO E ABDUÇÃO DE PERNAS DUPLO - GALVANIZADO",{"$f":"PO!L50","v":10491.68},2.7829708817883547E-2,0.51499481373367484,"A"]
["15.4","ADUÇÃO E ABDUÇÃO DE PERNAS DUPLO - GALVANIZADO",{"$f":"PO!L98","v":10491.68},2.7829708817883547E-2,0.54282452255155844,"A"]
["23.3","ADUÇÃO E ABDUÇÃO DE PERNAS DUPLO - GALVANIZADO",{"$f":"PO!L145","v":10491.68},2.7829708817883547E-2,0.57065423136944204,"A"]
["7.1","PLACA ORIENTATIVA - GALVANIZADA",{"$f":"PO!L47","v":8910.19},2.3634727061063416E-2,0.59428895843050544,"A"]
["15.1","PLACA ORIENTATIVA - GALVANIZADA",{"$f":"PO!L95","v":8910.19},2.3634727061063416E-2,0.61792368549156884,"A"]
["23.1","PLACA ORIENTATIVA - GALVANIZADA",{"$f":"PO!L143","v":8910.19},2.3634727061063416E-2,0.64155841255263224,"A"]
["2.1","TAPUME EM CHAPA DE COMPENSADO RESINADO (L=10,00m; C=10,00m e H=2,20M)",{"$f":"PO!L20","v":7262.64},1.9264517832140685E-2,0.66082293038477291,"A"]
["10.1","TAPUME EM CHAPA DE COMPENSADO RESINADO (L=10,00m; C=10,00m e H=2,20M)",{"$f":"PO!L69","v":7262.64},1.9264517832140685E-2,0.68008744821691358,"A"]
["18.1","TAPUME EM CHAPA DE COMPENSADO RESINADO (L=10,00m; C=10,00m e H=2,20M)",{"$f":"PO!L118","v":7262.64},1.9264517832140685E-2,0.69935196604905425,"A"]
["7.9","VOADOR PEITORAL E VOADOR DORSAL - GALVANIZADO",{"$f":"PO!L55","v":7137.53},1.8932657265462571E-2,0.71828462331451681,"B"]
["15.8","VOADOR PEITORAL E VOADOR DORSAL - GALVANIZADO",{"$f":"PO!L102","v":7137.53},1.8932657265462571E-2,0.73721728057997937,"B"]
["7.8","REMADA ESPECIAL - GALVANIZADO",{"$f":"PO!L54","v":6776.86},1.7975961952667475E-2,0.75519324253264686,"B"]
["23.6","REMADA ESPECIAL PPNE - GALVANIZADA",{"$f":"PO!L148","v":6776.86},1.7975961952667475E-2,0.77316920448531434,"B"]
["7.6","SIMULADOR DE REMO  - GALVANIZADO",{"$f":"PO!L52","v":6442.09},1.7087967692361893E-2,0.79025717217767621,"B"]
["15.6","SIMULADOR DE REMO - GALVANIZADO",{"$f":"PO!L100","v":6442.09},1.7087967692361893E-2,0.80734513987003809,"B"]
["23.5","SIMULADOR DE REMO - GALVANIZADO",{"$f":"PO!L147","v":6442.09},1.7087967692361893E-2,0.82443310756239996,"B"]
["21.1","PISO CONCRETO ARMADO E= 10 cm - ACADEMIA AO AR LIVRE",{"$f":"PO!L135","v":5915.5},1.5691161235587638E-2,0.84012426879798763,"B"]
["9.2","REMOÇÃO DE ENTULHOS COM CAÇAMBA 4M³",{"$f":"PO!L66","v":5851.5},1.5521398017080731E-2,0.85564566681506837,"B"]
["6.1","BANCO B (C/ ENCOSTO) - L=2,00 m - PADRÃO SMAMS",{"$f":"PO!L43","v":3364.32},8.9240279888618389E-3,0.8645696948039302,"B"]
["2.4","INSTALAÇÃO PROVISÓRIA DE ENERGIA, AÉREA, BIFÁSICA, COM CAIXA DE EMBUTIR C/ POSTE H=9,00M",{"$f":"PO!L23","v":2979.99},7.9045733362249695E-3,0.87247426814015516,{"$f":"IF(OR(E43<0.71,D43>0.71),\"A\",(IF(OR(E43<0.91,D43>0.21),\"B\",\"C\")))","v":"B"}]
["10.4","INSTALAÇÃO PROVISÓRIA DE ENERGIA, AÉREA, BIFÁSICA, COM CAIXA DE EMBUTIR C/ POSTE H=9,00M",{"$f":"PO!L72","v":2979.99},7.9045733362249695E-3,0.88037884147638013,{"$f":"IF(OR(E44<0.71,D44>0.71),\"A\",(IF(OR(E44<0.91,D44>0.21),\"B\",\"C\")))","v":"B"}]
["18.4","INSTALAÇÃO PROVISÓRIA DE ENERGIA, AÉREA, BIFÁSICA, COM CAIXA DE EMBUTIR C/ POSTE H=9,00M",{"$f":"PO!L121","v":2979.99},{"$f":"C45/$C$95","v":7.9045733362249695E-3},{"$f":"E44+D45","v":0.88828341481260509},"B"]
["7.7","ESPALDAR - EQUIPAMENTO PADRÃO SMAMS",{"$f":"PO!L53","v":2735.72},7.2566348770893097E-3,0.89554004968969436,"B"]
["23.4","ESPALDAR - EQUIPAMENTO PADRÃO SMAMS",{"$f":"PO!L146","v":2735.72},7.2566348770893097E-3,0.90279668456678364,"B"]
["2.7","SINALIZAÇÃO COM TELA PLÁSTICA LARANJA FIXADA EM CONE PLÁSTICO",{"$f":"PO!L26","v":1848.42},4.903027005508394E-3,0.90769971157229201,"B"]
["15.7","PRANCHA DE ABDOMINAIS PADRÃO SMAMS ",{"$f":"PO!L101","v":1777.22},4.7141654249194592E-3,0.91241387699721144,"C"]
["10.7","SINALIZAÇÃO COM TELA PLÁSTICA LARANJA FIXADA EM CONE PLÁSTICO",{"$f":"PO!L75","v":1690.96},4.4853564369756191E-3,0.91689923343418711,"C"]
["14.1","BANCO B (C/ ENCOSTO) - L=2,00 m - PADRÃO SMAM",{"$f":"PO!L91","v":1682.16},4.4620139944309195E-3,0.92136124742861802,"C"]
["22.1","BANCO B (C/ ENCOSTO) - L=2,00 m - PADRÃO SMAM (NOVO)",{"$f":"PO!L138","v":1682.16},4.4620139944309195E-3,0.92582326142304894,"C"]
["8.1","PLANTIO DE GRAMA CATARINA (SÃO MARCOS) COM COMPOSTO ORGÂNICO",{"$f":"PO!L58","v":1651.91},4.3817743481835139E-3,0.93020503577123248,"C"]
["1.2","REMOÇÃO DE ENTULHOS COM CAÇAMBA 4M³",{"$f":"PO!L17","v":1564.5},4.149914927407127E-3,0.93435495069863961,"C"]
["6.2","LIXEIRA METÁLICA - V=30 LITROS",{"$f":"PO!L44","v":1251.74},3.3203032989661857E-3,0.93767525399760576,"C"]
["14.2","LIXEIRA METÁLICA - V=30 LITROS INSTALADA",{"$f":"PO!L92","v":1251.74},3.3203032989661857E-3,0.94099555729657192,"C"]
["22.3","LIXEIRA METÁLICA - V=30 LITROS INSTALADA",{"$f":"PO!L140","v":1251.74},3.3203032989661857E-3,0.94431586059553807,"C"]
["7.3","APOIO DE MEMBROS SUPERIORES - EQUIPAMENTO PADRÃO SMAMS",{"$f":"PO!L49","v":1095.3},2.9053383317283643E-3,0.94722119892726642,"C"]
["2.3","FRETE P/ BANHEIRO QUÍMICO LOCADO (IDA E VOLTA)",{"$f":"PO!L22","v":1085.48},2.8792902878887112E-3,0.95010048921515511,"C"]
["10.3","FRETE P/ BANHEIRO QUÍMICO LOCADO (IDA E VOLTA)",{"$f":"PO!L71","v":1085.48},2.8792902878887112E-3,0.9529797795030438,"C"]
["18.3","FRETE P/ BANHEIRO QUÍMICO LOCADO (IDA E VOLTA)",{"$f":"PO!L120","v":1085.48},2.8792902878887112E-3,0.95585906979093249,"C"]
["12.2","ATERRO MANUAL C/MATERIAL IMPORTADO C/COMPACTAÇÃO MANUAL",{"$f":"PO!L84","v":1032.67},2.739209107117621E-3,0.95859827889805016,"C"]
["4.2","ATERRO MANUAL C/MATERIAL IMPORTADO C/COMPACTAÇÃO MANUAL",{"$f":"PO!L35","v":973.66},2.582682114553674E-3,0.96118096101260386,"C"]
["2.6","PLACA DE OBRA EM CHAPA GALVANIZADA",{"$f":"PO!L25","v":925.52},2.45498834363301E-3,0.96363594935623686,"C"]
["10.6","PLACA DE OBRA EM CHAPA GALVANIZADA",{"$f":"PO!L74","v":925.52},2.45498834363301E-3,0.96609093769986987,"C"]
["18.6","PLACA DE OBRA EM CHAPA GALVANIZADA",{"$f":"PO!L123","v":925.52},2.45498834363301E-3,0.96854592604350287,"C"]
["2.5","INSTALAÇÃO PROVISÓRIA DE ÁGUA",{"$f":"PO!L24","v":897.15},2.3797354919292452E-3,0.97092566153543214,"C"]
["10.5","INSTALAÇÃO PROVISÓRIA DE ÁGUA",{"$f":"PO!L73","v":897.15},2.3797354919292452E-3,0.97330539702736141,"C"]
["18.5","INSTALAÇÃO PROVISÓRIA DE ÁGUA",{"$f":"PO!L122","v":897.15},2.3797354919292452E-3,0.97568513251929068,"C"]
["13.1","REPOSIÇÃO DE SAIBRO ROSA - COMPACTAÇÃO MECÂNICA - E= 6 CM",{"$f":"PO!L87","v":877.03},2.3263661801111364E-3,0.97801149869940185,"C"]
["2.2","LOCAÇÃO DE BANHEIRO QUÍMICO",{"$f":"PO!L21","v":830.62},2.203261321190737E-3,0.9802147600205926,"C"]
["18.2","LOCAÇÃO DE BANHEIRO QUÍMICO",{"$f":"PO!L119","v":830.62},2.203261321190737E-3,0.98241802134178335,"C"]
["18.7","SINALIZAÇÃO COM TELA PLÁSTICA LARANJA FIXADA EM CONE PLÁSTICO",{"$f":"PO!L124","v":787.29},2.0883263171609825E-3,0.98450634765894429,"C"]
["10.2","LOCAÇÃO DE BANHEIRO QUÍMICO",{"$f":"PO!L70","v":769},2.0398111723720553E-3,0.98654615883131636,"C"]
["17.2","REMOÇÃO DE ENTULHOS COM CAÇAMBA 4M³",{"$f":"PO!L115","v":744},1.973497415142795E-3,0.9885196562464591,"C"]
["24.1","PLANTIO DE GRAMA CATARINA (SÃO MARCOS) COM COMPOSTO ORGÂNICO",{"$f":"PO!L151","v":715.26},1.8972631198320368E-3,0.99041691936629117,"C"]
["5.1","EXECUÇÃO DE PASSEIO (CALÇADA) OU PISO DE CONCRETO COM CONCRETO USINADO, MOLDADO IN LOCO,  ACABAMENTO VASSOURADO, ESPESSURA 8 CM, ARMADO",{"$f":"PO!L38","v":589.13},{"$f":"C77/$C$95","v":1.5626969518589713E-3},{"$f":"E76+D77","v":0.99197961631815013},"C"]
["12.1","MODELAGEM (MOVIMENTO DE TERRA ATÉ 15CM)",{"$f":"PO!L83","v":494.74},1.3123227300641752E-3,0.99329193904821433,"C"]
["4.1","MODELAGEM (MOVIMENTO DE TERRA ATÉ 15CM)",{"$f":"PO!L34","v":449.72},1.1929049160457228E-3,0.99448484396426007,"C"]
["16.3","APLICAÇÃO MANUAL DE PINTURA COM TINTA LÁTEX ACRÍLICA EM PAREDES, DUAS DEMÃOS. AF_06/2014",{"$f":"PO!L107","v":402.02},1.0663782672522934E-3,0.99555122223151238,"C"]
["16.2","EMBOÇO OU MASSA ÚNICA EM ARGAMASSA TRAÇO 1:2:8, PREPARO MANUAL, APLICADA MANUALMENTE EM PANOS CEGOS DE FACHADA (SEM PRESENÇA DE VÃOS), ESPESSURA DE 25 MM. AF_06/2014",{"$f":"PO!L106","v":359.69},9.5409581351170946E-4,0.99650531804502407,"C"]
["9.1","DEMOLIÇÃO DE MURETAS E CANTEIRO",{"$f":"PO!L65","v":292.08},7.7475688846089712E-4,0.99728007493348492,"C"]
["1.1","ART (ANOTAÇÃO DE RESPONSABILIDADE TÉCNICA PELA EXECUÇÃO TOTAL DO OBJETO)",{"$f":"PO!L16","v":276.05},7.3223650732549535E-4,0.99801231144081037,"C"]
["20.1","MODELAGEM (MOVIMENTO DE TERRA ATÉ 15CM)",{"$f":"PO!L132","v":209.45},5.5557665806674509E-4,0.99856788809887709,"C"]
["22.2","INSTALAÇÃO DE BANCO S/ENCOSTO TIPO A (EXISTENTE)",{"$f":"PO!L139","v":119.41},3.1674103002984021E-4,0.99888462912890696,"C"]
["5.3","PISO PODOTÁTIL 25x25 cm - E=2,0 cm",{"$f":"PO!L40","v":101.37},2.6888902281320583E-4,0.99915351815172015,"C"]
["17.1","REMOÇÃO BANCO S/ ENCOSTO - TIPO A",{"$f":"PO!L114","v":61.5},1.6313184278398104E-4,0.99931664999450409,"C"]
["16.1","CHAPISCO APLICADO EM ALVENARIA (SEM PRESENÇA DE VÃOS) E ESTRUTURAS DE CONCRETO DE FACHADA, COM EQUIPAMENTO DE PROJEÇÃO. ARGAMASSA TRAÇO 1:3 COM PREPARO EM BETONEIRA 400 L. AF_06/2014",{"$f":"PO!L105","v":50.88},1.3496175871299113E-4,0.99945161175321706,"C"]
["10.9","NIVELAMENTO",{"$f":"PO!L77","v":50.31},1.3344980504816399E-4,0.99958506155826521,"C"]
["2.9","NIVELAMENTO",{"$f":"PO!L28","v":45.73},1.2130112472376344E-4,0.99970636268298896,"C"]
["10.8","LOCAÇÃO DE OBRA",{"$f":"PO!L76","v":40.42},1.0721608268826852E-4,0.99981357876567722,"C"]
["2.8","LOCAÇÃO DE OBRA",{"$f":"PO!L27","v":30.38},8.0584477784997451E-5,0.99989416324346225,"C"]
["18.9","NIVELAMENTO",{"$f":"PO!L126","v":21.3},5.6499321159330015E-5,0.99995066256462162,"C"]
["18.8","LOCAÇÃO DE OBRA",{"$f":"PO!L125","v":18.600000000000001},4.9337435378569879E-5,1.0000000000000002,"C"]
[null,"VALOR TOTAL PO",{"$f":"SUM(C13:C94)","v":376995.67999999988}]