{"text_format":"2","workbook":"xlsx","n_sheets":10,"sheets":["Proposta-TCE","Orçamento-TCE","Identificação-TCE","Orçamento","CFF","CPUE","Mapa Cotacões","BDI","Encargos Sociais","BDI Diferenciado"],"not_rendered":{"charts":0,"images":1,"macros":0,"external_links":2,"defined_names":189,"comments":3,"pivot_tables":0},"unopened":[],"bounds":{"document_bytes":16777216,"sheet_cells":100000,"run_cost":"one","rows_first":2000,"rows_last":500,"rows_between":2000,"halvings":0,"cell_chars":16384,"cell_head_chars":4096},"cells_cut":0,"cells_raw":0,"read":"whole","date_system":"1900"}

{"sheet":"Proposta-TCE","index":0,"n_rows":257,"n_cols":20,"rows_kept":257,"cut":false,"hidden":true,"merged":[[9,14,9,15],[9,16,9,17],[9,18,9,19],[5,2,5,3],[9,0,10,0],[9,1,10,1],[9,2,10,2],[9,3,10,3],[9,4,9,12],[4,2,4,3],[0,0,0,7],[1,2,1,3],[2,0,2,1],[2,2,2,7],[3,2,3,5]]}
["PROPOSTA"]
["Modalidade",null,"",null,"N° ","","Ano ",""]
["Descrição do Objeto",null,{"$f":"'Orçamento-TCE'!C3:K3","v":"Reforma dos setores 2 e 4 do Ginásio Municipal Osmar Fortes Barcellos (Ginásio Tesourinha) "}]
["Licitante",{"$nulls":5},"CNPJ*"]
["Tipo de Objeto",null,""]
["Preço Total Proposto",null,{"$f":"SUM(H12:H257)","v":2045309.4300000018}]
["Atenção! Se existirem itens sem preço proposto, deixe a célula do preço unitário proposto em branco."]
["Para incluir itens da proposta, selecione as células A13 a K13 e arraste para baixo, de acordo com o número de itens cadastrado na planilha Orçamento-base."]
["*Campos de preenchimento obrigatório",{"$nulls":4},"**Obrigatório só para Obras e Serviços de Engenharia"]
["Nº  do lote","Nº Ordem","Nº Item","Descrição do item","Proposta",{"$nulls":9},"Equipamento",null,"Mão de Obra",null,"Material"]
[{"$nulls":4},"Qtd.","Unid.","Preço unitário (R$)*","Preço Total (R$)","% BDI**","% Encargos Sociais**","Percentual de Desconto","Pr. Unit. Material","Pr. Unit. Mão de obra","Pr. Unit. Equipamento","Preço total","Preço unit.","Preço total","Preço unit.","Preço total","Preço unit."]
[1,{"$f":"'Orçamento-TCE'!B12","v":1},{"$f":"'Orçamento-TCE'!C12","v":"1.1"},{"$f":"'Orçamento-TCE'!G12","v":"PLACA DE OBRA"},{"$f":"'Orçamento-TCE'!H12","v":2.88},{"$f":"'Orçamento-TCE'!I12","v":"M2"},{"$f":"Orçamento!H10","v":390.92},{"$f":"Orçamento!I10","v":1125.8499999999999},{"$f":"Orçamento!G10","v":0.22159999999999999},1.1122000000000001,null,{"$f":"G12*0.7","v":273.64400000000001},{"$f":"G12-L12","v":117.27600000000001},{"$f":"P12","v":{"$error":"#REF!"}},{"$f":"IF(#REF!=\"Tabela Não Desonerada\",VLOOKUP($C12,#REF!,13,FALSE),VLOOKUP($C12,#REF!,13,FALSE))","v":{"$error":"#REF!"}},{"$f":"O12/E12","v":{"$error":"#REF!"}},{"$f":"IF(#REF!=\"Tabela Não Desonerada\",VLOOKUP($C12,#REF!,14,FALSE),VLOOKUP($C12,#REF!,14,FALSE))","v":{"$error":"#REF!"}},{"$f":"Q12/E12","v":{"$error":"#REF!"}},{"$f":"IF(#REF!=\"Tabela Não Desonerada\",VLOOKUP($C12,#REF!,15,FALSE),VLOOKUP($C12,#REF!,15,FALSE))","v":{"$error":"#REF!"}},{"$f":"S12/E12","v":{"$error":"#REF!"}}]
[1,{"$f":"'Orçamento-TCE'!B13","v":2},{"$f":"'Orçamento-TCE'!C13","v":"1.2"},{"$f":"'Orçamento-TCE'!G13","v":"ANDAIME TUBULAR METÁLICO"},{"$f":"'Orçamento-TCE'!H13","v":8},{"$f":"'Orçamento-TCE'!I13","v":"MÊS"},{"$f":"Orçamento!H11","v":789.78},{"$f":"Orçamento!I11","v":6318.24},{"$f":"Orçamento!G11","v":0.22159999999999999},1.1122000000000001,null,{"$f":"G13*0.7","v":552.84599999999989},{"$f":"G13-L13","v":236.93400000000008},{"$f":"P13","v":{"$error":"#REF!"}},{"$f":"IF(#REF!=\"Tabela Não Desonerada\",VLOOKUP($C13,#REF!,13,FALSE),VLOOKUP($C13,#REF!,13,FALSE))","v":{"$error":"#REF!"}},{"$f":"O13/E13","v":{"$error":"#REF!"}},{"$f":"IF(#REF!=\"Tabela Não Desonerada\",VLOOKUP($C13,#REF!,14,FALSE),VLOOKUP($C13,#REF!,14,FALSE))","v":{"$error":"#REF!"}},{"$f":"Q13/E13","v":{"$error":"#REF!"}},{"$f":"IF(#REF!=\"Tabela Não Desonerada\",VLOOKUP($C13,#REF!,15,FALSE),VLOOKUP($C13,#REF!,15,FALSE))","v":{"$error":"#REF!"}},{"$f":"S13/E13","v":{"$error":"#REF!"}}]
[1,{"$f":"'Orçamento-TCE'!B14","v":3},{"$f":"'Orçamento-TCE'!C14","v":"1.3"},{"$f":"'Orçamento-TCE'!G14","v":"EXTINTOR DE INCÊNDIO PORTÁTIL COM CARGA DE PQS DE 4 KG, CLASSE BC - FORNECIMENTO E INSTALAÇÃO. AF_10/2020_P"},{"$f":"'Orçamento-TCE'!H14","v":2},{"$f":"'Orçamento-TCE'!I14","v":"UN"},{"$f":"Orçamento!H12","v":282.97000000000003},{"$f":"Orçamento!I12","v":565.94000000000005},{"$f":"Orçamento!G12","v":0.22159999999999999},1.1122000000000001,null,198.07900000000001,84.89100000000002,{"$error":"#REF!"},{"$f":"IF(#REF!=\"Tabela Não Desonerada\",VLOOKUP($C14,#REF!,13,FALSE),VLOOKUP($C14,#REF!,13,FALSE))","v":{"$error":"#REF!"}},{"$error":"#REF!"},{"$f":"IF(#REF!=\"Tabela Não Desonerada\",VLOOKUP($C14,#REF!,14,FALSE),VLOOKUP($C14,#REF!,14,FALSE))","v":{"$error":"#REF!"}},{"$error":"#REF!"},{"$f":"IF(#REF!=\"Tabela Não Desonerada\",VLOOKUP($C14,#REF!,15,FALSE),VLOOKUP($C14,#REF!,15,FALSE))","v":{"$error":"#REF!"}},{"$error":"#REF!"}]
[1,{"$f":"'Orçamento-TCE'!B15","v":4},{"$f":"'Orçamento-TCE'!C15","v":"1.4"},{"$f":"'Orçamento-TCE'!G15","v":"EXTINTOR DE INCÊNDIO PORTÁTIL COM CARGA DE ÁGUA PRESSURIZADA DE 10 L, CLASSE A - FORNECIMENTO E INSTALAÇÃO. AF_10/2020_P"},{"$f":"'Orçamento-TCE'!H15","v":2},{"$f":"'Orçamento-TCE'!I15","v":"UN"},{"$f":"Orçamento!H13","v":291.82},{"$f":"Orçamento!I13","v":583.64},{"$f":"Orçamento!G13","v":0.22159999999999999},1.1122000000000001,null,204.27399999999997,87.546000000000021,{"$error":"#REF!"},{"$f":"IF(#REF!=\"Tabela Não Desonerada\",VLOOKUP($C15,#REF!,13,FALSE),VLOOKUP($C15,#REF!,13,FALSE))","v":{"$error":"#REF!"}},{"$error":"#REF!"},{"$f":"IF(#REF!=\"Tabela Não Desonerada\",VLOOKUP($C15,#REF!,14,FALSE),VLOOKUP($C15,#REF!,14,FALSE))","v":{"$error":"#REF!"}},{"$error":"#REF!"},{"$f":"IF(#REF!=\"Tabela Não Desonerada\",VLOOKUP($C15,#REF!,15,FALSE),VLOOKUP($C15,#REF!,15,FALSE))","v":{"$error":"#REF!"}},{"$error":"#REF!"}]
[1,{"$f":"'Orçamento-TCE'!B16","v":5},{"$f":"'Orçamento-TCE'!C16","v":"2.1"},{"$f":"'Orçamento-TCE'!G16","v":"ADMINISTRAÇÃO LOCAL"},{"$f":"'Orçamento-TCE'!H16","v":1},{"$f":"'Orçamento-TCE'!I16","v":"UN"},{"$f":"Orçamento!H15","v":116639.28},{"$f":"Orçamento!I15","v":116639.28},{"$f":"Orçamento!G15","v":0.22159999999999999},1.1122000000000001,null,81647.495999999999,34991.784,{"$error":"#REF!"},{"$f":"IF(#REF!=\"Tabela Não Desonerada\",VLOOKUP($C16,#REF!,13,FALSE),VLOOKUP($C16,#REF!,13,FALSE))","v":{"$error":"#REF!"}},{"$error":"#REF!"},{"$f":"IF(#REF!=\"Tabela Não Desonerada\",VLOOKUP($C16,#REF!,14,FALSE),VLOOKUP($C16,#REF!,14,FALSE))","v":{"$error":"#REF!"}},{"$error":"#REF!"},{"$f":"IF(#REF!=\"Tabela Não Desonerada\",VLOOKUP($C16,#REF!,15,FALSE),VLOOKUP($C16,#REF!,15,FALSE))","v":{"$error":"#REF!"}},{"$error":"#REF!"}]
[1,{"$f":"'Orçamento-TCE'!B17","v":6},{"$f":"'Orçamento-TCE'!C17","v":"3.1"},{"$f":"'Orçamento-TCE'!G17","v":"REMOÇÃO DE FORROS DE DRYWALL, PVC E FIBROMINERAL, DE FORMA MANUAL, SEM REAPROVEITAMENTO. AF_12/2017"},{"$f":"'Orçamento-TCE'!H17","v":317.29000000000002},{"$f":"'Orçamento-TCE'!I17","v":"M2"},{"$f":"Orçamento!H17","v":1.84},{"$f":"Orçamento!I17","v":583.80999999999995},{"$f":"Orçamento!G17","v":0.22159999999999999},1.1122000000000001,null,1.288,0.55200000000000005,{"$error":"#REF!"},{"$f":"IF(#REF!=\"Tabela Não Desonerada\",VLOOKUP($C17,#REF!,13,FALSE),VLOOKUP($C17,#REF!,13,FALSE))","v":{"$error":"#REF!"}},{"$error":"#REF!"},{"$f":"IF(#REF!=\"Tabela Não Desonerada\",VLOOKUP($C17,#REF!,14,FALSE),VLOOKUP($C17,#REF!,14,FALSE))","v":{"$error":"#REF!"}},{"$error":"#REF!"},{"$f":"IF(#REF!=\"Tabela Não Desonerada\",VLOOKUP($C17,#REF!,15,FALSE),VLOOKUP($C17,#REF!,15,FALSE))","v":{"$error":"#REF!"}},{"$error":"#REF!"}]
[1,{"$f":"'Orçamento-TCE'!B18","v":7},{"$f":"'Orçamento-TCE'!C18","v":"3.2"},{"$f":"'Orçamento-TCE'!G18","v":"DEMOLIÇÃO DE LAJES, DE FORMA MECANIZADA COM MARTELETE, SEM REAPROVEITAMENTO. AF_12/2017"},{"$f":"'Orçamento-TCE'!H18","v":7.53},{"$f":"'Orçamento-TCE'!I18","v":"M3"},{"$f":"Orçamento!H18","v":149.19},{"$f":"Orçamento!I18","v":1123.4000000000001},{"$f":"Orçamento!G18","v":0.22159999999999999},1.1122000000000001,null,104.43299999999999,44.757000000000005,{"$error":"#REF!"},{"$f":"IF(#REF!=\"Tabela Não Desonerada\",VLOOKUP($C18,#REF!,13,FALSE),VLOOKUP($C18,#REF!,13,FALSE))","v":{"$error":"#REF!"}},{"$error":"#REF!"},{"$f":"IF(#REF!=\"Tabela Não Desonerada\",VLOOKUP($C18,#REF!,14,FALSE),VLOOKUP($C18,#REF!,14,FALSE))","v":{"$error":"#REF!"}},{"$error":"#REF!"},{"$f":"IF(#REF!=\"Tabela Não Desonerada\",VLOOKUP($C18,#REF!,15,FALSE),VLOOKUP($C18,#REF!,15,FALSE))","v":{"$error":"#REF!"}},{"$error":"#REF!"}]
[1,{"$f":"'Orçamento-TCE'!B19","v":8},{"$f":"'Orçamento-TCE'!C19","v":"3.3"},{"$f":"'Orçamento-TCE'!G19","v":"REMOÇÃO DE TRAMA METÁLICA OU DE MADEIRA PARA FORRO, DE FORMA MANUAL SEM REAPROVEITAMENTO. AF_12/2017"},{"$f":"'Orçamento-TCE'!H19","v":189.14},{"$f":"'Orçamento-TCE'!I19","v":"M2"},{"$f":"Orçamento!H19","v":3.31},{"$f":"Orçamento!I19","v":626.04999999999995},{"$f":"Orçamento!G19","v":0.22159999999999999},1.1122000000000001,null,2.3169999999999997,0.99300000000000033,{"$error":"#REF!"},{"$f":"IF(#REF!=\"Tabela Não Desonerada\",VLOOKUP($C19,#REF!,13,FALSE),VLOOKUP($C19,#REF!,13,FALSE))","v":{"$error":"#REF!"}},{"$error":"#REF!"},{"$f":"IF(#REF!=\"Tabela Não Desonerada\",VLOOKUP($C19,#REF!,14,FALSE),VLOOKUP($C19,#REF!,14,FALSE))","v":{"$error":"#REF!"}},{"$error":"#REF!"},{"$f":"IF(#REF!=\"Tabela Não Desonerada\",VLOOKUP($C19,#REF!,15,FALSE),VLOOKUP($C19,#REF!,15,FALSE))","v":{"$error":"#REF!"}},{"$error":"#REF!"}]
[1,{"$f":"'Orçamento-TCE'!B20","v":9},{"$f":"'Orçamento-TCE'!C20","v":"3.4"},{"$f":"'Orçamento-TCE'!G20","v":"DEMOLIÇÃO DE REVESTIMENTO CERÂMICO, DE FORMA MANUAL, SEM REAPROVEITAMENTO. AF_12/2017"},{"$f":"'Orçamento-TCE'!H20","v":301.22000000000003},{"$f":"'Orçamento-TCE'!I20","v":"M2"},{"$f":"Orçamento!H20","v":23.63},{"$f":"Orçamento!I20","v":7117.83},{"$f":"Orçamento!G20","v":0.22159999999999999},1.1122000000000001,null,16.540999999999997,7.0890000000000022,{"$error":"#REF!"},{"$f":"IF(#REF!=\"Tabela Não Desonerada\",VLOOKUP($C20,#REF!,13,FALSE),VLOOKUP($C20,#REF!,13,FALSE))","v":{"$error":"#REF!"}},{"$error":"#REF!"},{"$f":"IF(#REF!=\"Tabela Não Desonerada\",VLOOKUP($C20,#REF!,14,FALSE),VLOOKUP($C20,#REF!,14,FALSE))","v":{"$error":"#REF!"}},{"$error":"#REF!"},{"$f":"IF(#REF!=\"Tabela Não Desonerada\",VLOOKUP($C20,#REF!,15,FALSE),VLOOKUP($C20,#REF!,15,FALSE))","v":{"$error":"#REF!"}},{"$error":"#REF!"}]
[1,{"$f":"'Orçamento-TCE'!B21","v":10},{"$f":"'Orçamento-TCE'!C21","v":"3.5"},{"$f":"'Orçamento-TCE'!G21","v":"DEMOLIÇÃO DE REVESTIMENTO CERÂMICO, DE FORMA MECANIZADA COM MARTELETE, SEM REAPROVEITAMENTO. AF_12/2017"},{"$f":"'Orçamento-TCE'!H21","v":1053.1600000000001},{"$f":"'Orçamento-TCE'!I21","v":"M2"},{"$f":"Orçamento!H21","v":13.71},{"$f":"Orçamento!I21","v":14438.82},{"$f":"Orçamento!G21","v":0.22159999999999999},1.1122000000000001,null,9.5969999999999995,4.1130000000000013,{"$error":"#REF!"},{"$f":"IF(#REF!=\"Tabela Não Desonerada\",VLOOKUP($C21,#REF!,13,FALSE),VLOOKUP($C21,#REF!,13,FALSE))","v":{"$error":"#REF!"}},{"$error":"#REF!"},{"$f":"IF(#REF!=\"Tabela Não Desonerada\",VLOOKUP($C21,#REF!,14,FALSE),VLOOKUP($C21,#REF!,14,FALSE))","v":{"$error":"#REF!"}},{"$error":"#REF!"},{"$f":"IF(#REF!=\"Tabela Não Desonerada\",VLOOKUP($C21,#REF!,15,FALSE),VLOOKUP($C21,#REF!,15,FALSE))","v":{"$error":"#REF!"}},{"$error":"#REF!"}]
[1,{"$f":"'Orçamento-TCE'!B22","v":11},{"$f":"'Orçamento-TCE'!C22","v":"3.6"},{"$f":"'Orçamento-TCE'!G22","v":"DEMOLIÇÃO DE ALVENARIA DE BLOCO FURADO, DE FORMA MANUAL, COM REAPROVEITAMENTO. AF_12/2017"},{"$f":"'Orçamento-TCE'!H22","v":66.849999999999994},{"$f":"'Orçamento-TCE'!I22","v":"M3"},{"$f":"Orçamento!H22","v":122.61},{"$f":"Orçamento!I22","v":8196.48},{"$f":"Orçamento!G22","v":0.22159999999999999},1.1122000000000001,null,85.826999999999998,36.783000000000001,{"$error":"#REF!"},{"$f":"IF(#REF!=\"Tabela Não Desonerada\",VLOOKUP($C22,#REF!,13,FALSE),VLOOKUP($C22,#REF!,13,FALSE))","v":{"$error":"#REF!"}},{"$error":"#REF!"},{"$f":"IF(#REF!=\"Tabela Não Desonerada\",VLOOKUP($C22,#REF!,14,FALSE),VLOOKUP($C22,#REF!,14,FALSE))","v":{"$error":"#REF!"}},{"$error":"#REF!"},{"$f":"IF(#REF!=\"Tabela Não Desonerada\",VLOOKUP($C22,#REF!,15,FALSE),VLOOKUP($C22,#REF!,15,FALSE))","v":{"$error":"#REF!"}},{"$error":"#REF!"}]
[1,{"$f":"'Orçamento-TCE'!B23","v":12},{"$f":"'Orçamento-TCE'!C23","v":"3.7"},{"$f":"'Orçamento-TCE'!G23","v":"REMOÇÃO DE CHAPAS E PERFIS DE DRYWALL, DE FORMA MANUAL, SEM REAPROVEITAMENTO. AF_12/2017"},{"$f":"'Orçamento-TCE'!H23","v":23.23},{"$f":"'Orçamento-TCE'!I23","v":"M2"},{"$f":"Orçamento!H23","v":8.5399999999999991},{"$f":"Orçamento!I23","v":198.38},{"$f":"Orçamento!G23","v":0.22159999999999999},1.1122000000000001,null,5.9779999999999989,2.5620000000000003,{"$error":"#REF!"},{"$f":"IF(#REF!=\"Tabela Não Desonerada\",VLOOKUP($C23,#REF!,13,FALSE),VLOOKUP($C23,#REF!,13,FALSE))","v":{"$error":"#REF!"}},{"$error":"#REF!"},{"$f":"IF(#REF!=\"Tabela Não Desonerada\",VLOOKUP($C23,#REF!,14,FALSE),VLOOKUP($C23,#REF!,14,FALSE))","v":{"$error":"#REF!"}},{"$error":"#REF!"},{"$f":"IF(#REF!=\"Tabela Não Desonerada\",VLOOKUP($C23,#REF!,15,FALSE),VLOOKUP($C23,#REF!,15,FALSE))","v":{"$error":"#REF!"}},{"$error":"#REF!"}]
[1,{"$f":"'Orçamento-TCE'!B24","v":13},{"$f":"'Orçamento-TCE'!C24","v":"3.8"},{"$f":"'Orçamento-TCE'!G24","v":"REMOÇÃO DE PORTAS, DE FORMA MANUAL, SEM REAPROVEITAMENTO. AF_12/2017"},{"$f":"'Orçamento-TCE'!H24","v":84.21},{"$f":"'Orçamento-TCE'!I24","v":"m2"},{"$f":"Orçamento!H24","v":9.59},{"$f":"Orçamento!I24","v":807.57},{"$f":"Orçamento!G24","v":0.22159999999999999},1.1122000000000001,null,6.7129999999999992,2.8770000000000007,{"$error":"#REF!"},{"$f":"IF(#REF!=\"Tabela Não Desonerada\",VLOOKUP($C24,#REF!,13,FALSE),VLOOKUP($C24,#REF!,13,FALSE))","v":{"$error":"#REF!"}},{"$error":"#REF!"},{"$f":"IF(#REF!=\"Tabela Não Desonerada\",VLOOKUP($C24,#REF!,14,FALSE),VLOOKUP($C24,#REF!,14,FALSE))","v":{"$error":"#REF!"}},{"$error":"#REF!"},{"$f":"IF(#REF!=\"Tabela Não Desonerada\",VLOOKUP($C24,#REF!,15,FALSE),VLOOKUP($C24,#REF!,15,FALSE))","v":{"$error":"#REF!"}},{"$error":"#REF!"}]
[1,{"$f":"'Orçamento-TCE'!B25","v":14},{"$f":"'Orçamento-TCE'!C25","v":"3.9"},{"$f":"'Orçamento-TCE'!G25","v":"REMOÇÃO DE JANELAS, DE FORMA MANUAL, SEM REAPROVEIAMENTO. AF_12/2017"},{"$f":"'Orçamento-TCE'!H25","v":116.42},{"$f":"'Orçamento-TCE'!I25","v":"M2"},{"$f":"Orçamento!H25","v":36.159999999999997},{"$f":"Orçamento!I25","v":4209.75},{"$f":"Orçamento!G25","v":0.22159999999999999},1.1122000000000001,null,25.311999999999998,10.847999999999999,{"$error":"#REF!"},{"$f":"IF(#REF!=\"Tabela Não Desonerada\",VLOOKUP($C25,#REF!,13,FALSE),VLOOKUP($C25,#REF!,13,FALSE))","v":{"$error":"#REF!"}},{"$error":"#REF!"},{"$f":"IF(#REF!=\"Tabela Não Desonerada\",VLOOKUP($C25,#REF!,14,FALSE),VLOOKUP($C25,#REF!,14,FALSE))","v":{"$error":"#REF!"}},{"$error":"#REF!"},{"$f":"IF(#REF!=\"Tabela Não Desonerada\",VLOOKUP($C25,#REF!,15,FALSE),VLOOKUP($C25,#REF!,15,FALSE))","v":{"$error":"#REF!"}},{"$error":"#REF!"}]
[1,{"$f":"'Orçamento-TCE'!B26","v":15},{"$f":"'Orçamento-TCE'!C26","v":"3.10"},{"$f":"'Orçamento-TCE'!G26","v":"REMOÇÃO DE LOUÇAS, DE FORMA MANUAL, SEM REAPROVEITAMENTO. AF_12/2017"},{"$f":"'Orçamento-TCE'!H26","v":55},{"$f":"'Orçamento-TCE'!I26","v":"UN"},{"$f":"Orçamento!H26","v":12.72},{"$f":"Orçamento!I26","v":699.6},{"$f":"Orçamento!G26","v":0.22159999999999999},1.1122000000000001,null,8.9039999999999999,3.8160000000000007,{"$error":"#REF!"},{"$f":"IF(#REF!=\"Tabela Não Desonerada\",VLOOKUP($C26,#REF!,13,FALSE),VLOOKUP($C26,#REF!,13,FALSE))","v":{"$error":"#REF!"}},{"$error":"#REF!"},{"$f":"IF(#REF!=\"Tabela Não Desonerada\",VLOOKUP($C26,#REF!,14,FALSE),VLOOKUP($C26,#REF!,14,FALSE))","v":{"$error":"#REF!"}},{"$error":"#REF!"},{"$f":"IF(#REF!=\"Tabela Não Desonerada\",VLOOKUP($C26,#REF!,15,FALSE),VLOOKUP($C26,#REF!,15,FALSE))","v":{"$error":"#REF!"}},{"$error":"#REF!"}]
[1,{"$f":"'Orçamento-TCE'!B27","v":16},{"$f":"'Orçamento-TCE'!C27","v":"3.11"},{"$f":"'Orçamento-TCE'!G27","v":"TRANSPORTE COM CAMINHÃO BASCULANTE DE 10M3, EM VIA URBANA PAVIMENTADA, DMT ATÉ 30 KM (UNIDADE: M3XKM). AF_07/2020"},{"$f":"'Orçamento-TCE'!H27","v":2944.62},{"$f":"'Orçamento-TCE'!I27","v":"M3XKM"},{"$f":"Orçamento!H27","v":2},{"$f":"Orçamento!I27","v":5889.24},{"$f":"Orçamento!G27","v":0.22159999999999999},1.1122000000000001,null,1.4,0.60000000000000009,{"$error":"#REF!"},{"$f":"IF(#REF!=\"Tabela Não Desonerada\",VLOOKUP($C27,#REF!,13,FALSE),VLOOKUP($C27,#REF!,13,FALSE))","v":{"$error":"#REF!"}},{"$error":"#REF!"},{"$f":"IF(#REF!=\"Tabela Não Desonerada\",VLOOKUP($C27,#REF!,14,FALSE),VLOOKUP($C27,#REF!,14,FALSE))","v":{"$error":"#REF!"}},{"$error":"#REF!"},{"$f":"IF(#REF!=\"Tabela Não Desonerada\",VLOOKUP($C27,#REF!,15,FALSE),VLOOKUP($C27,#REF!,15,FALSE))","v":{"$error":"#REF!"}},{"$error":"#REF!"}]
[1,{"$f":"'Orçamento-TCE'!B28","v":17},{"$f":"'Orçamento-TCE'!C28","v":"4.1"},{"$f":"'Orçamento-TCE'!G28","v":"ALVENARIA DE VEDAÇÃO DE BLOCOS CERÂMICOS FURADOS NA VERTICAL DE 14X19X39 CM (ESPESSURA 14 CM) E ARGAMASSA DE ASSENTAMENTO COM PREPARO EM BETONEIRA. AF_12/2021"},{"$f":"'Orçamento-TCE'!H28","v":373.38},{"$f":"'Orçamento-TCE'!I28","v":"M2"},{"$f":"Orçamento!H29","v":86.78},{"$f":"Orçamento!I29","v":32401.919999999998},{"$f":"Orçamento!G29","v":0.22159999999999999},1.1122000000000001,null,60.745999999999995,26.034000000000006,{"$error":"#REF!"},{"$f":"IF(#REF!=\"Tabela Não Desonerada\",VLOOKUP($C28,#REF!,13,FALSE),VLOOKUP($C28,#REF!,13,FALSE))","v":{"$error":"#REF!"}},{"$error":"#REF!"},{"$f":"IF(#REF!=\"Tabela Não Desonerada\",VLOOKUP($C28,#REF!,14,FALSE),VLOOKUP($C28,#REF!,14,FALSE))","v":{"$error":"#REF!"}},{"$error":"#REF!"},{"$f":"IF(#REF!=\"Tabela Não Desonerada\",VLOOKUP($C28,#REF!,15,FALSE),VLOOKUP($C28,#REF!,15,FALSE))","v":{"$error":"#REF!"}},{"$error":"#REF!"}]
[1,{"$f":"'Orçamento-TCE'!B29","v":18},{"$f":"'Orçamento-TCE'!C29","v":"4.2"},{"$f":"'Orçamento-TCE'!G29","v":"ALVENARIA DE VEDAÇÃO DE BLOCOS CERÂMICOS FURADOS NA VERTICAL DE 19X19X39 CM (ESPESSURA 19 CM) E ARGAMASSA DE ASSENTAMENTO COM PREPARO EM BETONEIRA. AF_12/2021"},{"$f":"'Orçamento-TCE'!H29","v":3.9},{"$f":"'Orçamento-TCE'!I29","v":"M2"},{"$f":"Orçamento!H30","v":105.58},{"$f":"Orçamento!I30","v":411.76},{"$f":"Orçamento!G30","v":0.22159999999999999},1.1122000000000001,null,73.905999999999992,31.674000000000007,{"$error":"#REF!"},{"$f":"IF(#REF!=\"Tabela Não Desonerada\",VLOOKUP($C29,#REF!,13,FALSE),VLOOKUP($C29,#REF!,13,FALSE))","v":{"$error":"#REF!"}},{"$error":"#REF!"},{"$f":"IF(#REF!=\"Tabela Não Desonerada\",VLOOKUP($C29,#REF!,14,FALSE),VLOOKUP($C29,#REF!,14,FALSE))","v":{"$error":"#REF!"}},{"$error":"#REF!"},{"$f":"IF(#REF!=\"Tabela Não Desonerada\",VLOOKUP($C29,#REF!,15,FALSE),VLOOKUP($C29,#REF!,15,FALSE))","v":{"$error":"#REF!"}},{"$error":"#REF!"}]
[1,{"$f":"'Orçamento-TCE'!B30","v":19},{"$f":"'Orçamento-TCE'!C30","v":"4.3"},{"$f":"'Orçamento-TCE'!G30","v":"PAREDE COM PLACAS DE GESSO ACARTONADO (DRYWALL), PARA USO INTERNO, COM DUAS FACES SIMPLES E ESTRUTURA METÁLICA COM GUIAS DUPLAS, COM VÃOS. AF_06/2017"},{"$f":"'Orçamento-TCE'!H30","v":114.08},{"$f":"'Orçamento-TCE'!I30","v":"M2"},{"$f":"Orçamento!H31","v":220.73},{"$f":"Orçamento!I31","v":25180.880000000001},{"$f":"Orçamento!G31","v":0.22159999999999999},1.1122000000000001,null,154.511,66.218999999999994,{"$error":"#REF!"},{"$f":"IF(#REF!=\"Tabela Não Desonerada\",VLOOKUP($C30,#REF!,13,FALSE),VLOOKUP($C30,#REF!,13,FALSE))","v":{"$error":"#REF!"}},{"$error":"#REF!"},{"$f":"IF(#REF!=\"Tabela Não Desonerada\",VLOOKUP($C30,#REF!,14,FALSE),VLOOKUP($C30,#REF!,14,FALSE))","v":{"$error":"#REF!"}},{"$error":"#REF!"},{"$f":"IF(#REF!=\"Tabela Não Desonerada\",VLOOKUP($C30,#REF!,15,FALSE),VLOOKUP($C30,#REF!,15,FALSE))","v":{"$error":"#REF!"}},{"$error":"#REF!"}]
[1,{"$f":"'Orçamento-TCE'!B31","v":20},{"$f":"'Orçamento-TCE'!C31","v":"4.4"},{"$f":"'Orçamento-TCE'!G31","v":"DIVISÓRIA SANITÁRIA, TIPO CABINE, EM PAINEL DE GRANILITE, ESP = 3CM, ASSENTADO COM ARGAMASSA COLANTE AC III-E, EXCLUSIVE FERRAGENS. AF_01/2021"},{"$f":"'Orçamento-TCE'!H31","v":11.34},{"$f":"'Orçamento-TCE'!I31","v":"M2"},{"$f":"Orçamento!H32","v":310.81},{"$f":"Orçamento!I32","v":3524.59},{"$f":"Orçamento!G32","v":0.22159999999999999},1.1122000000000001,null,217.56699999999998,93.243000000000023,{"$error":"#REF!"},{"$f":"IF(#REF!=\"Tabela Não Desonerada\",VLOOKUP($C31,#REF!,13,FALSE),VLOOKUP($C31,#REF!,13,FALSE))","v":{"$error":"#REF!"}},{"$error":"#REF!"},{"$f":"IF(#REF!=\"Tabela Não Desonerada\",VLOOKUP($C31,#REF!,14,FALSE),VLOOKUP($C31,#REF!,14,FALSE))","v":{"$error":"#REF!"}},{"$error":"#REF!"},{"$f":"IF(#REF!=\"Tabela Não Desonerada\",VLOOKUP($C31,#REF!,15,FALSE),VLOOKUP($C31,#REF!,15,FALSE))","v":{"$error":"#REF!"}},{"$error":"#REF!"}]
[1,{"$f":"'Orçamento-TCE'!B32","v":21},{"$f":"'Orçamento-TCE'!C32","v":"4.5"},{"$f":"'Orçamento-TCE'!G32","v":"FERRAGEM PARA DIVISÓRIA (VÃO PORTA) COMPOSTA DE 3 DOBRADIÇAS PALMELA E 1 FECHADURA TUBULAR LOCKWELL COM BOTÃO DE GIRO PARA TRAVAMENTO, REF: 41410N, OU SIMILAR"},{"$f":"'Orçamento-TCE'!H32","v":3},{"$f":"'Orçamento-TCE'!I32","v":"CJ"},{"$f":"Orçamento!H33","v":256.07},{"$f":"Orçamento!I33","v":768.21},{"$f":"Orçamento!G33","v":0.22159999999999999},1.1122000000000001,null,179.249,76.820999999999998,{"$error":"#REF!"},{"$f":"IF(#REF!=\"Tabela Não Desonerada\",VLOOKUP($C32,#REF!,13,FALSE),VLOOKUP($C32,#REF!,13,FALSE))","v":{"$error":"#REF!"}},{"$error":"#REF!"},{"$f":"IF(#REF!=\"Tabela Não Desonerada\",VLOOKUP($C32,#REF!,14,FALSE),VLOOKUP($C32,#REF!,14,FALSE))","v":{"$error":"#REF!"}},{"$error":"#REF!"},{"$f":"IF(#REF!=\"Tabela Não Desonerada\",VLOOKUP($C32,#REF!,15,FALSE),VLOOKUP($C32,#REF!,15,FALSE))","v":{"$error":"#REF!"}},{"$error":"#REF!"}]
[1,{"$f":"'Orçamento-TCE'!B33","v":22},{"$f":"'Orçamento-TCE'!C33","v":"5.1"},{"$f":"'Orçamento-TCE'!G33","v":"EA01"},{"$f":"'Orçamento-TCE'!H33","v":1},{"$f":"'Orçamento-TCE'!I33","v":"UN"},{"$f":"Orçamento!H35","v":1092.95},{"$f":"Orçamento!I35","v":1092.95},{"$f":"Orçamento!G35","v":0.13730000000000001},1.1122000000000001,null,765.06499999999994,327.8850000000001,{"$error":"#REF!"},{"$f":"IF(#REF!=\"Tabela Não Desonerada\",VLOOKUP($C33,#REF!,13,FALSE),VLOOKUP($C33,#REF!,13,FALSE))","v":{"$error":"#REF!"}},{"$error":"#REF!"},{"$f":"IF(#REF!=\"Tabela Não Desonerada\",VLOOKUP($C33,#REF!,14,FALSE),VLOOKUP($C33,#REF!,14,FALSE))","v":{"$error":"#REF!"}},{"$error":"#REF!"},{"$f":"IF(#REF!=\"Tabela Não Desonerada\",VLOOKUP($C33,#REF!,15,FALSE),VLOOKUP($C33,#REF!,15,FALSE))","v":{"$error":"#REF!"}},{"$error":"#REF!"}]
[1,{"$f":"'Orçamento-TCE'!B34","v":23},{"$f":"'Orçamento-TCE'!C34","v":"5.2"},{"$f":"'Orçamento-TCE'!G34","v":"EA03"},{"$f":"'Orçamento-TCE'!H34","v":3},{"$f":"'Orçamento-TCE'!I34","v":"UN"},{"$f":"Orçamento!H36","v":1990.28},{"$f":"Orçamento!I36","v":5970.84},{"$f":"Orçamento!G36","v":0.13730000000000001},1.1122000000000001,null,1393.1959999999999,597.08400000000006,{"$error":"#REF!"},{"$f":"IF(#REF!=\"Tabela Não Desonerada\",VLOOKUP($C34,#REF!,13,FALSE),VLOOKUP($C34,#REF!,13,FALSE))","v":{"$error":"#REF!"}},{"$error":"#REF!"},{"$f":"IF(#REF!=\"Tabela Não Desonerada\",VLOOKUP($C34,#REF!,14,FALSE),VLOOKUP($C34,#REF!,14,FALSE))","v":{"$error":"#REF!"}},{"$error":"#REF!"},{"$f":"IF(#REF!=\"Tabela Não Desonerada\",VLOOKUP($C34,#REF!,15,FALSE),VLOOKUP($C34,#REF!,15,FALSE))","v":{"$error":"#REF!"}},{"$error":"#REF!"}]
[1,{"$f":"'Orçamento-TCE'!B35","v":24},{"$f":"'Orçamento-TCE'!C35","v":"5.3"},{"$f":"'Orçamento-TCE'!G35","v":"EA04"},{"$f":"'Orçamento-TCE'!H35","v":1},{"$f":"'Orçamento-TCE'!I35","v":"UN"},{"$f":"Orçamento!H37","v":2900.12},{"$f":"Orçamento!I37","v":2900.12},{"$f":"Orçamento!G37","v":0.13730000000000001},1.1122000000000001,null,2030.0839999999998,870.03600000000006,{"$error":"#REF!"},{"$f":"IF(#REF!=\"Tabela Não Desonerada\",VLOOKUP($C35,#REF!,13,FALSE),VLOOKUP($C35,#REF!,13,FALSE))","v":{"$error":"#REF!"}},{"$error":"#REF!"},{"$f":"IF(#REF!=\"Tabela Não Desonerada\",VLOOKUP($C35,#REF!,14,FALSE),VLOOKUP($C35,#REF!,14,FALSE))","v":{"$error":"#REF!"}},{"$error":"#REF!"},{"$f":"IF(#REF!=\"Tabela Não Desonerada\",VLOOKUP($C35,#REF!,15,FALSE),VLOOKUP($C35,#REF!,15,FALSE))","v":{"$error":"#REF!"}},{"$error":"#REF!"}]
[1,{"$f":"'Orçamento-TCE'!B36","v":25},{"$f":"'Orçamento-TCE'!C36","v":"5.4"},{"$f":"'Orçamento-TCE'!G36","v":"EA05"},{"$f":"'Orçamento-TCE'!H36","v":5},{"$f":"'Orçamento-TCE'!I36","v":"UN"},{"$f":"Orçamento!H38","v":3070.71},{"$f":"Orçamento!I38","v":15353.55},{"$f":"Orçamento!G38","v":0.13730000000000001},1.1122000000000001,null,2149.4969999999998,921.21300000000019,{"$error":"#REF!"},{"$f":"IF(#REF!=\"Tabela Não Desonerada\",VLOOKUP($C36,#REF!,13,FALSE),VLOOKUP($C36,#REF!,13,FALSE))","v":{"$error":"#REF!"}},{"$error":"#REF!"},{"$f":"IF(#REF!=\"Tabela Não Desonerada\",VLOOKUP($C36,#REF!,14,FALSE),VLOOKUP($C36,#REF!,14,FALSE))","v":{"$error":"#REF!"}},{"$error":"#REF!"},{"$f":"IF(#REF!=\"Tabela Não Desonerada\",VLOOKUP($C36,#REF!,15,FALSE),VLOOKUP($C36,#REF!,15,FALSE))","v":{"$error":"#REF!"}},{"$error":"#REF!"}]
[1,{"$f":"'Orçamento-TCE'!B37","v":26},{"$f":"'Orçamento-TCE'!C37","v":"5.5"},{"$f":"'Orçamento-TCE'!G37","v":"EA09"},{"$f":"'Orçamento-TCE'!H37","v":3},{"$f":"'Orçamento-TCE'!I37","v":"UN"},{"$f":"Orçamento!H39","v":5004.12},{"$f":"Orçamento!I39","v":15012.36},{"$f":"Orçamento!G39","v":0.13730000000000001},1.1122000000000001,null,3502.8839999999996,1501.2360000000003,{"$error":"#REF!"},{"$f":"IF(#REF!=\"Tabela Não Desonerada\",VLOOKUP($C37,#REF!,13,FALSE),VLOOKUP($C37,#REF!,13,FALSE))","v":{"$error":"#REF!"}},{"$error":"#REF!"},{"$f":"IF(#REF!=\"Tabela Não Desonerada\",VLOOKUP($C37,#REF!,14,FALSE),VLOOKUP($C37,#REF!,14,FALSE))","v":{"$error":"#REF!"}},{"$error":"#REF!"},{"$f":"IF(#REF!=\"Tabela Não Desonerada\",VLOOKUP($C37,#REF!,15,FALSE),VLOOKUP($C37,#REF!,15,FALSE))","v":{"$error":"#REF!"}},{"$error":"#REF!"}]
[1,{"$f":"'Orçamento-TCE'!B38","v":27},{"$f":"'Orçamento-TCE'!C38","v":"5.6"},{"$f":"'Orçamento-TCE'!G38","v":"EA11"},{"$f":"'Orçamento-TCE'!H38","v":4},{"$f":"'Orçamento-TCE'!I38","v":"UN"},{"$f":"Orçamento!H40","v":5459.04},{"$f":"Orçamento!I40","v":21836.16},{"$f":"Orçamento!G40","v":0.13730000000000001},1.1122000000000001,null,3821.3279999999995,1637.7120000000004,{"$error":"#REF!"},{"$f":"IF(#REF!=\"Tabela Não Desonerada\",VLOOKUP($C38,#REF!,13,FALSE),VLOOKUP($C38,#REF!,13,FALSE))","v":{"$error":"#REF!"}},{"$error":"#REF!"},{"$f":"IF(#REF!=\"Tabela Não Desonerada\",VLOOKUP($C38,#REF!,14,FALSE),VLOOKUP($C38,#REF!,14,FALSE))","v":{"$error":"#REF!"}},{"$error":"#REF!"},{"$f":"IF(#REF!=\"Tabela Não Desonerada\",VLOOKUP($C38,#REF!,15,FALSE),VLOOKUP($C38,#REF!,15,FALSE))","v":{"$error":"#REF!"}},{"$error":"#REF!"}]
[1,{"$f":"'Orçamento-TCE'!B39","v":28},{"$f":"'Orçamento-TCE'!C39","v":"5.7"},{"$f":"'Orçamento-TCE'!G39","v":"EA12"},{"$f":"'Orçamento-TCE'!H39","v":5},{"$f":"'Orçamento-TCE'!I39","v":"UN"},{"$f":"Orçamento!H41","v":10576.89},{"$f":"Orçamento!I41","v":52884.45},{"$f":"Orçamento!G41","v":0.13730000000000001},1.1122000000000001,null,7403.8229999999994,3173.067,{"$error":"#REF!"},{"$f":"IF(#REF!=\"Tabela Não Desonerada\",VLOOKUP($C39,#REF!,13,FALSE),VLOOKUP($C39,#REF!,13,FALSE))","v":{"$error":"#REF!"}},{"$error":"#REF!"},{"$f":"IF(#REF!=\"Tabela Não Desonerada\",VLOOKUP($C39,#REF!,14,FALSE),VLOOKUP($C39,#REF!,14,FALSE))","v":{"$error":"#REF!"}},{"$error":"#REF!"},{"$f":"IF(#REF!=\"Tabela Não Desonerada\",VLOOKUP($C39,#REF!,15,FALSE),VLOOKUP($C39,#REF!,15,FALSE))","v":{"$error":"#REF!"}},{"$error":"#REF!"}]
[1,{"$f":"'Orçamento-TCE'!B40","v":29},{"$f":"'Orçamento-TCE'!C40","v":"5.8"},{"$f":"'Orçamento-TCE'!G40","v":"EA13"},{"$f":"'Orçamento-TCE'!H40","v":2},{"$f":"'Orçamento-TCE'!I40","v":"UN"},{"$f":"Orçamento!H42","v":5629.64},{"$f":"Orçamento!I42","v":11259.28},{"$f":"Orçamento!G42","v":0.13730000000000001},1.1122000000000001,null,3940.748,1688.8920000000003,{"$error":"#REF!"},{"$f":"IF(#REF!=\"Tabela Não Desonerada\",VLOOKUP($C40,#REF!,13,FALSE),VLOOKUP($C40,#REF!,13,FALSE))","v":{"$error":"#REF!"}},{"$error":"#REF!"},{"$f":"IF(#REF!=\"Tabela Não Desonerada\",VLOOKUP($C40,#REF!,14,FALSE),VLOOKUP($C40,#REF!,14,FALSE))","v":{"$error":"#REF!"}},{"$error":"#REF!"},{"$f":"IF(#REF!=\"Tabela Não Desonerada\",VLOOKUP($C40,#REF!,15,FALSE),VLOOKUP($C40,#REF!,15,FALSE))","v":{"$error":"#REF!"}},{"$error":"#REF!"}]
[1,{"$f":"'Orçamento-TCE'!B41","v":30},{"$f":"'Orçamento-TCE'!C41","v":"5.9"},{"$f":"'Orçamento-TCE'!G41","v":"EA15"},{"$f":"'Orçamento-TCE'!H41","v":7},{"$f":"'Orçamento-TCE'!I41","v":"UN"},{"$f":"Orçamento!H43","v":5192.62},{"$f":"Orçamento!I43","v":36348.339999999997},{"$f":"Orçamento!G43","v":0.13730000000000001},1.1122000000000001,null,3634.8339999999998,1557.7860000000001,{"$error":"#REF!"},{"$f":"IF(#REF!=\"Tabela Não Desonerada\",VLOOKUP($C41,#REF!,13,FALSE),VLOOKUP($C41,#REF!,13,FALSE))","v":{"$error":"#REF!"}},{"$error":"#REF!"},{"$f":"IF(#REF!=\"Tabela Não Desonerada\",VLOOKUP($C41,#REF!,14,FALSE),VLOOKUP($C41,#REF!,14,FALSE))","v":{"$error":"#REF!"}},{"$error":"#REF!"},{"$f":"IF(#REF!=\"Tabela Não Desonerada\",VLOOKUP($C41,#REF!,15,FALSE),VLOOKUP($C41,#REF!,15,FALSE))","v":{"$error":"#REF!"}},{"$error":"#REF!"}]
[1,{"$f":"'Orçamento-TCE'!B42","v":31},{"$f":"'Orçamento-TCE'!C42","v":"5.10"},{"$f":"'Orçamento-TCE'!G42","v":"EA16"},{"$f":"'Orçamento-TCE'!H42","v":1},{"$f":"'Orçamento-TCE'!I42","v":"UN"},{"$f":"Orçamento!H44","v":15051.03},{"$f":"Orçamento!I44","v":15051.03},{"$f":"Orçamento!G44","v":0.13730000000000001},1.1122000000000001,null,10535.721,4515.3090000000011,{"$error":"#REF!"},{"$f":"IF(#REF!=\"Tabela Não Desonerada\",VLOOKUP($C42,#REF!,13,FALSE),VLOOKUP($C42,#REF!,13,FALSE))","v":{"$error":"#REF!"}},{"$error":"#REF!"},{"$f":"IF(#REF!=\"Tabela Não Desonerada\",VLOOKUP($C42,#REF!,14,FALSE),VLOOKUP($C42,#REF!,14,FALSE))","v":{"$error":"#REF!"}},{"$error":"#REF!"},{"$f":"IF(#REF!=\"Tabela Não Desonerada\",VLOOKUP($C42,#REF!,15,FALSE),VLOOKUP($C42,#REF!,15,FALSE))","v":{"$error":"#REF!"}},{"$error":"#REF!"}]
[1,{"$f":"'Orçamento-TCE'!B43","v":32},{"$f":"'Orçamento-TCE'!C43","v":"5.11"},{"$f":"'Orçamento-TCE'!G43","v":"EA18   "},{"$f":"'Orçamento-TCE'!H43","v":1},{"$f":"'Orçamento-TCE'!I43","v":"UN"},{"$f":"Orçamento!H45","v":23655.84},{"$f":"Orçamento!I45","v":23655.84},{"$f":"Orçamento!G45","v":0.13730000000000001},1.1122000000000001,null,16559.088,7096.7520000000004,{"$error":"#REF!"},{"$f":"IF(#REF!=\"Tabela Não Desonerada\",VLOOKUP($C43,#REF!,13,FALSE),VLOOKUP($C43,#REF!,13,FALSE))","v":{"$error":"#REF!"}},{"$error":"#REF!"},{"$f":"IF(#REF!=\"Tabela Não Desonerada\",VLOOKUP($C43,#REF!,14,FALSE),VLOOKUP($C43,#REF!,14,FALSE))","v":{"$error":"#REF!"}},{"$error":"#REF!"},{"$f":"IF(#REF!=\"Tabela Não Desonerada\",VLOOKUP($C43,#REF!,15,FALSE),VLOOKUP($C43,#REF!,15,FALSE))","v":{"$error":"#REF!"}},{"$error":"#REF!"}]
[1,{"$f":"'Orçamento-TCE'!B44","v":33},{"$f":"'Orçamento-TCE'!C44","v":"5.12"},{"$f":"'Orçamento-TCE'!G44","v":"PM01 - 1 FOLHA DE ABRIR 0,70 X 1,40 M"},{"$f":"'Orçamento-TCE'!H44","v":3},{"$f":"'Orçamento-TCE'!I44","v":"UN"},{"$f":"Orçamento!H46","v":1170},{"$f":"Orçamento!I46","v":3510},{"$f":"Orçamento!G46","v":0.22159999999999999},1.1122000000000001,null,819,351,{"$error":"#REF!"},{"$f":"IF(#REF!=\"Tabela Não Desonerada\",VLOOKUP($C44,#REF!,13,FALSE),VLOOKUP($C44,#REF!,13,FALSE))","v":{"$error":"#REF!"}},{"$error":"#REF!"},{"$f":"IF(#REF!=\"Tabela Não Desonerada\",VLOOKUP($C44,#REF!,14,FALSE),VLOOKUP($C44,#REF!,14,FALSE))","v":{"$error":"#REF!"}},{"$error":"#REF!"},{"$f":"IF(#REF!=\"Tabela Não Desonerada\",VLOOKUP($C44,#REF!,15,FALSE),VLOOKUP($C44,#REF!,15,FALSE))","v":{"$error":"#REF!"}},{"$error":"#REF!"}]
[1,{"$f":"'Orçamento-TCE'!B45","v":34},{"$f":"'Orçamento-TCE'!C45","v":"5.13"},{"$f":"'Orçamento-TCE'!G45","v":"KIT DE PORTA DE MADEIRA FRISADA, SEMI-OCA (LEVE OU MÉDIA), PADRÃO MÉDIO, 60X210CM, ESPESSURA DE 3,5CM, ITENS INCLUSOS: DOBRADIÇAS, MONTAGEM E INSTALAÇÃO DE BATENTE, FECHADURA COM EXECUÇÃO DO FURO - FORNECIMENTO E INSTALAÇÃO. AF_12/2019"},{"$f":"'Orçamento-TCE'!H45","v":4},{"$f":"'Orçamento-TCE'!I45","v":"UN"},{"$f":"Orçamento!H47","v":1306.0999999999999},{"$f":"Orçamento!I47","v":5224.3999999999996},{"$f":"Orçamento!G47","v":0.22159999999999999},1.1122000000000001,null,914.26999999999987,391.83000000000004,{"$error":"#REF!"},{"$f":"IF(#REF!=\"Tabela Não Desonerada\",VLOOKUP($C45,#REF!,13,FALSE),VLOOKUP($C45,#REF!,13,FALSE))","v":{"$error":"#REF!"}},{"$error":"#REF!"},{"$f":"IF(#REF!=\"Tabela Não Desonerada\",VLOOKUP($C45,#REF!,14,FALSE),VLOOKUP($C45,#REF!,14,FALSE))","v":{"$error":"#REF!"}},{"$error":"#REF!"},{"$f":"IF(#REF!=\"Tabela Não Desonerada\",VLOOKUP($C45,#REF!,15,FALSE),VLOOKUP($C45,#REF!,15,FALSE))","v":{"$error":"#REF!"}},{"$error":"#REF!"}]
[1,{"$f":"'Orçamento-TCE'!B46","v":35},{"$f":"'Orçamento-TCE'!C46","v":"5.14"},{"$f":"'Orçamento-TCE'!G46","v":"KIT DE PORTA DE MADEIRA FRISADA, SEMI-OCA (LEVE OU MÉDIA), PADRÃO MÉDIO, 80 X 210CM, ESPESSURA DE 3,5CM,ITENS INCLUSOS: DOBRADIÇAS, MONTAGEM E INSTALAÇÃO DE BATENTE, FECHADURA COM EXECUÇÃO DO FURO - FORNECIMENTO E INSTALAÇÃO. AF_12/2019"},{"$f":"'Orçamento-TCE'!H46","v":18},{"$f":"'Orçamento-TCE'!I46","v":"UN"},{"$f":"Orçamento!H48","v":1413.37},{"$f":"Orçamento!I48","v":25440.66},{"$f":"Orçamento!G48","v":0.22159999999999999},1.1122000000000001,null,989.35899999999981,424.01100000000008,{"$error":"#REF!"},{"$f":"IF(#REF!=\"Tabela Não Desonerada\",VLOOKUP($C46,#REF!,13,FALSE),VLOOKUP($C46,#REF!,13,FALSE))","v":{"$error":"#REF!"}},{"$error":"#REF!"},{"$f":"IF(#REF!=\"Tabela Não Desonerada\",VLOOKUP($C46,#REF!,14,FALSE),VLOOKUP($C46,#REF!,14,FALSE))","v":{"$error":"#REF!"}},{"$error":"#REF!"},{"$f":"IF(#REF!=\"Tabela Não Desonerada\",VLOOKUP($C46,#REF!,15,FALSE),VLOOKUP($C46,#REF!,15,FALSE))","v":{"$error":"#REF!"}},{"$error":"#REF!"}]
[1,{"$f":"'Orçamento-TCE'!B47","v":36},{"$f":"'Orçamento-TCE'!C47","v":"5.15"},{"$f":"'Orçamento-TCE'!G47","v":"PM04 - 1 FOLHA DE ABRIR 1,00x2,10 M"},{"$f":"'Orçamento-TCE'!H47","v":11},{"$f":"'Orçamento-TCE'!I47","v":"UN"},{"$f":"Orçamento!H49","v":1421.01},{"$f":"Orçamento!I49","v":15631.11},{"$f":"Orçamento!G49","v":0.22159999999999999},1.1122000000000001,null,994.70699999999988,426.30300000000011,{"$error":"#REF!"},{"$f":"IF(#REF!=\"Tabela Não Desonerada\",VLOOKUP($C47,#REF!,13,FALSE),VLOOKUP($C47,#REF!,13,FALSE))","v":{"$error":"#REF!"}},{"$error":"#REF!"},{"$f":"IF(#REF!=\"Tabela Não Desonerada\",VLOOKUP($C47,#REF!,14,FALSE),VLOOKUP($C47,#REF!,14,FALSE))","v":{"$error":"#REF!"}},{"$error":"#REF!"},{"$f":"IF(#REF!=\"Tabela Não Desonerada\",VLOOKUP($C47,#REF!,15,FALSE),VLOOKUP($C47,#REF!,15,FALSE))","v":{"$error":"#REF!"}},{"$error":"#REF!"}]
[1,{"$f":"'Orçamento-TCE'!B48","v":37},{"$f":"'Orçamento-TCE'!C48","v":"5.16"},{"$f":"'Orçamento-TCE'!G48","v":"PM06 - 2 FOLHAS DE ABRIR 1,60 X 2,10 M"},{"$f":"'Orçamento-TCE'!H48","v":2},{"$f":"'Orçamento-TCE'!I48","v":"UN"},{"$f":"Orçamento!H50","v":1678.48},{"$f":"Orçamento!I50","v":3356.96},{"$f":"Orçamento!G50","v":0.22159999999999999},1.1122000000000001,null,1174.9359999999999,503.5440000000001,{"$error":"#REF!"},{"$f":"IF(#REF!=\"Tabela Não Desonerada\",VLOOKUP($C48,#REF!,13,FALSE),VLOOKUP($C48,#REF!,13,FALSE))","v":{"$error":"#REF!"}},{"$error":"#REF!"},{"$f":"IF(#REF!=\"Tabela Não Desonerada\",VLOOKUP($C48,#REF!,14,FALSE),VLOOKUP($C48,#REF!,14,FALSE))","v":{"$error":"#REF!"}},{"$error":"#REF!"},{"$f":"IF(#REF!=\"Tabela Não Desonerada\",VLOOKUP($C48,#REF!,15,FALSE),VLOOKUP($C48,#REF!,15,FALSE))","v":{"$error":"#REF!"}},{"$error":"#REF!"}]
[1,{"$f":"'Orçamento-TCE'!B49","v":38},{"$f":"'Orçamento-TCE'!C49","v":"5.17"},{"$f":"'Orçamento-TCE'!G49","v":"PM07 - 2 FOLHAS DE ABRIR 1,80 X 2,10 M"},{"$f":"'Orçamento-TCE'!H49","v":2},{"$f":"'Orçamento-TCE'!I49","v":"UN"},{"$f":"Orçamento!H51","v":1875.91},{"$f":"Orçamento!I51","v":3751.82},{"$f":"Orçamento!G51","v":0.22159999999999999},1.1122000000000001,null,1313.1369999999999,562.77300000000014,{"$error":"#REF!"},{"$f":"IF(#REF!=\"Tabela Não Desonerada\",VLOOKUP($C49,#REF!,13,FALSE),VLOOKUP($C49,#REF!,13,FALSE))","v":{"$error":"#REF!"}},{"$error":"#REF!"},{"$f":"IF(#REF!=\"Tabela Não Desonerada\",VLOOKUP($C49,#REF!,14,FALSE),VLOOKUP($C49,#REF!,14,FALSE))","v":{"$error":"#REF!"}},{"$error":"#REF!"},{"$f":"IF(#REF!=\"Tabela Não Desonerada\",VLOOKUP($C49,#REF!,15,FALSE),VLOOKUP($C49,#REF!,15,FALSE))","v":{"$error":"#REF!"}},{"$error":"#REF!"}]
[1,{"$f":"'Orçamento-TCE'!B50","v":39},{"$f":"'Orçamento-TCE'!C50","v":"5.18"},{"$f":"'Orçamento-TCE'!G50","v":"PM08 - 2 FOHAS DE ABRIR 2,00 X 2,10 M"},{"$f":"'Orçamento-TCE'!H50","v":1},{"$f":"'Orçamento-TCE'!I50","v":"UN"},{"$f":"Orçamento!H52","v":1998.31},{"$f":"Orçamento!I52","v":1998.31},{"$f":"Orçamento!G52","v":0.22159999999999999},1.1122000000000001,null,1398.8169999999998,599.49300000000017,{"$error":"#REF!"},{"$f":"IF(#REF!=\"Tabela Não Desonerada\",VLOOKUP($C50,#REF!,13,FALSE),VLOOKUP($C50,#REF!,13,FALSE))","v":{"$error":"#REF!"}},{"$error":"#REF!"},{"$f":"IF(#REF!=\"Tabela Não Desonerada\",VLOOKUP($C50,#REF!,14,FALSE),VLOOKUP($C50,#REF!,14,FALSE))","v":{"$error":"#REF!"}},{"$error":"#REF!"},{"$f":"IF(#REF!=\"Tabela Não Desonerada\",VLOOKUP($C50,#REF!,15,FALSE),VLOOKUP($C50,#REF!,15,FALSE))","v":{"$error":"#REF!"}},{"$error":"#REF!"}]
[1,{"$f":"'Orçamento-TCE'!B51","v":40},{"$f":"'Orçamento-TCE'!C51","v":"6.1"},{"$f":"'Orçamento-TCE'!G51","v":"IMPERMEABILIZAÇÃO DE SUPERFÍCIE COM EMULSÃO ASFÁLTICA, DUAS CAMADAS, COM APLICAÇÃO DE VÉU DE POLIÉSTER"},{"$f":"'Orçamento-TCE'!H51","v":40.36},{"$f":"'Orçamento-TCE'!I51","v":"M2"},{"$f":"Orçamento!H54","v":61.54},{"$f":"Orçamento!I54","v":2483.75},{"$f":"Orçamento!G54","v":0.22159999999999999},1.1122000000000001,null,43.077999999999996,18.462000000000003,{"$error":"#REF!"},{"$f":"IF(#REF!=\"Tabela Não Desonerada\",VLOOKUP($C51,#REF!,13,FALSE),VLOOKUP($C51,#REF!,13,FALSE))","v":{"$error":"#REF!"}},{"$error":"#REF!"},{"$f":"IF(#REF!=\"Tabela Não Desonerada\",VLOOKUP($C51,#REF!,14,FALSE),VLOOKUP($C51,#REF!,14,FALSE))","v":{"$error":"#REF!"}},{"$error":"#REF!"},{"$f":"IF(#REF!=\"Tabela Não Desonerada\",VLOOKUP($C51,#REF!,15,FALSE),VLOOKUP($C51,#REF!,15,FALSE))","v":{"$error":"#REF!"}},{"$error":"#REF!"}]
[1,{"$f":"'Orçamento-TCE'!B52","v":41},{"$f":"'Orçamento-TCE'!C52","v":"6.2"},{"$f":"'Orçamento-TCE'!G52","v":"PISO CIMENTADO, TRAÇO 1:3 (CIMENTO E AREIA), ACABAMENTO LISO, ESPESSURA 4,0 CM, PREPARO MECÂNICO DA ARGAMASSA. AF_09/2020"},{"$f":"'Orçamento-TCE'!H52","v":40.36},{"$f":"'Orçamento-TCE'!I52","v":"M2"},{"$f":"Orçamento!H55","v":57.34},{"$f":"Orçamento!I55","v":2314.2399999999998},{"$f":"Orçamento!G55","v":0.22159999999999999},1.1122000000000001,null,40.137999999999998,17.202000000000005,{"$error":"#REF!"},{"$f":"IF(#REF!=\"Tabela Não Desonerada\",VLOOKUP($C52,#REF!,13,FALSE),VLOOKUP($C52,#REF!,13,FALSE))","v":{"$error":"#REF!"}},{"$error":"#REF!"},{"$f":"IF(#REF!=\"Tabela Não Desonerada\",VLOOKUP($C52,#REF!,14,FALSE),VLOOKUP($C52,#REF!,14,FALSE))","v":{"$error":"#REF!"}},{"$error":"#REF!"},{"$f":"IF(#REF!=\"Tabela Não Desonerada\",VLOOKUP($C52,#REF!,15,FALSE),VLOOKUP($C52,#REF!,15,FALSE))","v":{"$error":"#REF!"}},{"$error":"#REF!"}]
[1,{"$f":"'Orçamento-TCE'!B53","v":42},{"$f":"'Orçamento-TCE'!C53","v":"6.3"},{"$f":"'Orçamento-TCE'!G53","v":"PROTEÇÃO MECÂNICA DE SUPERFÍCIE HORIZONTAL COM ARGAMASSA DE CIMENTO E AREIA, TRAÇO 1:3, E= 4CM. AF_06/2018"},{"$f":"'Orçamento-TCE'!H53","v":40.36},{"$f":"'Orçamento-TCE'!I53","v":"M2"},{"$f":"Orçamento!H56","v":69.2},{"$f":"Orçamento!I56","v":2792.91},{"$f":"Orçamento!G56","v":0.22159999999999999},1.1122000000000001,null,48.44,20.760000000000005,{"$error":"#REF!"},{"$f":"IF(#REF!=\"Tabela Não Desonerada\",VLOOKUP($C53,#REF!,13,FALSE),VLOOKUP($C53,#REF!,13,FALSE))","v":{"$error":"#REF!"}},{"$error":"#REF!"},{"$f":"IF(#REF!=\"Tabela Não Desonerada\",VLOOKUP($C53,#REF!,14,FALSE),VLOOKUP($C53,#REF!,14,FALSE))","v":{"$error":"#REF!"}},{"$error":"#REF!"},{"$f":"IF(#REF!=\"Tabela Não Desonerada\",VLOOKUP($C53,#REF!,15,FALSE),VLOOKUP($C53,#REF!,15,FALSE))","v":{"$error":"#REF!"}},{"$error":"#REF!"}]
[1,{"$f":"'Orçamento-TCE'!B54","v":43},{"$f":"'Orçamento-TCE'!C54","v":"6.4"},{"$f":"'Orçamento-TCE'!G54","v":"BASE DE DISTRIUBUIÇÃO DE CARGA SOBRE CONTRAPISO EXISTENTE, E=2CM"},{"$f":"'Orçamento-TCE'!H54","v":40.36},{"$f":"'Orçamento-TCE'!I54","v":"M2"},{"$f":"Orçamento!H57","v":147.22999999999999},{"$f":"Orçamento!I57","v":5942.2},{"$f":"Orçamento!G57","v":0.22159999999999999},1.1122000000000001,null,103.06099999999999,44.168999999999997,{"$error":"#REF!"},{"$f":"IF(#REF!=\"Tabela Não Desonerada\",VLOOKUP($C54,#REF!,13,FALSE),VLOOKUP($C54,#REF!,13,FALSE))","v":{"$error":"#REF!"}},{"$error":"#REF!"},{"$f":"IF(#REF!=\"Tabela Não Desonerada\",VLOOKUP($C54,#REF!,14,FALSE),VLOOKUP($C54,#REF!,14,FALSE))","v":{"$error":"#REF!"}},{"$error":"#REF!"},{"$f":"IF(#REF!=\"Tabela Não Desonerada\",VLOOKUP($C54,#REF!,15,FALSE),VLOOKUP($C54,#REF!,15,FALSE))","v":{"$error":"#REF!"}},{"$error":"#REF!"}]
[1,{"$f":"'Orçamento-TCE'!B55","v":44},{"$f":"'Orçamento-TCE'!C55","v":"6.5"},{"$f":"'Orçamento-TCE'!G55","v":"TRATAMENTO DE ESTRUTURAS DE CONCRETO ARMADO"},{"$f":"'Orçamento-TCE'!H55","v":24.95},{"$f":"'Orçamento-TCE'!I55","v":"M2"},{"$f":"Orçamento!H58","v":498.57},{"$f":"Orçamento!I58","v":12439.32},{"$f":"Orçamento!G58","v":0.22159999999999999},1.1122000000000001,null,348.99899999999997,149.57100000000003,{"$error":"#REF!"},{"$f":"IF(#REF!=\"Tabela Não Desonerada\",VLOOKUP($C55,#REF!,13,FALSE),VLOOKUP($C55,#REF!,13,FALSE))","v":{"$error":"#REF!"}},{"$error":"#REF!"},{"$f":"IF(#REF!=\"Tabela Não Desonerada\",VLOOKUP($C55,#REF!,14,FALSE),VLOOKUP($C55,#REF!,14,FALSE))","v":{"$error":"#REF!"}},{"$error":"#REF!"},{"$f":"IF(#REF!=\"Tabela Não Desonerada\",VLOOKUP($C55,#REF!,15,FALSE),VLOOKUP($C55,#REF!,15,FALSE))","v":{"$error":"#REF!"}},{"$error":"#REF!"}]
[1,{"$f":"'Orçamento-TCE'!B56","v":45},{"$f":"'Orçamento-TCE'!C56","v":"7.1"},{"$f":"'Orçamento-TCE'!G56","v":"CHAPISCO APLICADO EM ALVENARIAS E ESTRUTURAS DE CONCRETO INTERNAS, COM COLHER DE PEDREIRO. ARGAMASSA TRAÇO 1:3 COM PREPARO MANUAL. AF_06/2014"},{"$f":"'Orçamento-TCE'!H56","v":616.20000000000005},{"$f":"'Orçamento-TCE'!I56","v":"M2"},{"$f":"Orçamento!H60","v":5.0199999999999996},{"$f":"Orçamento!I60","v":3093.32},{"$f":"Orçamento!G60","v":0.22159999999999999},1.1122000000000001,null,3.5139999999999993,1.5060000000000002,{"$error":"#REF!"},{"$f":"IF(#REF!=\"Tabela Não Desonerada\",VLOOKUP($C56,#REF!,13,FALSE),VLOOKUP($C56,#REF!,13,FALSE))","v":{"$error":"#REF!"}},{"$error":"#REF!"},{"$f":"IF(#REF!=\"Tabela Não Desonerada\",VLOOKUP($C56,#REF!,14,FALSE),VLOOKUP($C56,#REF!,14,FALSE))","v":{"$error":"#REF!"}},{"$error":"#REF!"},{"$f":"IF(#REF!=\"Tabela Não Desonerada\",VLOOKUP($C56,#REF!,15,FALSE),VLOOKUP($C56,#REF!,15,FALSE))","v":{"$error":"#REF!"}},{"$error":"#REF!"}]
[1,{"$f":"'Orçamento-TCE'!B57","v":46},{"$f":"'Orçamento-TCE'!C57","v":"7.2"},{"$f":"'Orçamento-TCE'!G57","v":"MASSA ÚNICA, PARA RECEBIMENTO DE PINTURA EM ARGAMASSA TRAÇO 1:2:8, PREPARO MECÂNICO COM BETONEIRA 400L, APLICADA MANUALMENTE EM FACES INTERNAS DE PAREDES, ESPESSURA DE 20MM, COM EXECUÇÃO DE TALISCAS. AF_06/2014"},{"$f":"'Orçamento-TCE'!H57","v":616.20000000000005},{"$f":"'Orçamento-TCE'!I57","v":"M2"},{"$f":"Orçamento!H61","v":37.26},{"$f":"Orçamento!I61","v":22959.61},{"$f":"Orçamento!G61","v":0.22159999999999999},1.1122000000000001,null,26.081999999999997,11.178000000000001,{"$error":"#REF!"},{"$f":"IF(#REF!=\"Tabela Não Desonerada\",VLOOKUP($C57,#REF!,13,FALSE),VLOOKUP($C57,#REF!,13,FALSE))","v":{"$error":"#REF!"}},{"$error":"#REF!"},{"$f":"IF(#REF!=\"Tabela Não Desonerada\",VLOOKUP($C57,#REF!,14,FALSE),VLOOKUP($C57,#REF!,14,FALSE))","v":{"$error":"#REF!"}},{"$error":"#REF!"},{"$f":"IF(#REF!=\"Tabela Não Desonerada\",VLOOKUP($C57,#REF!,15,FALSE),VLOOKUP($C57,#REF!,15,FALSE))","v":{"$error":"#REF!"}},{"$error":"#REF!"}]
[1,{"$f":"'Orçamento-TCE'!B58","v":47},{"$f":"'Orçamento-TCE'!C58","v":"7.3"},{"$f":"'Orçamento-TCE'!G58","v":"REVESTIMENTO CERÂMICO PARA PAREDES INTERNAS COM PLACAS TIPO ESMALTADA EXTRA DE DIMENSÕES 33X45CM APLICADAS EM AMBIENTES DE ÁREA MENOR QUE 5M2 A MEIA ALTURA DAS PAREDES. AF_06/2014"},{"$f":"'Orçamento-TCE'!H58","v":757.83},{"$f":"'Orçamento-TCE'!I58","v":"M2"},{"$f":"Orçamento!H62","v":84.08},{"$f":"Orçamento!I62","v":63718.35},{"$f":"Orçamento!G62","v":0.22159999999999999},1.1122000000000001,null,58.855999999999995,25.224000000000004,{"$error":"#REF!"},{"$f":"IF(#REF!=\"Tabela Não Desonerada\",VLOOKUP($C58,#REF!,13,FALSE),VLOOKUP($C58,#REF!,13,FALSE))","v":{"$error":"#REF!"}},{"$error":"#REF!"},{"$f":"IF(#REF!=\"Tabela Não Desonerada\",VLOOKUP($C58,#REF!,14,FALSE),VLOOKUP($C58,#REF!,14,FALSE))","v":{"$error":"#REF!"}},{"$error":"#REF!"},{"$f":"IF(#REF!=\"Tabela Não Desonerada\",VLOOKUP($C58,#REF!,15,FALSE),VLOOKUP($C58,#REF!,15,FALSE))","v":{"$error":"#REF!"}},{"$error":"#REF!"}]
[1,{"$f":"'Orçamento-TCE'!B59","v":48},{"$f":"'Orçamento-TCE'!C59","v":"7.4"},{"$f":"'Orçamento-TCE'!G59","v":"FORRO DE FIBRA MINERAL EM PLACAS DE 625X625MM, E=15MM, BORDA RETA, COM PINTURA ANTIMOFO, APOIADO EM PERFIL DE AÇO GALVANIZADO COM 24MM DE BASE - INSTALADO"},{"$f":"'Orçamento-TCE'!H59","v":846.46},{"$f":"'Orçamento-TCE'!I59","v":"M2"},{"$f":"Orçamento!H63","v":131.99},{"$f":"Orçamento!I63","v":111724.26},{"$f":"Orçamento!G63","v":0.22159999999999999},1.1122000000000001,null,92.393000000000001,39.597000000000008,{"$error":"#REF!"},{"$f":"IF(#REF!=\"Tabela Não Desonerada\",VLOOKUP($C59,#REF!,13,FALSE),VLOOKUP($C59,#REF!,13,FALSE))","v":{"$error":"#REF!"}},{"$error":"#REF!"},{"$f":"IF(#REF!=\"Tabela Não Desonerada\",VLOOKUP($C59,#REF!,14,FALSE),VLOOKUP($C59,#REF!,14,FALSE))","v":{"$error":"#REF!"}},{"$error":"#REF!"},{"$f":"IF(#REF!=\"Tabela Não Desonerada\",VLOOKUP($C59,#REF!,15,FALSE),VLOOKUP($C59,#REF!,15,FALSE))","v":{"$error":"#REF!"}},{"$error":"#REF!"}]
[1,{"$f":"'Orçamento-TCE'!B60","v":49},{"$f":"'Orçamento-TCE'!C60","v":"7.5"},{"$f":"'Orçamento-TCE'!G60","v":"LIXAMENTO MANUAL EM SUPERFÍCIES METÁLICAS EM OBRA. AF_01/2020"},{"$f":"'Orçamento-TCE'!H60","v":172.56},{"$f":"'Orçamento-TCE'!I60","v":"M2"},{"$f":"Orçamento!H64","v":10.32},{"$f":"Orçamento!I64","v":1780.82},{"$f":"Orçamento!G64","v":0.22159999999999999},1.1122000000000001,null,7.2239999999999993,3.096000000000001,{"$error":"#REF!"},{"$f":"IF(#REF!=\"Tabela Não Desonerada\",VLOOKUP($C60,#REF!,13,FALSE),VLOOKUP($C60,#REF!,13,FALSE))","v":{"$error":"#REF!"}},{"$error":"#REF!"},{"$f":"IF(#REF!=\"Tabela Não Desonerada\",VLOOKUP($C60,#REF!,14,FALSE),VLOOKUP($C60,#REF!,14,FALSE))","v":{"$error":"#REF!"}},{"$error":"#REF!"},{"$f":"IF(#REF!=\"Tabela Não Desonerada\",VLOOKUP($C60,#REF!,15,FALSE),VLOOKUP($C60,#REF!,15,FALSE))","v":{"$error":"#REF!"}},{"$error":"#REF!"}]
[1,{"$f":"'Orçamento-TCE'!B61","v":50},{"$f":"'Orçamento-TCE'!C61","v":"7.6"},{"$f":"'Orçamento-TCE'!G61","v":"PINTURA COM TINTA ALQUÍDICA DE FUNDO (TIPO ZARCÃO) APLICADA A ROLO OU PINCEL SOBRE SUPERFÍCIES METÁLICAS (EXCETO PERFIL) EXECUTADO EM OBRA (POR DEMÃO). AF_01/2020"},{"$f":"'Orçamento-TCE'!H61","v":172.56},{"$f":"'Orçamento-TCE'!I61","v":"M2"},{"$f":"Orçamento!H65","v":25.07},{"$f":"Orçamento!I65","v":4326.08},{"$f":"Orçamento!G65","v":0.22159999999999999},1.1122000000000001,null,17.548999999999999,7.5210000000000008,{"$error":"#REF!"},{"$f":"IF(#REF!=\"Tabela Não Desonerada\",VLOOKUP($C61,#REF!,13,FALSE),VLOOKUP($C61,#REF!,13,FALSE))","v":{"$error":"#REF!"}},{"$error":"#REF!"},{"$f":"IF(#REF!=\"Tabela Não Desonerada\",VLOOKUP($C61,#REF!,14,FALSE),VLOOKUP($C61,#REF!,14,FALSE))","v":{"$error":"#REF!"}},{"$error":"#REF!"},{"$f":"IF(#REF!=\"Tabela Não Desonerada\",VLOOKUP($C61,#REF!,15,FALSE),VLOOKUP($C61,#REF!,15,FALSE))","v":{"$error":"#REF!"}},{"$error":"#REF!"}]
[1,{"$f":"'Orçamento-TCE'!B62","v":51},{"$f":"'Orçamento-TCE'!C62","v":"7.7"},{"$f":"'Orçamento-TCE'!G62","v":"PINTURA COM TINTA ACRÍLICA DE FUNDO APLICADA A ROLO OU PINCEL SOBRE SUPERFÍCIES METÁLICAS (EXCETO PERFIL) EXECUTADO EM OBRA (POR DEMÃO). AF_01/2020"},{"$f":"'Orçamento-TCE'!H62","v":172.56},{"$f":"'Orçamento-TCE'!I62","v":"M2"},{"$f":"Orçamento!H66","v":15.6},{"$f":"Orçamento!I66","v":2691.94},{"$f":"Orçamento!G66","v":0.22159999999999999},1.1122000000000001,null,10.92,4.68,{"$error":"#REF!"},{"$f":"IF(#REF!=\"Tabela Não Desonerada\",VLOOKUP($C62,#REF!,13,FALSE),VLOOKUP($C62,#REF!,13,FALSE))","v":{"$error":"#REF!"}},{"$error":"#REF!"},{"$f":"IF(#REF!=\"Tabela Não Desonerada\",VLOOKUP($C62,#REF!,14,FALSE),VLOOKUP($C62,#REF!,14,FALSE))","v":{"$error":"#REF!"}},{"$error":"#REF!"},{"$f":"IF(#REF!=\"Tabela Não Desonerada\",VLOOKUP($C62,#REF!,15,FALSE),VLOOKUP($C62,#REF!,15,FALSE))","v":{"$error":"#REF!"}},{"$error":"#REF!"}]
[1,{"$f":"'Orçamento-TCE'!B63","v":52},{"$f":"'Orçamento-TCE'!C63","v":"7.8"},{"$f":"'Orçamento-TCE'!G63","v":"PINTURA TINTA DE ACABAMENTO (PIGMENTADA) ESMALTE SINTÉTICO BRILHANTE EM MADEIRA, 2 DEMÃOS. AF_01/2021"},{"$f":"'Orçamento-TCE'!H63","v":242.55},{"$f":"'Orçamento-TCE'!I63","v":"M2"},{"$f":"Orçamento!H67","v":16.739999999999998},{"$f":"Orçamento!I67","v":4060.29},{"$f":"Orçamento!G67","v":0.22159999999999999},1.1122000000000001,null,11.717999999999998,5.0220000000000002,{"$error":"#REF!"},{"$f":"IF(#REF!=\"Tabela Não Desonerada\",VLOOKUP($C63,#REF!,13,FALSE),VLOOKUP($C63,#REF!,13,FALSE))","v":{"$error":"#REF!"}},{"$error":"#REF!"},{"$f":"IF(#REF!=\"Tabela Não Desonerada\",VLOOKUP($C63,#REF!,14,FALSE),VLOOKUP($C63,#REF!,14,FALSE))","v":{"$error":"#REF!"}},{"$error":"#REF!"},{"$f":"IF(#REF!=\"Tabela Não Desonerada\",VLOOKUP($C63,#REF!,15,FALSE),VLOOKUP($C63,#REF!,15,FALSE))","v":{"$error":"#REF!"}},{"$error":"#REF!"}]
[1,{"$f":"'Orçamento-TCE'!B64","v":53},{"$f":"'Orçamento-TCE'!C64","v":"7.9"},{"$f":"'Orçamento-TCE'!G64","v":"APLICAÇÃO DE FUNDO SELADOR ACRÍLICO EM PAREDES, UMA DEMÃO. AF_06/2014"},{"$f":"'Orçamento-TCE'!H64","v":214.93},{"$f":"'Orçamento-TCE'!I64","v":"M2"},{"$f":"Orçamento!H68","v":2.81},{"$f":"Orçamento!I68","v":603.95000000000005},{"$f":"Orçamento!G68","v":0.22159999999999999},1.1122000000000001,null,1.9669999999999999,0.84300000000000019,{"$error":"#REF!"},{"$f":"IF(#REF!=\"Tabela Não Desonerada\",VLOOKUP($C64,#REF!,13,FALSE),VLOOKUP($C64,#REF!,13,FALSE))","v":{"$error":"#REF!"}},{"$error":"#REF!"},{"$f":"IF(#REF!=\"Tabela Não Desonerada\",VLOOKUP($C64,#REF!,14,FALSE),VLOOKUP($C64,#REF!,14,FALSE))","v":{"$error":"#REF!"}},{"$error":"#REF!"},{"$f":"IF(#REF!=\"Tabela Não Desonerada\",VLOOKUP($C64,#REF!,15,FALSE),VLOOKUP($C64,#REF!,15,FALSE))","v":{"$error":"#REF!"}},{"$error":"#REF!"}]
[1,{"$f":"'Orçamento-TCE'!B65","v":54},{"$f":"'Orçamento-TCE'!C65","v":"7.10"},{"$f":"'Orçamento-TCE'!G65","v":"APLICAÇÃO MANUAL DE PINTURA COM TINTA LÁTEX ACRÍLICA EM PAREDES, DUAS DEMÃOS. AF_06/2014"},{"$f":"'Orçamento-TCE'!H65","v":1765.7},{"$f":"'Orçamento-TCE'!I65","v":"M2"},{"$f":"Orçamento!H69","v":18.07},{"$f":"Orçamento!I69","v":31906.2},{"$f":"Orçamento!G69","v":0.22159999999999999},1.1122000000000001,null,12.648999999999999,5.4210000000000012,{"$error":"#REF!"},{"$f":"IF(#REF!=\"Tabela Não Desonerada\",VLOOKUP($C65,#REF!,13,FALSE),VLOOKUP($C65,#REF!,13,FALSE))","v":{"$error":"#REF!"}},{"$error":"#REF!"},{"$f":"IF(#REF!=\"Tabela Não Desonerada\",VLOOKUP($C65,#REF!,14,FALSE),VLOOKUP($C65,#REF!,14,FALSE))","v":{"$error":"#REF!"}},{"$error":"#REF!"},{"$f":"IF(#REF!=\"Tabela Não Desonerada\",VLOOKUP($C65,#REF!,15,FALSE),VLOOKUP($C65,#REF!,15,FALSE))","v":{"$error":"#REF!"}},{"$error":"#REF!"}]
[1,{"$f":"'Orçamento-TCE'!B66","v":55},{"$f":"'Orçamento-TCE'!C66","v":"7.11"},{"$f":"'Orçamento-TCE'!G66","v":"APLICAÇÃO E LIXAMENTO DE MASSA LÁTEX EM PAREDES, UMA DEMÃO. AF_06/2014"},{"$f":"'Orçamento-TCE'!H66","v":384.46},{"$f":"'Orçamento-TCE'!I66","v":"M2"},{"$f":"Orçamento!H70","v":14.49},{"$f":"Orçamento!I70","v":5570.83},{"$f":"Orçamento!G70","v":0.22159999999999999},1.1122000000000001,null,10.142999999999999,4.3470000000000013,{"$error":"#REF!"},{"$f":"IF(#REF!=\"Tabela Não Desonerada\",VLOOKUP($C66,#REF!,13,FALSE),VLOOKUP($C66,#REF!,13,FALSE))","v":{"$error":"#REF!"}},{"$error":"#REF!"},{"$f":"IF(#REF!=\"Tabela Não Desonerada\",VLOOKUP($C66,#REF!,14,FALSE),VLOOKUP($C66,#REF!,14,FALSE))","v":{"$error":"#REF!"}},{"$error":"#REF!"},{"$f":"IF(#REF!=\"Tabela Não Desonerada\",VLOOKUP($C66,#REF!,15,FALSE),VLOOKUP($C66,#REF!,15,FALSE))","v":{"$error":"#REF!"}},{"$error":"#REF!"}]
[1,{"$f":"'Orçamento-TCE'!B67","v":56},{"$f":"'Orçamento-TCE'!C67","v":"8.1"},{"$f":"'Orçamento-TCE'!G67","v":"SAIBRO PARA ARGAMASSA (COLETADO NO COMÉRCIO)"},{"$f":"'Orçamento-TCE'!H67","v":107.19},{"$f":"'Orçamento-TCE'!I67","v":"M3"},{"$f":"Orçamento!H72","v":73.81},{"$f":"Orçamento!I72","v":7911.69},{"$f":"Orçamento!G72","v":0.22159999999999999},1.1122000000000001,null,51.667000000000002,22.143000000000001,{"$error":"#REF!"},{"$f":"IF(#REF!=\"Tabela Não Desonerada\",VLOOKUP($C67,#REF!,13,FALSE),VLOOKUP($C67,#REF!,13,FALSE))","v":{"$error":"#REF!"}},{"$error":"#REF!"},{"$f":"IF(#REF!=\"Tabela Não Desonerada\",VLOOKUP($C67,#REF!,14,FALSE),VLOOKUP($C67,#REF!,14,FALSE))","v":{"$error":"#REF!"}},{"$error":"#REF!"},{"$f":"IF(#REF!=\"Tabela Não Desonerada\",VLOOKUP($C67,#REF!,15,FALSE),VLOOKUP($C67,#REF!,15,FALSE))","v":{"$error":"#REF!"}},{"$error":"#REF!"}]
[1,{"$f":"'Orçamento-TCE'!B68","v":57},{"$f":"'Orçamento-TCE'!C68","v":"8.2"},{"$f":"'Orçamento-TCE'!G68","v":"CONTRAPISO EM ARGAMASSA TRAÇO 1:4 (CIMENTO E AREIA), PREPARO MECÂNICO COM BETONEIRA 400L, APLICADO EM ÁREAS SECAS SOBRE LAJE, ADERIDO, ESPESSURA 2CM. AF_06/2014"},{"$f":"'Orçamento-TCE'!H68","v":975.2},{"$f":"'Orçamento-TCE'!I68","v":"M2"},{"$f":"Orçamento!H73","v":33.18},{"$f":"Orçamento!I73","v":32357.14},{"$f":"Orçamento!G73","v":0.22159999999999999},1.1122000000000001,null,23.225999999999999,9.9540000000000006,{"$error":"#REF!"},{"$f":"IF(#REF!=\"Tabela Não Desonerada\",VLOOKUP($C68,#REF!,13,FALSE),VLOOKUP($C68,#REF!,13,FALSE))","v":{"$error":"#REF!"}},{"$error":"#REF!"},{"$f":"IF(#REF!=\"Tabela Não Desonerada\",VLOOKUP($C68,#REF!,14,FALSE),VLOOKUP($C68,#REF!,14,FALSE))","v":{"$error":"#REF!"}},{"$error":"#REF!"},{"$f":"IF(#REF!=\"Tabela Não Desonerada\",VLOOKUP($C68,#REF!,15,FALSE),VLOOKUP($C68,#REF!,15,FALSE))","v":{"$error":"#REF!"}},{"$error":"#REF!"}]
[1,{"$f":"'Orçamento-TCE'!B69","v":58},{"$f":"'Orçamento-TCE'!C69","v":"8.3"},{"$f":"'Orçamento-TCE'!G69","v":"CONTRAPISO DE CONCRETO ARMADO, E=6CM"},{"$f":"'Orçamento-TCE'!H69","v":214.38},{"$f":"'Orçamento-TCE'!I69","v":"M2"},{"$f":"Orçamento!H74","v":138.22},{"$f":"Orçamento!I74","v":29631.599999999999},{"$f":"Orçamento!G74","v":0.22159999999999999},1.1122000000000001,null,96.753999999999991,41.466000000000008,{"$error":"#REF!"},{"$f":"IF(#REF!=\"Tabela Não Desonerada\",VLOOKUP($C69,#REF!,13,FALSE),VLOOKUP($C69,#REF!,13,FALSE))","v":{"$error":"#REF!"}},{"$error":"#REF!"},{"$f":"IF(#REF!=\"Tabela Não Desonerada\",VLOOKUP($C69,#REF!,14,FALSE),VLOOKUP($C69,#REF!,14,FALSE))","v":{"$error":"#REF!"}},{"$error":"#REF!"},{"$f":"IF(#REF!=\"Tabela Não Desonerada\",VLOOKUP($C69,#REF!,15,FALSE),VLOOKUP($C69,#REF!,15,FALSE))","v":{"$error":"#REF!"}},{"$error":"#REF!"}]
[1,{"$f":"'Orçamento-TCE'!B70","v":59},{"$f":"'Orçamento-TCE'!C70","v":"8.4"},{"$f":"'Orçamento-TCE'!G70","v":"REVESTIMENTO CERÂMICO PARA PISO COM PLACAS TIPO PORCELANATO DE DIMENSÕES 60X60CM APLICADA EM AMBIENTES DE ÁREA ENTRE 5M2 E 10M2. AF_06/2014"},{"$f":"'Orçamento-TCE'!H70","v":451.99},{"$f":"'Orçamento-TCE'!I70","v":"M2"},{"$f":"Orçamento!H75","v":167.93},{"$f":"Orçamento!I75","v":75902.679999999993},{"$f":"Orçamento!G75","v":0.22159999999999999},1.1122000000000001,null,117.551,50.379000000000005,{"$error":"#REF!"},{"$f":"IF(#REF!=\"Tabela Não Desonerada\",VLOOKUP($C70,#REF!,13,FALSE),VLOOKUP($C70,#REF!,13,FALSE))","v":{"$error":"#REF!"}},{"$error":"#REF!"},{"$f":"IF(#REF!=\"Tabela Não Desonerada\",VLOOKUP($C70,#REF!,14,FALSE),VLOOKUP($C70,#REF!,14,FALSE))","v":{"$error":"#REF!"}},{"$error":"#REF!"},{"$f":"IF(#REF!=\"Tabela Não Desonerada\",VLOOKUP($C70,#REF!,15,FALSE),VLOOKUP($C70,#REF!,15,FALSE))","v":{"$error":"#REF!"}},{"$error":"#REF!"}]
[1,{"$f":"'Orçamento-TCE'!B71","v":60},{"$f":"'Orçamento-TCE'!C71","v":"8.5"},{"$f":"'Orçamento-TCE'!G71","v":"PISO DE PORCELANATO TÉCNICO 80X80CM - FORNECIMENTO E INSTALAÇÃO"},{"$f":"'Orçamento-TCE'!H71","v":487.82},{"$f":"'Orçamento-TCE'!I71","v":"M2"},{"$f":"Orçamento!H76","v":184.77},{"$f":"Orçamento!I76","v":90134.5},{"$f":"Orçamento!G76","v":0.22159999999999999},1.1122000000000001,null,129.339,55.431000000000012,{"$error":"#REF!"},{"$f":"IF(#REF!=\"Tabela Não Desonerada\",VLOOKUP($C71,#REF!,13,FALSE),VLOOKUP($C71,#REF!,13,FALSE))","v":{"$error":"#REF!"}},{"$error":"#REF!"},{"$f":"IF(#REF!=\"Tabela Não Desonerada\",VLOOKUP($C71,#REF!,14,FALSE),VLOOKUP($C71,#REF!,14,FALSE))","v":{"$error":"#REF!"}},{"$error":"#REF!"},{"$f":"IF(#REF!=\"Tabela Não Desonerada\",VLOOKUP($C71,#REF!,15,FALSE),VLOOKUP($C71,#REF!,15,FALSE))","v":{"$error":"#REF!"}},{"$error":"#REF!"}]
[1,{"$f":"'Orçamento-TCE'!B72","v":61},{"$f":"'Orçamento-TCE'!C72","v":"8.6"},{"$f":"'Orçamento-TCE'!G72","v":"PISO VINÍLICO SEMI FLEXÍVEL EM PLACAS, PADRÃO LISO, ESPESSURA 3,2MM, FIXADO COM COLA. AF_09/2020"},{"$f":"'Orçamento-TCE'!H72","v":192.91},{"$f":"'Orçamento-TCE'!I72","v":"M2"},{"$f":"Orçamento!H77","v":199.4},{"$f":"Orçamento!I77","v":38466.25},{"$f":"Orçamento!G77","v":0.22159999999999999},1.1122000000000001,null,139.57999999999998,59.820000000000022,{"$error":"#REF!"},{"$f":"IF(#REF!=\"Tabela Não Desonerada\",VLOOKUP($C72,#REF!,13,FALSE),VLOOKUP($C72,#REF!,13,FALSE))","v":{"$error":"#REF!"}},{"$error":"#REF!"},{"$f":"IF(#REF!=\"Tabela Não Desonerada\",VLOOKUP($C72,#REF!,14,FALSE),VLOOKUP($C72,#REF!,14,FALSE))","v":{"$error":"#REF!"}},{"$error":"#REF!"},{"$f":"IF(#REF!=\"Tabela Não Desonerada\",VLOOKUP($C72,#REF!,15,FALSE),VLOOKUP($C72,#REF!,15,FALSE))","v":{"$error":"#REF!"}},{"$error":"#REF!"}]
[1,{"$f":"'Orçamento-TCE'!B73","v":62},{"$f":"'Orçamento-TCE'!C73","v":"8.7"},{"$f":"'Orçamento-TCE'!G73","v":"RODAPÉ EM POLIESTIRENO, ALTURA 5CM. AF_09/2020"},{"$f":"'Orçamento-TCE'!H73","v":618.22},{"$f":"'Orçamento-TCE'!I73","v":"M"},{"$f":"Orçamento!H78","v":62.47},{"$f":"Orçamento!I78","v":38620.199999999997},{"$f":"Orçamento!G78","v":0.22159999999999999},1.1122000000000001,null,43.728999999999999,18.741,{"$error":"#REF!"},{"$f":"IF(#REF!=\"Tabela Não Desonerada\",VLOOKUP($C73,#REF!,13,FALSE),VLOOKUP($C73,#REF!,13,FALSE))","v":{"$error":"#REF!"}},{"$error":"#REF!"},{"$f":"IF(#REF!=\"Tabela Não Desonerada\",VLOOKUP($C73,#REF!,14,FALSE),VLOOKUP($C73,#REF!,14,FALSE))","v":{"$error":"#REF!"}},{"$error":"#REF!"},{"$f":"IF(#REF!=\"Tabela Não Desonerada\",VLOOKUP($C73,#REF!,15,FALSE),VLOOKUP($C73,#REF!,15,FALSE))","v":{"$error":"#REF!"}},{"$error":"#REF!"}]
[1,{"$f":"'Orçamento-TCE'!B74","v":63},{"$f":"'Orçamento-TCE'!C74","v":"8.8"},{"$f":"'Orçamento-TCE'!G74","v":"SOLEIRA EM BASALTO - FORNECIMENTO E INSTALAÇÃO"},{"$f":"'Orçamento-TCE'!H74","v":32.85},{"$f":"'Orçamento-TCE'!I74","v":"M"},{"$f":"Orçamento!H79","v":109.25},{"$f":"Orçamento!I79","v":3588.86},{"$f":"Orçamento!G79","v":0.22159999999999999},1.1122000000000001,null,76.474999999999994,32.775000000000006,{"$error":"#REF!"},{"$f":"IF(#REF!=\"Tabela Não Desonerada\",VLOOKUP($C74,#REF!,13,FALSE),VLOOKUP($C74,#REF!,13,FALSE))","v":{"$error":"#REF!"}},{"$error":"#REF!"},{"$f":"IF(#REF!=\"Tabela Não Desonerada\",VLOOKUP($C74,#REF!,14,FALSE),VLOOKUP($C74,#REF!,14,FALSE))","v":{"$error":"#REF!"}},{"$error":"#REF!"},{"$f":"IF(#REF!=\"Tabela Não Desonerada\",VLOOKUP($C74,#REF!,15,FALSE),VLOOKUP($C74,#REF!,15,FALSE))","v":{"$error":"#REF!"}},{"$error":"#REF!"}]
[1,{"$f":"'Orçamento-TCE'!B75","v":64},{"$f":"'Orçamento-TCE'!C75","v":"8.9"},{"$f":"'Orçamento-TCE'!G75","v":"PEITORIL DE BASALTO EM JANELAS - FORNECIMENTO E INSTALAÇÃO"},{"$f":"'Orçamento-TCE'!H75","v":75.05},{"$f":"'Orçamento-TCE'!I75","v":"M"},{"$f":"Orçamento!H80","v":121.53},{"$f":"Orçamento!I80","v":9120.83},{"$f":"Orçamento!G80","v":0.22159999999999999},1.1122000000000001,null,85.070999999999998,36.459000000000003,{"$error":"#REF!"},{"$f":"IF(#REF!=\"Tabela Não Desonerada\",VLOOKUP($C75,#REF!,13,FALSE),VLOOKUP($C75,#REF!,13,FALSE))","v":{"$error":"#REF!"}},{"$error":"#REF!"},{"$f":"IF(#REF!=\"Tabela Não Desonerada\",VLOOKUP($C75,#REF!,14,FALSE),VLOOKUP($C75,#REF!,14,FALSE))","v":{"$error":"#REF!"}},{"$error":"#REF!"},{"$f":"IF(#REF!=\"Tabela Não Desonerada\",VLOOKUP($C75,#REF!,15,FALSE),VLOOKUP($C75,#REF!,15,FALSE))","v":{"$error":"#REF!"}},{"$error":"#REF!"}]
[1,{"$f":"'Orçamento-TCE'!B76","v":65},{"$f":"'Orçamento-TCE'!C76","v":"9.1"},{"$f":"'Orçamento-TCE'!G76","v":"DEMOLIÇÃO DE REVESTIMENTO CERÂMICO, DE FORMA MECANIZADA COM MARTELETE, SEM REAPROVEITAMENTO. AF_12/2017"},{"$f":"'Orçamento-TCE'!H76","v":13.5},{"$f":"'Orçamento-TCE'!I76","v":"M2"},{"$f":"Orçamento!H82","v":13.71},{"$f":"Orçamento!I82","v":185.09},{"$f":"Orçamento!G82","v":0.22159999999999999},1.1122000000000001,null,9.5969999999999995,4.1130000000000013,{"$error":"#REF!"},{"$f":"IF(#REF!=\"Tabela Não Desonerada\",VLOOKUP($C76,#REF!,13,FALSE),VLOOKUP($C76,#REF!,13,FALSE))","v":{"$error":"#REF!"}},{"$error":"#REF!"},{"$f":"IF(#REF!=\"Tabela Não Desonerada\",VLOOKUP($C76,#REF!,14,FALSE),VLOOKUP($C76,#REF!,14,FALSE))","v":{"$error":"#REF!"}},{"$error":"#REF!"},{"$f":"IF(#REF!=\"Tabela Não Desonerada\",VLOOKUP($C76,#REF!,15,FALSE),VLOOKUP($C76,#REF!,15,FALSE))","v":{"$error":"#REF!"}},{"$error":"#REF!"}]
[1,{"$f":"'Orçamento-TCE'!B77","v":66},{"$f":"'Orçamento-TCE'!C77","v":"9.2"},{"$f":"'Orçamento-TCE'!G77","v":"PISO PODOTÁTIL ALERTA/DIRECIONAL 40X40CM"},{"$f":"'Orçamento-TCE'!H77","v":30},{"$f":"'Orçamento-TCE'!I77","v":"M"},{"$f":"Orçamento!H83","v":41.4},{"$f":"Orçamento!I83","v":1242},{"$f":"Orçamento!G83","v":0.22159999999999999},1.1122000000000001,null,{"$f":"G77*0.7","v":28.979999999999997},{"$f":"G77-L77","v":12.420000000000002},{"$f":"P77","v":{"$error":"#REF!"}},{"$f":"IF(#REF!=\"Tabela Não Desonerada\",VLOOKUP($C77,#REF!,13,FALSE),VLOOKUP($C77,#REF!,13,FALSE))","v":{"$error":"#REF!"}},{"$f":"O77/E77","v":{"$error":"#REF!"}},{"$f":"IF(#REF!=\"Tabela Não Desonerada\",VLOOKUP($C77,#REF!,14,FALSE),VLOOKUP($C77,#REF!,14,FALSE))","v":{"$error":"#REF!"}},{"$f":"Q77/E77","v":{"$error":"#REF!"}},{"$f":"IF(#REF!=\"Tabela Não Desonerada\",VLOOKUP($C77,#REF!,15,FALSE),VLOOKUP($C77,#REF!,15,FALSE))","v":{"$error":"#REF!"}},{"$f":"S77/E77","v":{"$error":"#REF!"}}]
[1,{"$f":"'Orçamento-TCE'!B78","v":67},{"$f":"'Orçamento-TCE'!C78","v":"10.1"},{"$f":"'Orçamento-TCE'!G78","v":" QGBT - ARMÁRIO AUTO PORTANTE COM BASE SOLEIRA E OLHAIS DE IÇAMENTO COM PORTA INTERNA METÁLICA. 1600X700X350, DISJ. GERAL CX. MOLDADA 35KA/380V – 600 A 01PÇ MULTIMEDIDOR DIGITAL DE GRANDEZAS ELETRICAS DISJUNTORES PARCIAIS EM CX. MOLDADA 18KA/380V CFE. PROJETO.  COM INSTALAÇÃO."},{"$f":"'Orçamento-TCE'!H78","v":1},{"$f":"'Orçamento-TCE'!I78","v":"UN"},{"$f":"Orçamento!H85","v":34364.339999999997},{"$f":"Orçamento!I85","v":34364.339999999997},{"$f":"Orçamento!G85","v":0.22159999999999999},1.1122000000000001,null,24055.037999999997,10309.302,{"$error":"#REF!"},{"$f":"IF(#REF!=\"Tabela Não Desonerada\",VLOOKUP($C78,#REF!,13,FALSE),VLOOKUP($C78,#REF!,13,FALSE))","v":{"$error":"#REF!"}},{"$error":"#REF!"},{"$f":"IF(#REF!=\"Tabela Não Desonerada\",VLOOKUP($C78,#REF!,14,FALSE),VLOOKUP($C78,#REF!,14,FALSE))","v":{"$error":"#REF!"}},{"$error":"#REF!"},{"$f":"IF(#REF!=\"Tabela Não Desonerada\",VLOOKUP($C78,#REF!,15,FALSE),VLOOKUP($C78,#REF!,15,FALSE))","v":{"$error":"#REF!"}},{"$error":"#REF!"}]
[1,{"$f":"'Orçamento-TCE'!B79","v":68},{"$f":"'Orçamento-TCE'!C79","v":"10.2"},{"$f":"'Orçamento-TCE'!G79","v":"CD-Q2 - QUADRO DE FORÇA DE SOBREPOR MONTADO EM CAIXA DE COMANDO COM DIMENSÕES MÍNIMAS DE 1800X500X150MM, 66 LUGARES. COM INSTALAÇÃO."},{"$f":"'Orçamento-TCE'!H79","v":1},{"$f":"'Orçamento-TCE'!I79","v":"UN"},{"$f":"Orçamento!H86","v":6804.32},{"$f":"Orçamento!I86","v":6804.32},{"$f":"Orçamento!G86","v":0.22159999999999999},1.1122000000000001,null,4763.0239999999994,2041.2960000000003,{"$error":"#REF!"},{"$f":"IF(#REF!=\"Tabela Não Desonerada\",VLOOKUP($C79,#REF!,13,FALSE),VLOOKUP($C79,#REF!,13,FALSE))","v":{"$error":"#REF!"}},{"$error":"#REF!"},{"$f":"IF(#REF!=\"Tabela Não Desonerada\",VLOOKUP($C79,#REF!,14,FALSE),VLOOKUP($C79,#REF!,14,FALSE))","v":{"$error":"#REF!"}},{"$error":"#REF!"},{"$f":"IF(#REF!=\"Tabela Não Desonerada\",VLOOKUP($C79,#REF!,15,FALSE),VLOOKUP($C79,#REF!,15,FALSE))","v":{"$error":"#REF!"}},{"$error":"#REF!"}]
[1,{"$f":"'Orçamento-TCE'!B80","v":69},{"$f":"'Orçamento-TCE'!C80","v":"10.3"},{"$f":"'Orçamento-TCE'!G80","v":"CD-Q3 - QUADRO DE FORÇA DE SOBREPOR MONTADO EM CAIXA DE COMANDO COM DIMENSÕES MÍNIMAS DE 1800X500X150MM, 66 LUGARES. COM INSTALAÇÃO."},{"$f":"'Orçamento-TCE'!H80","v":1},{"$f":"'Orçamento-TCE'!I80","v":"UN"},{"$f":"Orçamento!H87","v":6613.82},{"$f":"Orçamento!I87","v":6613.82},{"$f":"Orçamento!G87","v":0.22159999999999999},1.1122000000000001,null,4629.6739999999991,1984.1460000000006,{"$error":"#REF!"},{"$f":"IF(#REF!=\"Tabela Não Desonerada\",VLOOKUP($C80,#REF!,13,FALSE),VLOOKUP($C80,#REF!,13,FALSE))","v":{"$error":"#REF!"}},{"$error":"#REF!"},{"$f":"IF(#REF!=\"Tabela Não Desonerada\",VLOOKUP($C80,#REF!,14,FALSE),VLOOKUP($C80,#REF!,14,FALSE))","v":{"$error":"#REF!"}},{"$error":"#REF!"},{"$f":"IF(#REF!=\"Tabela Não Desonerada\",VLOOKUP($C80,#REF!,15,FALSE),VLOOKUP($C80,#REF!,15,FALSE))","v":{"$error":"#REF!"}},{"$error":"#REF!"}]
[1,{"$f":"'Orçamento-TCE'!B81","v":70},{"$f":"'Orçamento-TCE'!C81","v":"10.4"},{"$f":"'Orçamento-TCE'!G81","v":"QF EMERGENCIA - QUADRO DE FORÇA DE SOBREPOR MONTADO EM CAIXA DE COMANDO COM DIMENSÕES MÍNIMAS DE 800X500X150MM. COM INSTALAÇÃO."},{"$f":"'Orçamento-TCE'!H81","v":1},{"$f":"'Orçamento-TCE'!I81","v":"UN"},{"$f":"Orçamento!H88","v":3966.28},{"$f":"Orçamento!I88","v":3966.28},{"$f":"Orçamento!G88","v":0.22159999999999999},1.1122000000000001,null,2776.3960000000002,1189.884,{"$error":"#REF!"},{"$f":"IF(#REF!=\"Tabela Não Desonerada\",VLOOKUP($C81,#REF!,13,FALSE),VLOOKUP($C81,#REF!,13,FALSE))","v":{"$error":"#REF!"}},{"$error":"#REF!"},{"$f":"IF(#REF!=\"Tabela Não Desonerada\",VLOOKUP($C81,#REF!,14,FALSE),VLOOKUP($C81,#REF!,14,FALSE))","v":{"$error":"#REF!"}},{"$error":"#REF!"},{"$f":"IF(#REF!=\"Tabela Não Desonerada\",VLOOKUP($C81,#REF!,15,FALSE),VLOOKUP($C81,#REF!,15,FALSE))","v":{"$error":"#REF!"}},{"$error":"#REF!"}]
[1,{"$f":"'Orçamento-TCE'!B82","v":71},{"$f":"'Orçamento-TCE'!C82","v":"10.5"},{"$f":"'Orçamento-TCE'!G82","v":"CABO DE COBRE FLEXÍVEL ISOLADO, 95MM2, ANTI-CHAMA 0,6/1,0kV, PARA DISTRIBUIÇÃO - FORNECIMENTO E INSTALAÇÃO. AF_12/2015"},{"$f":"'Orçamento-TCE'!H82","v":440},{"$f":"'Orçamento-TCE'!I82","v":"M"},{"$f":"Orçamento!H89","v":124.04},{"$f":"Orçamento!I89","v":54577.599999999999},{"$f":"Orçamento!G89","v":0.22159999999999999},1.1122000000000001,null,86.828000000000003,37.212000000000003,{"$error":"#REF!"},{"$f":"IF(#REF!=\"Tabela Não Desonerada\",VLOOKUP($C82,#REF!,13,FALSE),VLOOKUP($C82,#REF!,13,FALSE))","v":{"$error":"#REF!"}},{"$error":"#REF!"},{"$f":"IF(#REF!=\"Tabela Não Desonerada\",VLOOKUP($C82,#REF!,14,FALSE),VLOOKUP($C82,#REF!,14,FALSE))","v":{"$error":"#REF!"}},{"$error":"#REF!"},{"$f":"IF(#REF!=\"Tabela Não Desonerada\",VLOOKUP($C82,#REF!,15,FALSE),VLOOKUP($C82,#REF!,15,FALSE))","v":{"$error":"#REF!"}},{"$error":"#REF!"}]
[1,{"$f":"'Orçamento-TCE'!B83","v":72},{"$f":"'Orçamento-TCE'!C83","v":"10.6"},{"$f":"'Orçamento-TCE'!G83","v":"CABO DE COBRE FLEXÍVEL ISOLADO, 50MM2, ANTI-CHAMA 0,6/1,0kV, PARA DISTRIBUIÇÃO - FORNECIMENTO E INSTALAÇÃO. AF_12/2015"},{"$f":"'Orçamento-TCE'!H83","v":110},{"$f":"'Orçamento-TCE'!I83","v":"M"},{"$f":"Orçamento!H90","v":68.209999999999994},{"$f":"Orçamento!I90","v":7503.1},{"$f":"Orçamento!G90","v":0.22159999999999999},1.1122000000000001,null,47.746999999999993,20.463000000000001,{"$error":"#REF!"},{"$f":"IF(#REF!=\"Tabela Não Desonerada\",VLOOKUP($C83,#REF!,13,FALSE),VLOOKUP($C83,#REF!,13,FALSE))","v":{"$error":"#REF!"}},{"$error":"#REF!"},{"$f":"IF(#REF!=\"Tabela Não Desonerada\",VLOOKUP($C83,#REF!,14,FALSE),VLOOKUP($C83,#REF!,14,FALSE))","v":{"$error":"#REF!"}},{"$error":"#REF!"},{"$f":"IF(#REF!=\"Tabela Não Desonerada\",VLOOKUP($C83,#REF!,15,FALSE),VLOOKUP($C83,#REF!,15,FALSE))","v":{"$error":"#REF!"}},{"$error":"#REF!"}]
[1,{"$f":"'Orçamento-TCE'!B84","v":73},{"$f":"'Orçamento-TCE'!C84","v":"10.7"},{"$f":"'Orçamento-TCE'!G84","v":"CABO DE COBRE FLEXÍVEL ISOLADO, 35MM2, ANTI-CHAMA 0,6/1,0kV, PARA DISTRIBUIÇÃO - FORNECIMENTO E INSTALAÇÃO. AF_12/2015"},{"$f":"'Orçamento-TCE'!H84","v":280},{"$f":"'Orçamento-TCE'!I84","v":"M"},{"$f":"Orçamento!H91","v":48.44},{"$f":"Orçamento!I91","v":13563.2},{"$f":"Orçamento!G91","v":0.22159999999999999},1.1122000000000001,null,33.907999999999994,14.532000000000004,{"$error":"#REF!"},{"$f":"IF(#REF!=\"Tabela Não Desonerada\",VLOOKUP($C84,#REF!,13,FALSE),VLOOKUP($C84,#REF!,13,FALSE))","v":{"$error":"#REF!"}},{"$error":"#REF!"},{"$f":"IF(#REF!=\"Tabela Não Desonerada\",VLOOKUP($C84,#REF!,14,FALSE),VLOOKUP($C84,#REF!,14,FALSE))","v":{"$error":"#REF!"}},{"$error":"#REF!"},{"$f":"IF(#REF!=\"Tabela Não Desonerada\",VLOOKUP($C84,#REF!,15,FALSE),VLOOKUP($C84,#REF!,15,FALSE))","v":{"$error":"#REF!"}},{"$error":"#REF!"}]
[1,{"$f":"'Orçamento-TCE'!B85","v":74},{"$f":"'Orçamento-TCE'!C85","v":"10.8"},{"$f":"'Orçamento-TCE'!G85","v":"CABO DE COBRE FLEXÍVEL ISOLADO, 25MM2, ANTI-CHAMA 0,6/1,0kV, PARA DISTRIBUIÇÃO - FORNECIMENTO E INSTALAÇÃO. AF_12/2015"},{"$f":"'Orçamento-TCE'!H85","v":620},{"$f":"'Orçamento-TCE'!I85","v":"M"},{"$f":"Orçamento!H92","v":35.659999999999997},{"$f":"Orçamento!I92","v":22109.200000000001},{"$f":"Orçamento!G92","v":0.22159999999999999},1.1122000000000001,null,24.961999999999996,10.698,{"$error":"#REF!"},{"$f":"IF(#REF!=\"Tabela Não Desonerada\",VLOOKUP($C85,#REF!,13,FALSE),VLOOKUP($C85,#REF!,13,FALSE))","v":{"$error":"#REF!"}},{"$error":"#REF!"},{"$f":"IF(#REF!=\"Tabela Não Desonerada\",VLOOKUP($C85,#REF!,14,FALSE),VLOOKUP($C85,#REF!,14,FALSE))","v":{"$error":"#REF!"}},{"$error":"#REF!"},{"$f":"IF(#REF!=\"Tabela Não Desonerada\",VLOOKUP($C85,#REF!,15,FALSE),VLOOKUP($C85,#REF!,15,FALSE))","v":{"$error":"#REF!"}},{"$error":"#REF!"}]
[1,{"$f":"'Orçamento-TCE'!B86","v":75},{"$f":"'Orçamento-TCE'!C86","v":"10.9"},{"$f":"'Orçamento-TCE'!G86","v":"CABO DE COBRE FLEXÍVEL ISOLADO, 16MM2, ANTI-CHAMA 0,6/1,0kV, PARA DISTRIBUIÇÃO - FORNECIMENTO E INSTALAÇÃO. AF_12/2015"},{"$f":"'Orçamento-TCE'!H86","v":250},{"$f":"'Orçamento-TCE'!I86","v":"M"},{"$f":"Orçamento!H93","v":22.33},{"$f":"Orçamento!I93","v":5582.5},{"$f":"Orçamento!G93","v":0.22159999999999999},1.1122000000000001,null,15.630999999999998,6.6989999999999998,{"$error":"#REF!"},{"$f":"IF(#REF!=\"Tabela Não Desonerada\",VLOOKUP($C86,#REF!,13,FALSE),VLOOKUP($C86,#REF!,13,FALSE))","v":{"$error":"#REF!"}},{"$error":"#REF!"},{"$f":"IF(#REF!=\"Tabela Não Desonerada\",VLOOKUP($C86,#REF!,14,FALSE),VLOOKUP($C86,#REF!,14,FALSE))","v":{"$error":"#REF!"}},{"$error":"#REF!"},{"$f":"IF(#REF!=\"Tabela Não Desonerada\",VLOOKUP($C86,#REF!,15,FALSE),VLOOKUP($C86,#REF!,15,FALSE))","v":{"$error":"#REF!"}},{"$error":"#REF!"}]
[1,{"$f":"'Orçamento-TCE'!B87","v":76},{"$f":"'Orçamento-TCE'!C87","v":"10.10"},{"$f":"'Orçamento-TCE'!G87","v":"CABO DE COBRE FLEXÍVEL ISOLADO, 10MM2, ANTI-CHAMA 0,6/1,0kV, PARA DISTRIBUIÇÃO - FORNECIMENTO E INSTALAÇÃO. AF_12/2015"},{"$f":"'Orçamento-TCE'!H87","v":720},{"$f":"'Orçamento-TCE'!I87","v":"M"},{"$f":"Orçamento!H94","v":14.59},{"$f":"Orçamento!I94","v":10504.8},{"$f":"Orçamento!G94","v":0.22159999999999999},1.1122000000000001,null,10.212999999999999,4.3770000000000007,{"$error":"#REF!"},{"$f":"IF(#REF!=\"Tabela Não Desonerada\",VLOOKUP($C87,#REF!,13,FALSE),VLOOKUP($C87,#REF!,13,FALSE))","v":{"$error":"#REF!"}},{"$error":"#REF!"},{"$f":"IF(#REF!=\"Tabela Não Desonerada\",VLOOKUP($C87,#REF!,14,FALSE),VLOOKUP($C87,#REF!,14,FALSE))","v":{"$error":"#REF!"}},{"$error":"#REF!"},{"$f":"IF(#REF!=\"Tabela Não Desonerada\",VLOOKUP($C87,#REF!,15,FALSE),VLOOKUP($C87,#REF!,15,FALSE))","v":{"$error":"#REF!"}},{"$error":"#REF!"}]
[1,{"$f":"'Orçamento-TCE'!B88","v":77},{"$f":"'Orçamento-TCE'!C88","v":"10.11"},{"$f":"'Orçamento-TCE'!G88","v":"LUMINÁRIA DE EMBUTIR - COMPLETA COM QUATRO LÂMPADAS TUBULARES LED T8 (4x9 - 10W), INSTALAÇÃO EM FORRO COM MODELAÇÃO DE 625X625MM, COM REFLETOR PARABÓLICO E ALETAS DE ALUMÍNIO ANODIZADO BRILHANTE DE ALTA REFLETÂNCIA E ALTA PUREZA 99,85%. SOQUETE TIPO PUSH-IN G-13 DE ENGATE RÁPIDO, ROTOR DE SEGURANÇA EM POLICARBONATO E CONTATOS EM BRONZE FOSFOROSO, COMPLETA. CERTIFICAÇÃO CE, GARANTIA MÍNIMA DE 2 ANOS"},{"$f":"'Orçamento-TCE'!H88","v":150},{"$f":"'Orçamento-TCE'!I88","v":"UN"},{"$f":"Orçamento!H95","v":553.02},{"$f":"Orçamento!I95","v":82953},{"$f":"Orçamento!G95","v":0.22159999999999999},1.1122000000000001,null,387.11399999999998,165.90600000000001,{"$error":"#REF!"},{"$f":"IF(#REF!=\"Tabela Não Desonerada\",VLOOKUP($C88,#REF!,13,FALSE),VLOOKUP($C88,#REF!,13,FALSE))","v":{"$error":"#REF!"}},{"$error":"#REF!"},{"$f":"IF(#REF!=\"Tabela Não Desonerada\",VLOOKUP($C88,#REF!,14,FALSE),VLOOKUP($C88,#REF!,14,FALSE))","v":{"$error":"#REF!"}},{"$error":"#REF!"},{"$f":"IF(#REF!=\"Tabela Não Desonerada\",VLOOKUP($C88,#REF!,15,FALSE),VLOOKUP($C88,#REF!,15,FALSE))","v":{"$error":"#REF!"}},{"$error":"#REF!"}]
[1,{"$f":"'Orçamento-TCE'!B89","v":78},{"$f":"'Orçamento-TCE'!C89","v":"10.12"},{"$f":"'Orçamento-TCE'!G89","v":"LUMINÁRIA TIPO CALHA, DE SOBREPOR, COM 2 LÂMPADAS TUBULARES FLUORESCENTES DE 18W, COM REATOR DE PARTIDA RÁPIDA - FORNECIMENTO E INSTALAÇÃO. AF_02/2020"},{"$f":"'Orçamento-TCE'!H89","v":23},{"$f":"'Orçamento-TCE'!I89","v":"UN"},{"$f":"Orçamento!H96","v":177.49},{"$f":"Orçamento!I96","v":4082.27},{"$f":"Orçamento!G96","v":0.22159999999999999},1.1122000000000001,null,124.24299999999999,53.247000000000014,{"$error":"#REF!"},{"$f":"IF(#REF!=\"Tabela Não Desonerada\",VLOOKUP($C89,#REF!,13,FALSE),VLOOKUP($C89,#REF!,13,FALSE))","v":{"$error":"#REF!"}},{"$error":"#REF!"},{"$f":"IF(#REF!=\"Tabela Não Desonerada\",VLOOKUP($C89,#REF!,14,FALSE),VLOOKUP($C89,#REF!,14,FALSE))","v":{"$error":"#REF!"}},{"$error":"#REF!"},{"$f":"IF(#REF!=\"Tabela Não Desonerada\",VLOOKUP($C89,#REF!,15,FALSE),VLOOKUP($C89,#REF!,15,FALSE))","v":{"$error":"#REF!"}},{"$error":"#REF!"}]
[1,{"$f":"'Orçamento-TCE'!B90","v":79},{"$f":"'Orçamento-TCE'!C90","v":"10.13"},{"$f":"'Orçamento-TCE'!G90","v":"LUMINÁRIA DE SOBREPOR - COMPLETA COM DUAS LÂMPADAS TUBULARES LED T8 (2X9W), INSTALAÇÃO EM FORRO DE GESSO, COM REFLETOR PARABÓLICO E ALETAS DE ALUMÍNIO ANODIZADO BRILHANTE DE ALTA REFLETÂNCIA E ALTA PUREZA 99,85%. SOQUE TIPO PUSH-IN G-13 DE ENGATE RÁPIDO, ROTOR DE SEGURANÇA EM POLICARBONATO E CONTATOS EM BRONZE FOSFOROSO. COMPLETA. CERTIFICAÇÃO CE. GARANTIA MÍNIMA 2 ANOS. "},{"$f":"'Orçamento-TCE'!H90","v":1},{"$f":"'Orçamento-TCE'!I90","v":"UN"},{"$f":"Orçamento!H97","v":216.11},{"$f":"Orçamento!I97","v":216.11},{"$f":"Orçamento!G97","v":0.22159999999999999},1.1122000000000001,null,151.27699999999999,64.833000000000027,{"$error":"#REF!"},{"$f":"IF(#REF!=\"Tabela Não Desonerada\",VLOOKUP($C90,#REF!,13,FALSE),VLOOKUP($C90,#REF!,13,FALSE))","v":{"$error":"#REF!"}},{"$error":"#REF!"},{"$f":"IF(#REF!=\"Tabela Não Desonerada\",VLOOKUP($C90,#REF!,14,FALSE),VLOOKUP($C90,#REF!,14,FALSE))","v":{"$error":"#REF!"}},{"$error":"#REF!"},{"$f":"IF(#REF!=\"Tabela Não Desonerada\",VLOOKUP($C90,#REF!,15,FALSE),VLOOKUP($C90,#REF!,15,FALSE))","v":{"$error":"#REF!"}},{"$error":"#REF!"}]
[1,{"$f":"'Orçamento-TCE'!B91","v":80},{"$f":"'Orçamento-TCE'!C91","v":"10.14"},{"$f":"'Orçamento-TCE'!G91","v":"Luminária arandela de Sobrepor - Lâmpada led 18 W "},{"$f":"'Orçamento-TCE'!H91","v":19},{"$f":"'Orçamento-TCE'!I91","v":"UN"},{"$f":"Orçamento!H98","v":171.32},{"$f":"Orçamento!I98","v":3255.08},{"$f":"Orçamento!G98","v":0.22159999999999999},1.1122000000000001,null,119.92399999999999,51.396000000000001,{"$error":"#REF!"},{"$f":"IF(#REF!=\"Tabela Não Desonerada\",VLOOKUP($C91,#REF!,13,FALSE),VLOOKUP($C91,#REF!,13,FALSE))","v":{"$error":"#REF!"}},{"$error":"#REF!"},{"$f":"IF(#REF!=\"Tabela Não Desonerada\",VLOOKUP($C91,#REF!,14,FALSE),VLOOKUP($C91,#REF!,14,FALSE))","v":{"$error":"#REF!"}},{"$error":"#REF!"},{"$f":"IF(#REF!=\"Tabela Não Desonerada\",VLOOKUP($C91,#REF!,15,FALSE),VLOOKUP($C91,#REF!,15,FALSE))","v":{"$error":"#REF!"}},{"$error":"#REF!"}]
[1,{"$f":"'Orçamento-TCE'!B92","v":81},{"$f":"'Orçamento-TCE'!C92","v":"10.15"},{"$f":"'Orçamento-TCE'!G92","v":"SENSOR DE PRESENÇA COM FOTOCÉLULA, FIXAÇÃO EM PAREDE - FORNECIMENTO E INSTALAÇÃO. AF_02/2020"},{"$f":"'Orçamento-TCE'!H92","v":2},{"$f":"'Orçamento-TCE'!I92","v":"UN"},{"$f":"Orçamento!H99","v":152.41},{"$f":"Orçamento!I99","v":304.82},{"$f":"Orçamento!G99","v":0.22159999999999999},1.1122000000000001,null,106.687,45.722999999999999,{"$error":"#REF!"},{"$f":"IF(#REF!=\"Tabela Não Desonerada\",VLOOKUP($C92,#REF!,13,FALSE),VLOOKUP($C92,#REF!,13,FALSE))","v":{"$error":"#REF!"}},{"$error":"#REF!"},{"$f":"IF(#REF!=\"Tabela Não Desonerada\",VLOOKUP($C92,#REF!,14,FALSE),VLOOKUP($C92,#REF!,14,FALSE))","v":{"$error":"#REF!"}},{"$error":"#REF!"},{"$f":"IF(#REF!=\"Tabela Não Desonerada\",VLOOKUP($C92,#REF!,15,FALSE),VLOOKUP($C92,#REF!,15,FALSE))","v":{"$error":"#REF!"}},{"$error":"#REF!"}]
[1,{"$f":"'Orçamento-TCE'!B93","v":82},{"$f":"'Orçamento-TCE'!C93","v":"10.16"},{"$f":"'Orçamento-TCE'!G93","v":"MÓDULO AUTÔNOMO DE ILUMINAÇÃO DE EMERGÊNCIA COM DIFUSOR LEITOSO, 500 LÚMENS, 115/220V, COM 80 LED'S. ALTO BRILHO, BATERIA 6V, 4,5Ah, AUTONOMIA DE 8 HORAS, GABINETE EM METAL, PINTURA EPÓXI. REF. TECHNOMASTER LM 0180 OU EQUIVALENTE"},{"$f":"'Orçamento-TCE'!H93","v":23},{"$f":"'Orçamento-TCE'!I93","v":"UN"},{"$f":"Orçamento!H100","v":184.36},{"$f":"Orçamento!I100","v":4240.28},{"$f":"Orçamento!G100","v":0.22159999999999999},1.1122000000000001,null,129.05199999999999,55.308000000000021,{"$error":"#REF!"},{"$f":"IF(#REF!=\"Tabela Não Desonerada\",VLOOKUP($C93,#REF!,13,FALSE),VLOOKUP($C93,#REF!,13,FALSE))","v":{"$error":"#REF!"}},{"$error":"#REF!"},{"$f":"IF(#REF!=\"Tabela Não Desonerada\",VLOOKUP($C93,#REF!,14,FALSE),VLOOKUP($C93,#REF!,14,FALSE))","v":{"$error":"#REF!"}},{"$error":"#REF!"},{"$f":"IF(#REF!=\"Tabela Não Desonerada\",VLOOKUP($C93,#REF!,15,FALSE),VLOOKUP($C93,#REF!,15,FALSE))","v":{"$error":"#REF!"}},{"$error":"#REF!"}]
[1,{"$f":"'Orçamento-TCE'!B94","v":83},{"$f":"'Orçamento-TCE'!C94","v":"10.17"},{"$f":"'Orçamento-TCE'!G94","v":"MÓDULO AUTÔNOMO DE EMERGÊNCIA (127/220V) COM 2 FAROLETES DE 32 LED'S CADA, COM BATERIA 12V - 7A COM AUTONOMIA DE 32 HORAS COM SUPORTE METÁLICO PARA FIXAÇÃO DA BATERIA. REF. TECHNOMASTER UN0232 OU EQUIVALENTE"},{"$f":"'Orçamento-TCE'!H94","v":1},{"$f":"'Orçamento-TCE'!I94","v":"UN"},{"$f":"Orçamento!H101","v":284.17},{"$f":"Orçamento!I101","v":284.17},{"$f":"Orçamento!G101","v":0.22159999999999999},1.1122000000000001,null,198.91900000000001,85.251000000000005,{"$error":"#REF!"},{"$f":"IF(#REF!=\"Tabela Não Desonerada\",VLOOKUP($C94,#REF!,13,FALSE),VLOOKUP($C94,#REF!,13,FALSE))","v":{"$error":"#REF!"}},{"$error":"#REF!"},{"$f":"IF(#REF!=\"Tabela Não Desonerada\",VLOOKUP($C94,#REF!,14,FALSE),VLOOKUP($C94,#REF!,14,FALSE))","v":{"$error":"#REF!"}},{"$error":"#REF!"},{"$f":"IF(#REF!=\"Tabela Não Desonerada\",VLOOKUP($C94,#REF!,15,FALSE),VLOOKUP($C94,#REF!,15,FALSE))","v":{"$error":"#REF!"}},{"$error":"#REF!"}]
[1,{"$f":"'Orçamento-TCE'!B95","v":84},{"$f":"'Orçamento-TCE'!C95","v":"10.18"},{"$f":"'Orçamento-TCE'!G95","v":"INTERRUPTOR SIMPLES (1 MÓDULO), 10A//250V, INCLUINDO SUPORTE E PLACA - FORNECIMENTO E INSTALAÇÃO. AF_12/2015"},{"$f":"'Orçamento-TCE'!H95","v":14},{"$f":"'Orçamento-TCE'!I95","v":"UN"},{"$f":"Orçamento!H102","v":29.56},{"$f":"Orçamento!I102","v":413.84},{"$f":"Orçamento!G102","v":0.22159999999999999},1.1122000000000001,null,20.691999999999997,8.8680000000000021,{"$error":"#REF!"},{"$f":"IF(#REF!=\"Tabela Não Desonerada\",VLOOKUP($C95,#REF!,13,FALSE),VLOOKUP($C95,#REF!,13,FALSE))","v":{"$error":"#REF!"}},{"$error":"#REF!"},{"$f":"IF(#REF!=\"Tabela Não Desonerada\",VLOOKUP($C95,#REF!,14,FALSE),VLOOKUP($C95,#REF!,14,FALSE))","v":{"$error":"#REF!"}},{"$error":"#REF!"},{"$f":"IF(#REF!=\"Tabela Não Desonerada\",VLOOKUP($C95,#REF!,15,FALSE),VLOOKUP($C95,#REF!,15,FALSE))","v":{"$error":"#REF!"}},{"$error":"#REF!"}]
[1,{"$f":"'Orçamento-TCE'!B96","v":85},{"$f":"'Orçamento-TCE'!C96","v":"10.19"},{"$f":"'Orçamento-TCE'!G96","v":"INTERRUPTOR SIMPLES (2 MÓDULOS), 10A/250V, INCLUINDO SUPORTE E PLACA. FORNECIMENTO E INSTALAÇÃO. AF_12/2015"},{"$f":"'Orçamento-TCE'!H96","v":16},{"$f":"'Orçamento-TCE'!I96","v":"UN"},{"$f":"Orçamento!H103","v":46.81},{"$f":"Orçamento!I103","v":748.96},{"$f":"Orçamento!G103","v":0.22159999999999999},1.1122000000000001,null,32.767000000000003,14.042999999999999,{"$error":"#REF!"},{"$f":"IF(#REF!=\"Tabela Não Desonerada\",VLOOKUP($C96,#REF!,13,FALSE),VLOOKUP($C96,#REF!,13,FALSE))","v":{"$error":"#REF!"}},{"$error":"#REF!"},{"$f":"IF(#REF!=\"Tabela Não Desonerada\",VLOOKUP($C96,#REF!,14,FALSE),VLOOKUP($C96,#REF!,14,FALSE))","v":{"$error":"#REF!"}},{"$error":"#REF!"},{"$f":"IF(#REF!=\"Tabela Não Desonerada\",VLOOKUP($C96,#REF!,15,FALSE),VLOOKUP($C96,#REF!,15,FALSE))","v":{"$error":"#REF!"}},{"$error":"#REF!"}]
[1,{"$f":"'Orçamento-TCE'!B97","v":86},{"$f":"'Orçamento-TCE'!C97","v":"10.20"},{"$f":"'Orçamento-TCE'!G97","v":"INTERRUPTOR SIMPLES (3 MÓDULOS), 10A/250V, INCLUINDO SUPORTE E PLACA. FORNECIMENTO E INSTALAÇÃO. AF_12/2015"},{"$f":"'Orçamento-TCE'!H97","v":9},{"$f":"'Orçamento-TCE'!I97","v":"UN"},{"$f":"Orçamento!H104","v":64.09},{"$f":"Orçamento!I104","v":576.80999999999995},{"$f":"Orçamento!G104","v":0.22159999999999999},1.1122000000000001,null,44.863,19.227000000000004,{"$error":"#REF!"},{"$f":"IF(#REF!=\"Tabela Não Desonerada\",VLOOKUP($C97,#REF!,13,FALSE),VLOOKUP($C97,#REF!,13,FALSE))","v":{"$error":"#REF!"}},{"$error":"#REF!"},{"$f":"IF(#REF!=\"Tabela Não Desonerada\",VLOOKUP($C97,#REF!,14,FALSE),VLOOKUP($C97,#REF!,14,FALSE))","v":{"$error":"#REF!"}},{"$error":"#REF!"},{"$f":"IF(#REF!=\"Tabela Não Desonerada\",VLOOKUP($C97,#REF!,15,FALSE),VLOOKUP($C97,#REF!,15,FALSE))","v":{"$error":"#REF!"}},{"$error":"#REF!"}]
[1,{"$f":"'Orçamento-TCE'!B98","v":87},{"$f":"'Orçamento-TCE'!C98","v":"10.21"},{"$f":"'Orçamento-TCE'!G98","v":"INTERRUPTOR BIPOLAR, (1 MÓDULO), 10A/250V, INCLUINDO SUPORTE E PLACA. FORNECIMENTO E INSTALAÇÃO. AF_09/2017"},{"$f":"'Orçamento-TCE'!H98","v":10},{"$f":"'Orçamento-TCE'!I98","v":"UN"},{"$f":"Orçamento!H105","v":52.14},{"$f":"Orçamento!I105","v":521.4},{"$f":"Orçamento!G105","v":0.22159999999999999},1.1122000000000001,null,36.497999999999998,15.642000000000003,{"$error":"#REF!"},{"$f":"IF(#REF!=\"Tabela Não Desonerada\",VLOOKUP($C98,#REF!,13,FALSE),VLOOKUP($C98,#REF!,13,FALSE))","v":{"$error":"#REF!"}},{"$error":"#REF!"},{"$f":"IF(#REF!=\"Tabela Não Desonerada\",VLOOKUP($C98,#REF!,14,FALSE),VLOOKUP($C98,#REF!,14,FALSE))","v":{"$error":"#REF!"}},{"$error":"#REF!"},{"$f":"IF(#REF!=\"Tabela Não Desonerada\",VLOOKUP($C98,#REF!,15,FALSE),VLOOKUP($C98,#REF!,15,FALSE))","v":{"$error":"#REF!"}},{"$error":"#REF!"}]
[1,{"$f":"'Orçamento-TCE'!B99","v":88},{"$f":"'Orçamento-TCE'!C99","v":"10.22"},{"$f":"'Orçamento-TCE'!G99","v":"INTERRUPTOR INTERMEDIÁRIO (1 MÓDULO), 10A/250V, INCLUINDO SUPORTE E PLACA. FORNECIMENTO E INSTALAÇÃO. AF_09/2017"},{"$f":"'Orçamento-TCE'!H99","v":1},{"$f":"'Orçamento-TCE'!I99","v":"UN"},{"$f":"Orçamento!H106","v":53.73},{"$f":"Orçamento!I106","v":53.73},{"$f":"Orçamento!G106","v":0.22159999999999999},1.1122000000000001,null,37.610999999999997,16.119,{"$error":"#REF!"},{"$f":"IF(#REF!=\"Tabela Não Desonerada\",VLOOKUP($C99,#REF!,13,FALSE),VLOOKUP($C99,#REF!,13,FALSE))","v":{"$error":"#REF!"}},{"$error":"#REF!"},{"$f":"IF(#REF!=\"Tabela Não Desonerada\",VLOOKUP($C99,#REF!,14,FALSE),VLOOKUP($C99,#REF!,14,FALSE))","v":{"$error":"#REF!"}},{"$error":"#REF!"},{"$f":"IF(#REF!=\"Tabela Não Desonerada\",VLOOKUP($C99,#REF!,15,FALSE),VLOOKUP($C99,#REF!,15,FALSE))","v":{"$error":"#REF!"}},{"$error":"#REF!"}]
[1,{"$f":"'Orçamento-TCE'!B100","v":89},{"$f":"'Orçamento-TCE'!C100","v":"10.23"},{"$f":"'Orçamento-TCE'!G100","v":"TOMADA ALTA DE EMBUTIR (1 MÓDULO), 2P+T 10A, INCLUINDO SUPORTE E PLACA. FORNECIMENTO E INSTALAÇÃO. AF_12/2015"},{"$f":"'Orçamento-TCE'!H100","v":23},{"$f":"'Orçamento-TCE'!I100","v":"UN"},{"$f":"Orçamento!H107","v":44.39},{"$f":"Orçamento!I107","v":1020.97},{"$f":"Orçamento!G107","v":0.22159999999999999},1.1122000000000001,null,31.072999999999997,13.317000000000004,{"$error":"#REF!"},{"$f":"IF(#REF!=\"Tabela Não Desonerada\",VLOOKUP($C100,#REF!,13,FALSE),VLOOKUP($C100,#REF!,13,FALSE))","v":{"$error":"#REF!"}},{"$error":"#REF!"},{"$f":"IF(#REF!=\"Tabela Não Desonerada\",VLOOKUP($C100,#REF!,14,FALSE),VLOOKUP($C100,#REF!,14,FALSE))","v":{"$error":"#REF!"}},{"$error":"#REF!"},{"$f":"IF(#REF!=\"Tabela Não Desonerada\",VLOOKUP($C100,#REF!,15,FALSE),VLOOKUP($C100,#REF!,15,FALSE))","v":{"$error":"#REF!"}},{"$error":"#REF!"}]
[1,{"$f":"'Orçamento-TCE'!B101","v":90},{"$f":"'Orçamento-TCE'!C101","v":"10.24"},{"$f":"'Orçamento-TCE'!G101","v":"TOMADA MÉDIA DE EMBUTIR (2 MÓDULOS), 2P+T 10A, INCLUINDO SUPORTE E PLACA. FORNECIMENTO E INSTALAÇÃO. AF_12/2015"},{"$f":"'Orçamento-TCE'!H101","v":56},{"$f":"'Orçamento-TCE'!I101","v":"UN"},{"$f":"Orçamento!H108","v":57.59},{"$f":"Orçamento!I108","v":3225.04},{"$f":"Orçamento!G108","v":0.22159999999999999},1.1122000000000001,null,40.313000000000002,17.277000000000001,{"$error":"#REF!"},{"$f":"IF(#REF!=\"Tabela Não Desonerada\",VLOOKUP($C101,#REF!,13,FALSE),VLOOKUP($C101,#REF!,13,FALSE))","v":{"$error":"#REF!"}},{"$error":"#REF!"},{"$f":"IF(#REF!=\"Tabela Não Desonerada\",VLOOKUP($C101,#REF!,14,FALSE),VLOOKUP($C101,#REF!,14,FALSE))","v":{"$error":"#REF!"}},{"$error":"#REF!"},{"$f":"IF(#REF!=\"Tabela Não Desonerada\",VLOOKUP($C101,#REF!,15,FALSE),VLOOKUP($C101,#REF!,15,FALSE))","v":{"$error":"#REF!"}},{"$error":"#REF!"}]
[1,{"$f":"'Orçamento-TCE'!B102","v":91},{"$f":"'Orçamento-TCE'!C102","v":"10.25"},{"$f":"'Orçamento-TCE'!G102","v":"TOMADA MÉDIA DE EMBUTIR (2 MÓDULOS), 2P+T 20A, INCLUINDO SUPORTE E PLACA. FORNECIMENTO E INSTALAÇÃO. AF_12/2015"},{"$f":"'Orçamento-TCE'!H102","v":23},{"$f":"'Orçamento-TCE'!I102","v":"UN"},{"$f":"Orçamento!H109","v":63.3},{"$f":"Orçamento!I109","v":1455.9},{"$f":"Orçamento!G109","v":0.22159999999999999},1.1122000000000001,null,44.309999999999995,18.990000000000002,{"$error":"#REF!"},{"$f":"IF(#REF!=\"Tabela Não Desonerada\",VLOOKUP($C102,#REF!,13,FALSE),VLOOKUP($C102,#REF!,13,FALSE))","v":{"$error":"#REF!"}},{"$error":"#REF!"},{"$f":"IF(#REF!=\"Tabela Não Desonerada\",VLOOKUP($C102,#REF!,14,FALSE),VLOOKUP($C102,#REF!,14,FALSE))","v":{"$error":"#REF!"}},{"$error":"#REF!"},{"$f":"IF(#REF!=\"Tabela Não Desonerada\",VLOOKUP($C102,#REF!,15,FALSE),VLOOKUP($C102,#REF!,15,FALSE))","v":{"$error":"#REF!"}},{"$error":"#REF!"}]
[1,{"$f":"'Orçamento-TCE'!B103","v":92},{"$f":"'Orçamento-TCE'!C103","v":"10.26"},{"$f":"'Orçamento-TCE'!G103","v":"CABO DE COBRE PP CORDPLAST 3X1,5MM2 HF (NÃO HALOGENADO), 70ºC 450/750V. REF. AFITOX, AFUMEX OU EQUIVALENTE. (LIGAÇÃO PGDM, INTERFONE, FECHO SAA, ILUM. PÓRTICO, LIGAÇÃO LUMINÁRIAS, TOTEM, CUBO, SENSOR PRESENÇA)"},{"$f":"'Orçamento-TCE'!H103","v":97},{"$f":"'Orçamento-TCE'!I103","v":"M"},{"$f":"Orçamento!H110","v":10.32},{"$f":"Orçamento!I110","v":1001.04},{"$f":"Orçamento!G110","v":0.22159999999999999},1.1122000000000001,null,7.2239999999999993,3.096000000000001,{"$error":"#REF!"},{"$f":"IF(#REF!=\"Tabela Não Desonerada\",VLOOKUP($C103,#REF!,13,FALSE),VLOOKUP($C103,#REF!,13,FALSE))","v":{"$error":"#REF!"}},{"$error":"#REF!"},{"$f":"IF(#REF!=\"Tabela Não Desonerada\",VLOOKUP($C103,#REF!,14,FALSE),VLOOKUP($C103,#REF!,14,FALSE))","v":{"$error":"#REF!"}},{"$error":"#REF!"},{"$f":"IF(#REF!=\"Tabela Não Desonerada\",VLOOKUP($C103,#REF!,15,FALSE),VLOOKUP($C103,#REF!,15,FALSE))","v":{"$error":"#REF!"}},{"$error":"#REF!"}]
[1,{"$f":"'Orçamento-TCE'!B104","v":93},{"$f":"'Orçamento-TCE'!C104","v":"10.27"},{"$f":"'Orçamento-TCE'!G104","v":"CONJUNTO PLUGS MACHO/FÊMEA 2P+T 10A/250V NBR 14136 (LIGAÇÃO LUMINÁRIAS)"},{"$f":"'Orçamento-TCE'!H104","v":193},{"$f":"'Orçamento-TCE'!I104","v":"CJ"},{"$f":"Orçamento!H111","v":22.95},{"$f":"Orçamento!I111","v":4429.3500000000004},{"$f":"Orçamento!G111","v":0.22159999999999999},1.1122000000000001,null,16.064999999999998,6.8850000000000016,{"$error":"#REF!"},{"$f":"IF(#REF!=\"Tabela Não Desonerada\",VLOOKUP($C104,#REF!,13,FALSE),VLOOKUP($C104,#REF!,13,FALSE))","v":{"$error":"#REF!"}},{"$error":"#REF!"},{"$f":"IF(#REF!=\"Tabela Não Desonerada\",VLOOKUP($C104,#REF!,14,FALSE),VLOOKUP($C104,#REF!,14,FALSE))","v":{"$error":"#REF!"}},{"$error":"#REF!"},{"$f":"IF(#REF!=\"Tabela Não Desonerada\",VLOOKUP($C104,#REF!,15,FALSE),VLOOKUP($C104,#REF!,15,FALSE))","v":{"$error":"#REF!"}},{"$error":"#REF!"}]
[1,{"$f":"'Orçamento-TCE'!B105","v":94},{"$f":"'Orçamento-TCE'!C105","v":"10.28"},{"$f":"'Orçamento-TCE'!G105","v":"CABO DE COBRE FLEXÍVEL ISOLADO 2,5MM2, ANTI-CHAMA 450/750V, PARA CIRCUITOS TERMINAIS - FORNECIMENTO E INSTALAÇÃO. AF_12/2015"},{"$f":"'Orçamento-TCE'!H105","v":1920},{"$f":"'Orçamento-TCE'!I105","v":"M"},{"$f":"Orçamento!H112","v":5.01},{"$f":"Orçamento!I112","v":9619.2000000000007},{"$f":"Orçamento!G112","v":0.22159999999999999},1.1122000000000001,null,3.5069999999999997,1.5030000000000001,{"$error":"#REF!"},{"$f":"IF(#REF!=\"Tabela Não Desonerada\",VLOOKUP($C105,#REF!,13,FALSE),VLOOKUP($C105,#REF!,13,FALSE))","v":{"$error":"#REF!"}},{"$error":"#REF!"},{"$f":"IF(#REF!=\"Tabela Não Desonerada\",VLOOKUP($C105,#REF!,14,FALSE),VLOOKUP($C105,#REF!,14,FALSE))","v":{"$error":"#REF!"}},{"$error":"#REF!"},{"$f":"IF(#REF!=\"Tabela Não Desonerada\",VLOOKUP($C105,#REF!,15,FALSE),VLOOKUP($C105,#REF!,15,FALSE))","v":{"$error":"#REF!"}},{"$error":"#REF!"}]
[1,{"$f":"'Orçamento-TCE'!B106","v":95},{"$f":"'Orçamento-TCE'!C106","v":"10.29"},{"$f":"'Orçamento-TCE'!G106","v":"CABO DE COBRE FLEXÍVEL ISOLADO 4MM2, ANTI-CHAMA 450/750V, PARA CIRCUITOS TERMINAIS - FORNECIMENTO E INSTALAÇÃO. AF_12/2015"},{"$f":"'Orçamento-TCE'!H106","v":160},{"$f":"'Orçamento-TCE'!I106","v":"M"},{"$f":"Orçamento!H113","v":8.2899999999999991},{"$f":"Orçamento!I113","v":1326.4},{"$f":"Orçamento!G113","v":0.22159999999999999},1.1122000000000001,null,5.802999999999999,2.4870000000000001,{"$error":"#REF!"},{"$f":"IF(#REF!=\"Tabela Não Desonerada\",VLOOKUP($C106,#REF!,13,FALSE),VLOOKUP($C106,#REF!,13,FALSE))","v":{"$error":"#REF!"}},{"$error":"#REF!"},{"$f":"IF(#REF!=\"Tabela Não Desonerada\",VLOOKUP($C106,#REF!,14,FALSE),VLOOKUP($C106,#REF!,14,FALSE))","v":{"$error":"#REF!"}},{"$error":"#REF!"},{"$f":"IF(#REF!=\"Tabela Não Desonerada\",VLOOKUP($C106,#REF!,15,FALSE),VLOOKUP($C106,#REF!,15,FALSE))","v":{"$error":"#REF!"}},{"$error":"#REF!"}]
[1,{"$f":"'Orçamento-TCE'!B107","v":96},{"$f":"'Orçamento-TCE'!C107","v":"10.30"},{"$f":"'Orçamento-TCE'!G107","v":"ELETRODUTO DE AÇO GALVANIZADO, CLASSE LEVE, DN 20MM (3/4\"), APARENTE, INSTALADO EM TETO - FORNECIMENTO E INSTALAÇÃO. AF_11/2016_P"},{"$f":"'Orçamento-TCE'!H107","v":150},{"$f":"'Orçamento-TCE'!I107","v":"M"},{"$f":"Orçamento!H114","v":41.11},{"$f":"Orçamento!I114","v":6166.5},{"$f":"Orçamento!G114","v":0.22159999999999999},1.1122000000000001,null,28.776999999999997,12.333000000000002,{"$error":"#REF!"},{"$f":"IF(#REF!=\"Tabela Não Desonerada\",VLOOKUP($C107,#REF!,13,FALSE),VLOOKUP($C107,#REF!,13,FALSE))","v":{"$error":"#REF!"}},{"$error":"#REF!"},{"$f":"IF(#REF!=\"Tabela Não Desonerada\",VLOOKUP($C107,#REF!,14,FALSE),VLOOKUP($C107,#REF!,14,FALSE))","v":{"$error":"#REF!"}},{"$error":"#REF!"},{"$f":"IF(#REF!=\"Tabela Não Desonerada\",VLOOKUP($C107,#REF!,15,FALSE),VLOOKUP($C107,#REF!,15,FALSE))","v":{"$error":"#REF!"}},{"$error":"#REF!"}]
[1,{"$f":"'Orçamento-TCE'!B108","v":97},{"$f":"'Orçamento-TCE'!C108","v":"10.31"},{"$f":"'Orçamento-TCE'!G108","v":"ELETRODUTO DE AÇO GALVANIZADO, CLASSE LEVE, DN 25MM (1\"), APARENTE, INSTALADO EM TETO - FORNECIMENTO E INSTALAÇÃO. AF_11/2016_P"},{"$f":"'Orçamento-TCE'!H108","v":560},{"$f":"'Orçamento-TCE'!I108","v":"M"},{"$f":"Orçamento!H115","v":51.83},{"$f":"Orçamento!I115","v":29024.799999999999},{"$f":"Orçamento!G115","v":0.22159999999999999},1.1122000000000001,null,36.280999999999999,15.548999999999999,{"$error":"#REF!"},{"$f":"IF(#REF!=\"Tabela Não Desonerada\",VLOOKUP($C108,#REF!,13,FALSE),VLOOKUP($C108,#REF!,13,FALSE))","v":{"$error":"#REF!"}},{"$error":"#REF!"},{"$f":"IF(#REF!=\"Tabela Não Desonerada\",VLOOKUP($C108,#REF!,14,FALSE),VLOOKUP($C108,#REF!,14,FALSE))","v":{"$error":"#REF!"}},{"$error":"#REF!"},{"$f":"IF(#REF!=\"Tabela Não Desonerada\",VLOOKUP($C108,#REF!,15,FALSE),VLOOKUP($C108,#REF!,15,FALSE))","v":{"$error":"#REF!"}},{"$error":"#REF!"}]
[1,{"$f":"'Orçamento-TCE'!B109","v":98},{"$f":"'Orçamento-TCE'!C109","v":"10.32"},{"$f":"'Orçamento-TCE'!G109","v":"ELETRODUTO DE AÇO GALVANIZADO, CLASSE SEMI PESADO, DN 50MM - FORNECIMENTO E INSTALAÇÃO"},{"$f":"'Orçamento-TCE'!H109","v":90},{"$f":"'Orçamento-TCE'!I109","v":"M"},{"$f":"Orçamento!H116","v":108.84},{"$f":"Orçamento!I116","v":9795.6},{"$f":"Orçamento!G116","v":0.22159999999999999},1.1122000000000001,null,76.188000000000002,32.652000000000001,{"$error":"#REF!"},{"$f":"IF(#REF!=\"Tabela Não Desonerada\",VLOOKUP($C109,#REF!,13,FALSE),VLOOKUP($C109,#REF!,13,FALSE))","v":{"$error":"#REF!"}},{"$error":"#REF!"},{"$f":"IF(#REF!=\"Tabela Não Desonerada\",VLOOKUP($C109,#REF!,14,FALSE),VLOOKUP($C109,#REF!,14,FALSE))","v":{"$error":"#REF!"}},{"$error":"#REF!"},{"$f":"IF(#REF!=\"Tabela Não Desonerada\",VLOOKUP($C109,#REF!,15,FALSE),VLOOKUP($C109,#REF!,15,FALSE))","v":{"$error":"#REF!"}},{"$error":"#REF!"}]
[1,{"$f":"'Orçamento-TCE'!B110","v":99},{"$f":"'Orçamento-TCE'!C110","v":"10.33"},{"$f":"'Orçamento-TCE'!G110","v":"BARRAMENTO DE EQUIPOTENCIALIZAÇÃO"},{"$f":"'Orçamento-TCE'!H110","v":1},{"$f":"'Orçamento-TCE'!I110","v":"UN"},{"$f":"Orçamento!H117","v":50.24},{"$f":"Orçamento!I117","v":50.24},{"$f":"Orçamento!G117","v":0.22159999999999999},1.1122000000000001,null,35.167999999999999,15.072000000000003,{"$error":"#REF!"},{"$f":"IF(#REF!=\"Tabela Não Desonerada\",VLOOKUP($C110,#REF!,13,FALSE),VLOOKUP($C110,#REF!,13,FALSE))","v":{"$error":"#REF!"}},{"$error":"#REF!"},{"$f":"IF(#REF!=\"Tabela Não Desonerada\",VLOOKUP($C110,#REF!,14,FALSE),VLOOKUP($C110,#REF!,14,FALSE))","v":{"$error":"#REF!"}},{"$error":"#REF!"},{"$f":"IF(#REF!=\"Tabela Não Desonerada\",VLOOKUP($C110,#REF!,15,FALSE),VLOOKUP($C110,#REF!,15,FALSE))","v":{"$error":"#REF!"}},{"$error":"#REF!"}]
[1,{"$f":"'Orçamento-TCE'!B111","v":100},{"$f":"'Orçamento-TCE'!C111","v":"10.34"},{"$f":"'Orçamento-TCE'!G111","v":"CORDOALHA DE COBRE NU, 50MM2, ENTERRADA, SEM ISOLADOR - FORNECIMENTO E INSTALAÇÃO. AF_12/2017"},{"$f":"'Orçamento-TCE'!H111","v":30},{"$f":"'Orçamento-TCE'!I111","v":"M"},{"$f":"Orçamento!H118","v":67.52},{"$f":"Orçamento!I118","v":2025.6},{"$f":"Orçamento!G118","v":0.22159999999999999},1.1122000000000001,null,47.263999999999996,20.256,{"$error":"#REF!"},{"$f":"IF(#REF!=\"Tabela Não Desonerada\",VLOOKUP($C111,#REF!,13,FALSE),VLOOKUP($C111,#REF!,13,FALSE))","v":{"$error":"#REF!"}},{"$error":"#REF!"},{"$f":"IF(#REF!=\"Tabela Não Desonerada\",VLOOKUP($C111,#REF!,14,FALSE),VLOOKUP($C111,#REF!,14,FALSE))","v":{"$error":"#REF!"}},{"$error":"#REF!"},{"$f":"IF(#REF!=\"Tabela Não Desonerada\",VLOOKUP($C111,#REF!,15,FALSE),VLOOKUP($C111,#REF!,15,FALSE))","v":{"$error":"#REF!"}},{"$error":"#REF!"}]
[1,{"$f":"'Orçamento-TCE'!B112","v":101},{"$f":"'Orçamento-TCE'!C112","v":"10.35"},{"$f":"'Orçamento-TCE'!G112","v":"HASTE DE ATERRAMENTO 3/4 PARA SPDA -FORNECIMENTO E INSTALAÇÃO. AF_12/2017"},{"$f":"'Orçamento-TCE'!H112","v":3},{"$f":"'Orçamento-TCE'!I112","v":"UN"},{"$f":"Orçamento!H119","v":171.62},{"$f":"Orçamento!I119","v":514.86},{"$f":"Orçamento!G119","v":0.22159999999999999},1.1122000000000001,null,120.134,51.486000000000004,{"$error":"#REF!"},{"$f":"IF(#REF!=\"Tabela Não Desonerada\",VLOOKUP($C112,#REF!,13,FALSE),VLOOKUP($C112,#REF!,13,FALSE))","v":{"$error":"#REF!"}},{"$error":"#REF!"},{"$f":"IF(#REF!=\"Tabela Não Desonerada\",VLOOKUP($C112,#REF!,14,FALSE),VLOOKUP($C112,#REF!,14,FALSE))","v":{"$error":"#REF!"}},{"$error":"#REF!"},{"$f":"IF(#REF!=\"Tabela Não Desonerada\",VLOOKUP($C112,#REF!,15,FALSE),VLOOKUP($C112,#REF!,15,FALSE))","v":{"$error":"#REF!"}},{"$error":"#REF!"}]
[1,{"$f":"'Orçamento-TCE'!B113","v":102},{"$f":"'Orçamento-TCE'!C113","v":"10.36"},{"$f":"'Orçamento-TCE'!G113","v":"Fornecimento e instalação de eletrocalha perfurada 300x100x3000mm"},{"$f":"'Orçamento-TCE'!H113","v":170},{"$f":"'Orçamento-TCE'!I113","v":"M"},{"$f":"Orçamento!H120","v":146.88999999999999},{"$f":"Orçamento!I120","v":24971.3},{"$f":"Orçamento!G120","v":0.22159999999999999},1.1122000000000001,null,102.82299999999998,44.067000000000007,{"$error":"#REF!"},{"$f":"IF(#REF!=\"Tabela Não Desonerada\",VLOOKUP($C113,#REF!,13,FALSE),VLOOKUP($C113,#REF!,13,FALSE))","v":{"$error":"#REF!"}},{"$error":"#REF!"},{"$f":"IF(#REF!=\"Tabela Não Desonerada\",VLOOKUP($C113,#REF!,14,FALSE),VLOOKUP($C113,#REF!,14,FALSE))","v":{"$error":"#REF!"}},{"$error":"#REF!"},{"$f":"IF(#REF!=\"Tabela Não Desonerada\",VLOOKUP($C113,#REF!,15,FALSE),VLOOKUP($C113,#REF!,15,FALSE))","v":{"$error":"#REF!"}},{"$error":"#REF!"}]
[1,{"$f":"'Orçamento-TCE'!B114","v":103},{"$f":"'Orçamento-TCE'!C114","v":"10.37"},{"$f":"'Orçamento-TCE'!G114","v":"Tampa de encaixe 300x3000mm, zincada, para eletrocalha metálica"},{"$f":"'Orçamento-TCE'!H114","v":57},{"$f":"'Orçamento-TCE'!I114","v":"UN"},{"$f":"Orçamento!H121","v":156.05000000000001},{"$f":"Orçamento!I121","v":8894.85},{"$f":"Orçamento!G121","v":0.22159999999999999},1.1122000000000001,null,109.235,46.815000000000012,{"$error":"#REF!"},{"$f":"IF(#REF!=\"Tabela Não Desonerada\",VLOOKUP($C114,#REF!,13,FALSE),VLOOKUP($C114,#REF!,13,FALSE))","v":{"$error":"#REF!"}},{"$error":"#REF!"},{"$f":"IF(#REF!=\"Tabela Não Desonerada\",VLOOKUP($C114,#REF!,14,FALSE),VLOOKUP($C114,#REF!,14,FALSE))","v":{"$error":"#REF!"}},{"$error":"#REF!"},{"$f":"IF(#REF!=\"Tabela Não Desonerada\",VLOOKUP($C114,#REF!,15,FALSE),VLOOKUP($C114,#REF!,15,FALSE))","v":{"$error":"#REF!"}},{"$error":"#REF!"}]
[1,{"$f":"'Orçamento-TCE'!B115","v":104},{"$f":"'Orçamento-TCE'!C115","v":"10.38"},{"$f":"'Orçamento-TCE'!G115","v":"Suporte horizontal 300x100mm para fixação de eletrocalha metálica"},{"$f":"'Orçamento-TCE'!H115","v":170},{"$f":"'Orçamento-TCE'!I115","v":"UN"},{"$f":"Orçamento!H122","v":16.11},{"$f":"Orçamento!I122","v":2738.7},{"$f":"Orçamento!G122","v":0.22159999999999999},1.1122000000000001,null,11.276999999999999,4.8330000000000002,{"$error":"#REF!"},{"$f":"IF(#REF!=\"Tabela Não Desonerada\",VLOOKUP($C115,#REF!,13,FALSE),VLOOKUP($C115,#REF!,13,FALSE))","v":{"$error":"#REF!"}},{"$error":"#REF!"},{"$f":"IF(#REF!=\"Tabela Não Desonerada\",VLOOKUP($C115,#REF!,14,FALSE),VLOOKUP($C115,#REF!,14,FALSE))","v":{"$error":"#REF!"}},{"$error":"#REF!"},{"$f":"IF(#REF!=\"Tabela Não Desonerada\",VLOOKUP($C115,#REF!,15,FALSE),VLOOKUP($C115,#REF!,15,FALSE))","v":{"$error":"#REF!"}},{"$error":"#REF!"}]
[1,{"$f":"'Orçamento-TCE'!B116","v":105},{"$f":"'Orçamento-TCE'!C116","v":"10.39"},{"$f":"'Orçamento-TCE'!G116","v":"Fornecimento e instalação de curva vertical em PVC, para eletrocalha, 300x100mm"},{"$f":"'Orçamento-TCE'!H116","v":8},{"$f":"'Orçamento-TCE'!I116","v":"UN"},{"$f":"Orçamento!H123","v":151.86000000000001},{"$f":"Orçamento!I123","v":1214.8800000000001},{"$f":"Orçamento!G123","v":0.22159999999999999},1.1122000000000001,null,106.30200000000001,45.558000000000007,{"$error":"#REF!"},{"$f":"IF(#REF!=\"Tabela Não Desonerada\",VLOOKUP($C116,#REF!,13,FALSE),VLOOKUP($C116,#REF!,13,FALSE))","v":{"$error":"#REF!"}},{"$error":"#REF!"},{"$f":"IF(#REF!=\"Tabela Não Desonerada\",VLOOKUP($C116,#REF!,14,FALSE),VLOOKUP($C116,#REF!,14,FALSE))","v":{"$error":"#REF!"}},{"$error":"#REF!"},{"$f":"IF(#REF!=\"Tabela Não Desonerada\",VLOOKUP($C116,#REF!,15,FALSE),VLOOKUP($C116,#REF!,15,FALSE))","v":{"$error":"#REF!"}},{"$error":"#REF!"}]
[1,{"$f":"'Orçamento-TCE'!B117","v":106},{"$f":"'Orçamento-TCE'!C117","v":"10.40"},{"$f":"'Orçamento-TCE'!G117","v":"Emenda interna 300 x 100 mm com base lisa perfurada para eletrocalha metálica (ref. Mopa ou similar)"},{"$f":"'Orçamento-TCE'!H117","v":169},{"$f":"'Orçamento-TCE'!I117","v":"UN"},{"$f":"Orçamento!H124","v":30.1},{"$f":"Orçamento!I124","v":5086.8999999999996},{"$f":"Orçamento!G124","v":0.22159999999999999},1.1122000000000001,null,21.07,9.0300000000000011,{"$error":"#REF!"},{"$f":"IF(#REF!=\"Tabela Não Desonerada\",VLOOKUP($C117,#REF!,13,FALSE),VLOOKUP($C117,#REF!,13,FALSE))","v":{"$error":"#REF!"}},{"$error":"#REF!"},{"$f":"IF(#REF!=\"Tabela Não Desonerada\",VLOOKUP($C117,#REF!,14,FALSE),VLOOKUP($C117,#REF!,14,FALSE))","v":{"$error":"#REF!"}},{"$error":"#REF!"},{"$f":"IF(#REF!=\"Tabela Não Desonerada\",VLOOKUP($C117,#REF!,15,FALSE),VLOOKUP($C117,#REF!,15,FALSE))","v":{"$error":"#REF!"}},{"$error":"#REF!"}]
[1,{"$f":"'Orçamento-TCE'!B118","v":107},{"$f":"'Orçamento-TCE'!C118","v":"10.41"},{"$f":"'Orçamento-TCE'!G118","v":"Perfilado 38x38mm chapa #18"},{"$f":"'Orçamento-TCE'!H118","v":440},{"$f":"'Orçamento-TCE'!I118","v":"M"},{"$f":"Orçamento!H125","v":42.8},{"$f":"Orçamento!I125","v":18832},{"$f":"Orçamento!G125","v":0.22159999999999999},1.1122000000000001,null,29.959999999999997,12.84,{"$error":"#REF!"},{"$f":"IF(#REF!=\"Tabela Não Desonerada\",VLOOKUP($C118,#REF!,13,FALSE),VLOOKUP($C118,#REF!,13,FALSE))","v":{"$error":"#REF!"}},{"$error":"#REF!"},{"$f":"IF(#REF!=\"Tabela Não Desonerada\",VLOOKUP($C118,#REF!,14,FALSE),VLOOKUP($C118,#REF!,14,FALSE))","v":{"$error":"#REF!"}},{"$error":"#REF!"},{"$f":"IF(#REF!=\"Tabela Não Desonerada\",VLOOKUP($C118,#REF!,15,FALSE),VLOOKUP($C118,#REF!,15,FALSE))","v":{"$error":"#REF!"}},{"$error":"#REF!"}]
[1,{"$f":"'Orçamento-TCE'!B119","v":108},{"$f":"'Orçamento-TCE'!C119","v":"10.42"},{"$f":"'Orçamento-TCE'!G119","v":"Suporte longo para perfilado 38x38MM"},{"$f":"'Orçamento-TCE'!H119","v":440},{"$f":"'Orçamento-TCE'!I119","v":"UN"},{"$f":"Orçamento!H126","v":1.89},{"$f":"Orçamento!I126","v":831.6},{"$f":"Orçamento!G126","v":0.22159999999999999},1.1122000000000001,null,1.323,0.56699999999999995,{"$error":"#REF!"},{"$f":"IF(#REF!=\"Tabela Não Desonerada\",VLOOKUP($C119,#REF!,13,FALSE),VLOOKUP($C119,#REF!,13,FALSE))","v":{"$error":"#REF!"}},{"$error":"#REF!"},{"$f":"IF(#REF!=\"Tabela Não Desonerada\",VLOOKUP($C119,#REF!,14,FALSE),VLOOKUP($C119,#REF!,14,FALSE))","v":{"$error":"#REF!"}},{"$error":"#REF!"},{"$f":"IF(#REF!=\"Tabela Não Desonerada\",VLOOKUP($C119,#REF!,15,FALSE),VLOOKUP($C119,#REF!,15,FALSE))","v":{"$error":"#REF!"}},{"$error":"#REF!"}]
[1,{"$f":"'Orçamento-TCE'!B120","v":109},{"$f":"'Orçamento-TCE'!C120","v":"10.43"},{"$f":"'Orçamento-TCE'!G120","v":"Vergalhão rosca total 1/4\""},{"$f":"'Orçamento-TCE'!H120","v":450},{"$f":"'Orçamento-TCE'!I120","v":"M"},{"$f":"Orçamento!H127","v":24.72},{"$f":"Orçamento!I127","v":11124},{"$f":"Orçamento!G127","v":0.22159999999999999},1.1122000000000001,null,17.303999999999998,7.4160000000000004,{"$error":"#REF!"},{"$f":"IF(#REF!=\"Tabela Não Desonerada\",VLOOKUP($C120,#REF!,13,FALSE),VLOOKUP($C120,#REF!,13,FALSE))","v":{"$error":"#REF!"}},{"$error":"#REF!"},{"$f":"IF(#REF!=\"Tabela Não Desonerada\",VLOOKUP($C120,#REF!,14,FALSE),VLOOKUP($C120,#REF!,14,FALSE))","v":{"$error":"#REF!"}},{"$error":"#REF!"},{"$f":"IF(#REF!=\"Tabela Não Desonerada\",VLOOKUP($C120,#REF!,15,FALSE),VLOOKUP($C120,#REF!,15,FALSE))","v":{"$error":"#REF!"}},{"$error":"#REF!"}]
[1,{"$f":"'Orçamento-TCE'!B121","v":110},{"$f":"'Orçamento-TCE'!C121","v":"10.44"},{"$f":"'Orçamento-TCE'!G121","v":"Chumbador rosca interna 1/4\""},{"$f":"'Orçamento-TCE'!H121","v":225},{"$f":"'Orçamento-TCE'!I121","v":"UN"},{"$f":"Orçamento!H128","v":34.659999999999997},{"$f":"Orçamento!I128","v":7798.5},{"$f":"Orçamento!G128","v":0.22159999999999999},1.1122000000000001,null,24.261999999999997,10.398,{"$error":"#REF!"},{"$f":"IF(#REF!=\"Tabela Não Desonerada\",VLOOKUP($C121,#REF!,13,FALSE),VLOOKUP($C121,#REF!,13,FALSE))","v":{"$error":"#REF!"}},{"$error":"#REF!"},{"$f":"IF(#REF!=\"Tabela Não Desonerada\",VLOOKUP($C121,#REF!,14,FALSE),VLOOKUP($C121,#REF!,14,FALSE))","v":{"$error":"#REF!"}},{"$error":"#REF!"},{"$f":"IF(#REF!=\"Tabela Não Desonerada\",VLOOKUP($C121,#REF!,15,FALSE),VLOOKUP($C121,#REF!,15,FALSE))","v":{"$error":"#REF!"}},{"$error":"#REF!"}]
[1,{"$f":"'Orçamento-TCE'!B122","v":111},{"$f":"'Orçamento-TCE'!C122","v":"10.45"},{"$f":"'Orçamento-TCE'!G122","v":"TRANSFORMADOR TRIFÁSICO A SECO, PN=225KVA, CLASSE 15KV - BT 220/127V - 60HZ, IP00."},{"$f":"'Orçamento-TCE'!H122","v":1},{"$f":"'Orçamento-TCE'!I122","v":"UN"},{"$f":"Orçamento!H129","v":34088.78},{"$f":"Orçamento!I129","v":34088.78},{"$f":"Orçamento!G129","v":0.22159999999999999},1.1122000000000001,null,23862.145999999997,10226.634000000002,{"$error":"#REF!"},{"$f":"IF(#REF!=\"Tabela Não Desonerada\",VLOOKUP($C122,#REF!,13,FALSE),VLOOKUP($C122,#REF!,13,FALSE))","v":{"$error":"#REF!"}},{"$error":"#REF!"},{"$f":"IF(#REF!=\"Tabela Não Desonerada\",VLOOKUP($C122,#REF!,14,FALSE),VLOOKUP($C122,#REF!,14,FALSE))","v":{"$error":"#REF!"}},{"$error":"#REF!"},{"$f":"IF(#REF!=\"Tabela Não Desonerada\",VLOOKUP($C122,#REF!,15,FALSE),VLOOKUP($C122,#REF!,15,FALSE))","v":{"$error":"#REF!"}},{"$error":"#REF!"}]
[1,{"$f":"'Orçamento-TCE'!B123","v":112},{"$f":"'Orçamento-TCE'!C123","v":"10.46"},{"$f":"'Orçamento-TCE'!G123","v":"CABO DE COBRE UNIPOLAR #35MM² BLINDADO, ISOLAÇÃO 12/20KV EPR - COBERTURA EM PVC"},{"$f":"'Orçamento-TCE'!H123","v":300},{"$f":"'Orçamento-TCE'!I123","v":"M"},{"$f":"Orçamento!H130","v":127.22},{"$f":"Orçamento!I130","v":38166},{"$f":"Orçamento!G130","v":0.22159999999999999},1.1122000000000001,null,89.053999999999988,38.166000000000011,{"$error":"#REF!"},{"$f":"IF(#REF!=\"Tabela Não Desonerada\",VLOOKUP($C123,#REF!,13,FALSE),VLOOKUP($C123,#REF!,13,FALSE))","v":{"$error":"#REF!"}},{"$error":"#REF!"},{"$f":"IF(#REF!=\"Tabela Não Desonerada\",VLOOKUP($C123,#REF!,14,FALSE),VLOOKUP($C123,#REF!,14,FALSE))","v":{"$error":"#REF!"}},{"$error":"#REF!"},{"$f":"IF(#REF!=\"Tabela Não Desonerada\",VLOOKUP($C123,#REF!,15,FALSE),VLOOKUP($C123,#REF!,15,FALSE))","v":{"$error":"#REF!"}},{"$error":"#REF!"}]
[1,{"$f":"'Orçamento-TCE'!B124","v":113},{"$f":"'Orçamento-TCE'!C124","v":"10.47"},{"$f":"'Orçamento-TCE'!G124","v":"TERMINAÇÃO TERMOCONTRÁTIL PARA CABO 35MM2, CLASSE 15kV (PARA USO EXTERNO)"},{"$f":"'Orçamento-TCE'!H124","v":3},{"$f":"'Orçamento-TCE'!I124","v":"UN"},{"$f":"Orçamento!H131","v":317.83999999999997},{"$f":"Orçamento!I131","v":953.52},{"$f":"Orçamento!G131","v":0.22159999999999999},1.1122000000000001,null,222.48799999999997,95.352000000000004,{"$error":"#REF!"},{"$f":"IF(#REF!=\"Tabela Não Desonerada\",VLOOKUP($C124,#REF!,13,FALSE),VLOOKUP($C124,#REF!,13,FALSE))","v":{"$error":"#REF!"}},{"$error":"#REF!"},{"$f":"IF(#REF!=\"Tabela Não Desonerada\",VLOOKUP($C124,#REF!,14,FALSE),VLOOKUP($C124,#REF!,14,FALSE))","v":{"$error":"#REF!"}},{"$error":"#REF!"},{"$f":"IF(#REF!=\"Tabela Não Desonerada\",VLOOKUP($C124,#REF!,15,FALSE),VLOOKUP($C124,#REF!,15,FALSE))","v":{"$error":"#REF!"}},{"$error":"#REF!"}]
[1,{"$f":"'Orçamento-TCE'!B125","v":114},{"$f":"'Orçamento-TCE'!C125","v":"10.48"},{"$f":"'Orçamento-TCE'!G125","v":"TERMINAÇÃO TERMOCONTRÁTIL PARA CABO 35MM2, CLASSE 15kV (PARA USO INTERNO)"},{"$f":"'Orçamento-TCE'!H125","v":3},{"$f":"'Orçamento-TCE'!I125","v":"UN"},{"$f":"Orçamento!H132","v":317.58999999999997},{"$f":"Orçamento!I132","v":952.77},{"$f":"Orçamento!G132","v":0.22159999999999999},1.1122000000000001,null,222.31299999999996,95.277000000000015,{"$error":"#REF!"},{"$f":"IF(#REF!=\"Tabela Não Desonerada\",VLOOKUP($C125,#REF!,13,FALSE),VLOOKUP($C125,#REF!,13,FALSE))","v":{"$error":"#REF!"}},{"$error":"#REF!"},{"$f":"IF(#REF!=\"Tabela Não Desonerada\",VLOOKUP($C125,#REF!,14,FALSE),VLOOKUP($C125,#REF!,14,FALSE))","v":{"$error":"#REF!"}},{"$error":"#REF!"},{"$f":"IF(#REF!=\"Tabela Não Desonerada\",VLOOKUP($C125,#REF!,15,FALSE),VLOOKUP($C125,#REF!,15,FALSE))","v":{"$error":"#REF!"}},{"$error":"#REF!"}]
[1,{"$f":"'Orçamento-TCE'!B126","v":115},{"$f":"'Orçamento-TCE'!C126","v":"10.49"},{"$f":"'Orçamento-TCE'!G126","v":"SECCIONADORA TRIPOLAR SECA 15KV-400A-TSI 95KV-COMANDO POR PUNHO"},{"$f":"'Orçamento-TCE'!H126","v":1},{"$f":"'Orçamento-TCE'!I126","v":"UN"},{"$f":"Orçamento!H133","v":1688.14},{"$f":"Orçamento!I133","v":1688.14},{"$f":"Orçamento!G133","v":0.22159999999999999},1.1122000000000001,null,1181.6980000000001,506.44200000000001,{"$error":"#REF!"},{"$f":"IF(#REF!=\"Tabela Não Desonerada\",VLOOKUP($C126,#REF!,13,FALSE),VLOOKUP($C126,#REF!,13,FALSE))","v":{"$error":"#REF!"}},{"$error":"#REF!"},{"$f":"IF(#REF!=\"Tabela Não Desonerada\",VLOOKUP($C126,#REF!,14,FALSE),VLOOKUP($C126,#REF!,14,FALSE))","v":{"$error":"#REF!"}},{"$error":"#REF!"},{"$f":"IF(#REF!=\"Tabela Não Desonerada\",VLOOKUP($C126,#REF!,15,FALSE),VLOOKUP($C126,#REF!,15,FALSE))","v":{"$error":"#REF!"}},{"$error":"#REF!"}]
[1,{"$f":"'Orçamento-TCE'!B127","v":116},{"$f":"'Orçamento-TCE'!C127","v":"10.50"},{"$f":"'Orçamento-TCE'!G127","v":"SECCIONADORA TRIPOLAR FUSÍVEL 15KV-400A-TSI95KV-COMANDO POR PUNHO ABERTURA MÍNIMA 18CM-RUPTURA MÌNIMA 30KA-COM FUSÍVEL HH ABERTURA SOB CARGA"},{"$f":"'Orçamento-TCE'!H127","v":1},{"$f":"'Orçamento-TCE'!I127","v":"UN"},{"$f":"Orçamento!H134","v":3516.65},{"$f":"Orçamento!I134","v":3516.65},{"$f":"Orçamento!G134","v":0.22159999999999999},1.1122000000000001,null,2461.6549999999997,1054.9950000000003,{"$error":"#REF!"},{"$f":"IF(#REF!=\"Tabela Não Desonerada\",VLOOKUP($C127,#REF!,13,FALSE),VLOOKUP($C127,#REF!,13,FALSE))","v":{"$error":"#REF!"}},{"$error":"#REF!"},{"$f":"IF(#REF!=\"Tabela Não Desonerada\",VLOOKUP($C127,#REF!,14,FALSE),VLOOKUP($C127,#REF!,14,FALSE))","v":{"$error":"#REF!"}},{"$error":"#REF!"},{"$f":"IF(#REF!=\"Tabela Não Desonerada\",VLOOKUP($C127,#REF!,15,FALSE),VLOOKUP($C127,#REF!,15,FALSE))","v":{"$error":"#REF!"}},{"$error":"#REF!"}]
[1,{"$f":"'Orçamento-TCE'!B128","v":117},{"$f":"'Orçamento-TCE'!C128","v":"10.51"},{"$f":"'Orçamento-TCE'!G128","v":"PUNHO DE ACIONAMENTO DA SECCIONADORA C/ MICROINTERRUPTOR DO INTERTRAVAMENTO ELÉTRICO, DIRETAMENTE ATERRADO"},{"$f":"'Orçamento-TCE'!H128","v":1},{"$f":"'Orçamento-TCE'!I128","v":"UN"},{"$f":"Orçamento!H135","v":404.47},{"$f":"Orçamento!I135","v":404.47},{"$f":"Orçamento!G135","v":0.22159999999999999},1.1122000000000001,null,283.12900000000002,121.34100000000001,{"$error":"#REF!"},{"$f":"IF(#REF!=\"Tabela Não Desonerada\",VLOOKUP($C128,#REF!,13,FALSE),VLOOKUP($C128,#REF!,13,FALSE))","v":{"$error":"#REF!"}},{"$error":"#REF!"},{"$f":"IF(#REF!=\"Tabela Não Desonerada\",VLOOKUP($C128,#REF!,14,FALSE),VLOOKUP($C128,#REF!,14,FALSE))","v":{"$error":"#REF!"}},{"$error":"#REF!"},{"$f":"IF(#REF!=\"Tabela Não Desonerada\",VLOOKUP($C128,#REF!,15,FALSE),VLOOKUP($C128,#REF!,15,FALSE))","v":{"$error":"#REF!"}},{"$error":"#REF!"}]
[1,{"$f":"'Orçamento-TCE'!B129","v":118},{"$f":"'Orçamento-TCE'!C129","v":"10.52"},{"$f":"'Orçamento-TCE'!G129","v":"PLACA DE SINALIZAÇÃO DE SEGURANÇA CONTRA INCÊNDIO, FOTOLUMINISCENTE, RETANGULAR, 20X40CM EM PVC 2MM, ANTI-CHAMAS (SÍMBOLOS, CORES E PICTOGRAMAS CONFORME NBR 13434)"},{"$f":"'Orçamento-TCE'!H129","v":3},{"$f":"'Orçamento-TCE'!I129","v":"UN"},{"$f":"Orçamento!H136","v":45.5},{"$f":"Orçamento!I136","v":136.5},{"$f":"Orçamento!G136","v":0.22159999999999999},1.1122000000000001,null,31.849999999999998,13.650000000000002,{"$error":"#REF!"},{"$f":"IF(#REF!=\"Tabela Não Desonerada\",VLOOKUP($C129,#REF!,13,FALSE),VLOOKUP($C129,#REF!,13,FALSE))","v":{"$error":"#REF!"}},{"$error":"#REF!"},{"$f":"IF(#REF!=\"Tabela Não Desonerada\",VLOOKUP($C129,#REF!,14,FALSE),VLOOKUP($C129,#REF!,14,FALSE))","v":{"$error":"#REF!"}},{"$error":"#REF!"},{"$f":"IF(#REF!=\"Tabela Não Desonerada\",VLOOKUP($C129,#REF!,15,FALSE),VLOOKUP($C129,#REF!,15,FALSE))","v":{"$error":"#REF!"}},{"$error":"#REF!"}]
[1,{"$f":"'Orçamento-TCE'!B130","v":119},{"$f":"'Orçamento-TCE'!C130","v":"10.53"},{"$f":"'Orçamento-TCE'!G130","v":"QUADRO COM DIAGRAMA UNIFILAR DA SUBESTAÇÃO"},{"$f":"'Orçamento-TCE'!H130","v":1},{"$f":"'Orçamento-TCE'!I130","v":"UN"},{"$f":"Orçamento!H137","v":656.66},{"$f":"Orçamento!I137","v":656.66},{"$f":"Orçamento!G137","v":0.22159999999999999},1.1122000000000001,null,459.66199999999992,196.99800000000005,{"$error":"#REF!"},{"$f":"IF(#REF!=\"Tabela Não Desonerada\",VLOOKUP($C130,#REF!,13,FALSE),VLOOKUP($C130,#REF!,13,FALSE))","v":{"$error":"#REF!"}},{"$error":"#REF!"},{"$f":"IF(#REF!=\"Tabela Não Desonerada\",VLOOKUP($C130,#REF!,14,FALSE),VLOOKUP($C130,#REF!,14,FALSE))","v":{"$error":"#REF!"}},{"$error":"#REF!"},{"$f":"IF(#REF!=\"Tabela Não Desonerada\",VLOOKUP($C130,#REF!,15,FALSE),VLOOKUP($C130,#REF!,15,FALSE))","v":{"$error":"#REF!"}},{"$error":"#REF!"}]
[1,{"$f":"'Orçamento-TCE'!B131","v":120},{"$f":"'Orçamento-TCE'!C131","v":"10.54"},{"$f":"'Orçamento-TCE'!G131","v":"PISO DE BORRACHA FRISADO OU PASTILHADO, PRETO, EM PLACAS DE 50X50CM, E=7MM, PARA ARGAMASSA"},{"$f":"'Orçamento-TCE'!H131","v":0.25},{"$f":"'Orçamento-TCE'!I131","v":"M2"},{"$f":"Orçamento!H138","v":220.56},{"$f":"Orçamento!I138","v":55.14},{"$f":"Orçamento!G138","v":0.22159999999999999},1.1122000000000001,null,154.392,66.168000000000006,{"$error":"#REF!"},{"$f":"IF(#REF!=\"Tabela Não Desonerada\",VLOOKUP($C131,#REF!,13,FALSE),VLOOKUP($C131,#REF!,13,FALSE))","v":{"$error":"#REF!"}},{"$error":"#REF!"},{"$f":"IF(#REF!=\"Tabela Não Desonerada\",VLOOKUP($C131,#REF!,14,FALSE),VLOOKUP($C131,#REF!,14,FALSE))","v":{"$error":"#REF!"}},{"$error":"#REF!"},{"$f":"IF(#REF!=\"Tabela Não Desonerada\",VLOOKUP($C131,#REF!,15,FALSE),VLOOKUP($C131,#REF!,15,FALSE))","v":{"$error":"#REF!"}},{"$error":"#REF!"}]
[1,{"$f":"'Orçamento-TCE'!B132","v":121},{"$f":"'Orçamento-TCE'!C132","v":"11.1"},{"$f":"'Orçamento-TCE'!G132","v":"TUBO, PPR, DN 25, CLASSE PN 20, INSTALADO EM RAMAL OU SUB-RAMAL DE ÁGUA - FORNECIMENTO E INSTALAÇÃO. AF_06/2015"},{"$f":"'Orçamento-TCE'!H132","v":60},{"$f":"'Orçamento-TCE'!I132","v":"M"},{"$f":"Orçamento!H140","v":34.33},{"$f":"Orçamento!I140","v":2059.8000000000002},{"$f":"Orçamento!G140","v":0.22159999999999999},1.1122000000000001,null,24.030999999999999,10.298999999999999,{"$error":"#REF!"},{"$f":"IF(#REF!=\"Tabela Não Desonerada\",VLOOKUP($C132,#REF!,13,FALSE),VLOOKUP($C132,#REF!,13,FALSE))","v":{"$error":"#REF!"}},{"$error":"#REF!"},{"$f":"IF(#REF!=\"Tabela Não Desonerada\",VLOOKUP($C132,#REF!,14,FALSE),VLOOKUP($C132,#REF!,14,FALSE))","v":{"$error":"#REF!"}},{"$error":"#REF!"},{"$f":"IF(#REF!=\"Tabela Não Desonerada\",VLOOKUP($C132,#REF!,15,FALSE),VLOOKUP($C132,#REF!,15,FALSE))","v":{"$error":"#REF!"}},{"$error":"#REF!"}]
[1,{"$f":"'Orçamento-TCE'!B133","v":122},{"$f":"'Orçamento-TCE'!C133","v":"11.2"},{"$f":"'Orçamento-TCE'!G133","v":"TUBO, PVC, SOLDÁVEL, DN 25MM, INSTALADO EM RAMAL OU SUB-RAMAL DE ÁGUA - FORNECIMENTO E INSTALAÇÃO. AF_12/2014"},{"$f":"'Orçamento-TCE'!H133","v":157},{"$f":"'Orçamento-TCE'!I133","v":"M"},{"$f":"Orçamento!H141","v":26.18},{"$f":"Orçamento!I141","v":4110.26},{"$f":"Orçamento!G141","v":0.22159999999999999},1.1122000000000001,null,18.325999999999997,7.8540000000000028,{"$error":"#REF!"},{"$f":"IF(#REF!=\"Tabela Não Desonerada\",VLOOKUP($C133,#REF!,13,FALSE),VLOOKUP($C133,#REF!,13,FALSE))","v":{"$error":"#REF!"}},{"$error":"#REF!"},{"$f":"IF(#REF!=\"Tabela Não Desonerada\",VLOOKUP($C133,#REF!,14,FALSE),VLOOKUP($C133,#REF!,14,FALSE))","v":{"$error":"#REF!"}},{"$error":"#REF!"},{"$f":"IF(#REF!=\"Tabela Não Desonerada\",VLOOKUP($C133,#REF!,15,FALSE),VLOOKUP($C133,#REF!,15,FALSE))","v":{"$error":"#REF!"}},{"$error":"#REF!"}]
[1,{"$f":"'Orçamento-TCE'!B134","v":123},{"$f":"'Orçamento-TCE'!C134","v":"11.3"},{"$f":"'Orçamento-TCE'!G134","v":"TUBO, PPR, DN 32, CLASSE PN 12, INSTALADO EM RAMAL DE DISTRIBUIÇÃO DE ÁGUA - FORNECIMENTO E INSTALAÇÃO. AF_06/2015"},{"$f":"'Orçamento-TCE'!H134","v":17},{"$f":"'Orçamento-TCE'!I134","v":"M"},{"$f":"Orçamento!H142","v":30.52},{"$f":"Orçamento!I142","v":518.84},{"$f":"Orçamento!G142","v":0.22159999999999999},1.1122000000000001,null,21.363999999999997,9.1560000000000024,{"$error":"#REF!"},{"$f":"IF(#REF!=\"Tabela Não Desonerada\",VLOOKUP($C134,#REF!,13,FALSE),VLOOKUP($C134,#REF!,13,FALSE))","v":{"$error":"#REF!"}},{"$error":"#REF!"},{"$f":"IF(#REF!=\"Tabela Não Desonerada\",VLOOKUP($C134,#REF!,14,FALSE),VLOOKUP($C134,#REF!,14,FALSE))","v":{"$error":"#REF!"}},{"$error":"#REF!"},{"$f":"IF(#REF!=\"Tabela Não Desonerada\",VLOOKUP($C134,#REF!,15,FALSE),VLOOKUP($C134,#REF!,15,FALSE))","v":{"$error":"#REF!"}},{"$error":"#REF!"}]
[1,{"$f":"'Orçamento-TCE'!B135","v":124},{"$f":"'Orçamento-TCE'!C135","v":"11.4"},{"$f":"'Orçamento-TCE'!G135","v":"TUBO, PVC, SOLDÁVEL, DN 32MM, INSTALADO EM RAMAL OU SUB-RAMAL DE ÁGUA - FORNECIMENTO E INSTALAÇÃO. AF_12/2014"},{"$f":"'Orçamento-TCE'!H135","v":15},{"$f":"'Orçamento-TCE'!I135","v":"M"},{"$f":"Orçamento!H143","v":39.729999999999997},{"$f":"Orçamento!I143","v":595.95000000000005},{"$f":"Orçamento!G143","v":0.22159999999999999},1.1122000000000001,null,27.810999999999996,11.919,{"$error":"#REF!"},{"$f":"IF(#REF!=\"Tabela Não Desonerada\",VLOOKUP($C135,#REF!,13,FALSE),VLOOKUP($C135,#REF!,13,FALSE))","v":{"$error":"#REF!"}},{"$error":"#REF!"},{"$f":"IF(#REF!=\"Tabela Não Desonerada\",VLOOKUP($C135,#REF!,14,FALSE),VLOOKUP($C135,#REF!,14,FALSE))","v":{"$error":"#REF!"}},{"$error":"#REF!"},{"$f":"IF(#REF!=\"Tabela Não Desonerada\",VLOOKUP($C135,#REF!,15,FALSE),VLOOKUP($C135,#REF!,15,FALSE))","v":{"$error":"#REF!"}},{"$error":"#REF!"}]
[1,{"$f":"'Orçamento-TCE'!B136","v":125},{"$f":"'Orçamento-TCE'!C136","v":"11.5"},{"$f":"'Orçamento-TCE'!G136","v":"TUBO, PVC, SOLDÁVEL, DN 40MM, INSTALADO EM PRUMADA DE ÁGUA - FORNECIMENTO E INSTALAÇÃO. AF_12/2014"},{"$f":"'Orçamento-TCE'!H136","v":14},{"$f":"'Orçamento-TCE'!I136","v":"M"},{"$f":"Orçamento!H144","v":27.63},{"$f":"Orçamento!I144","v":386.82},{"$f":"Orçamento!G144","v":0.22159999999999999},1.1122000000000001,null,19.340999999999998,8.2890000000000015,{"$error":"#REF!"},{"$f":"IF(#REF!=\"Tabela Não Desonerada\",VLOOKUP($C136,#REF!,13,FALSE),VLOOKUP($C136,#REF!,13,FALSE))","v":{"$error":"#REF!"}},{"$error":"#REF!"},{"$f":"IF(#REF!=\"Tabela Não Desonerada\",VLOOKUP($C136,#REF!,14,FALSE),VLOOKUP($C136,#REF!,14,FALSE))","v":{"$error":"#REF!"}},{"$error":"#REF!"},{"$f":"IF(#REF!=\"Tabela Não Desonerada\",VLOOKUP($C136,#REF!,15,FALSE),VLOOKUP($C136,#REF!,15,FALSE))","v":{"$error":"#REF!"}},{"$error":"#REF!"}]
[1,{"$f":"'Orçamento-TCE'!B137","v":126},{"$f":"'Orçamento-TCE'!C137","v":"11.6"},{"$f":"'Orçamento-TCE'!G137","v":"TUBO PVC SÉRIE NORMAL, ESGOTO PREDIAL, DN 40MM, FORNECIDO E INSTALADO EM RAMAL DE DESCARGA OU RAMAL DE ESGOTO SANITÁRIO. AF_12/2014"},{"$f":"'Orçamento-TCE'!H137","v":102},{"$f":"'Orçamento-TCE'!I137","v":"M"},{"$f":"Orçamento!H145","v":23.63},{"$f":"Orçamento!I145","v":2410.2600000000002},{"$f":"Orçamento!G145","v":0.22159999999999999},1.1122000000000001,null,16.540999999999997,7.0890000000000022,{"$error":"#REF!"},{"$f":"IF(#REF!=\"Tabela Não Desonerada\",VLOOKUP($C137,#REF!,13,FALSE),VLOOKUP($C137,#REF!,13,FALSE))","v":{"$error":"#REF!"}},{"$error":"#REF!"},{"$f":"IF(#REF!=\"Tabela Não Desonerada\",VLOOKUP($C137,#REF!,14,FALSE),VLOOKUP($C137,#REF!,14,FALSE))","v":{"$error":"#REF!"}},{"$error":"#REF!"},{"$f":"IF(#REF!=\"Tabela Não Desonerada\",VLOOKUP($C137,#REF!,15,FALSE),VLOOKUP($C137,#REF!,15,FALSE))","v":{"$error":"#REF!"}},{"$error":"#REF!"}]
[1,{"$f":"'Orçamento-TCE'!B138","v":127},{"$f":"'Orçamento-TCE'!C138","v":"11.7"},{"$f":"'Orçamento-TCE'!G138","v":"TUBO, PVC, SOLDÁVEL, DN 50MM, INSTALADO EM PRUMADA DE ÁGUA - FORNECIMENTO E INSTALAÇÃO. AF_12/2014"},{"$f":"'Orçamento-TCE'!H138","v":40},{"$f":"'Orçamento-TCE'!I138","v":"M"},{"$f":"Orçamento!H146","v":31.74},{"$f":"Orçamento!I146","v":1269.5999999999999},{"$f":"Orçamento!G146","v":0.22159999999999999},1.1122000000000001,null,22.217999999999996,9.522000000000002,{"$error":"#REF!"},{"$f":"IF(#REF!=\"Tabela Não Desonerada\",VLOOKUP($C138,#REF!,13,FALSE),VLOOKUP($C138,#REF!,13,FALSE))","v":{"$error":"#REF!"}},{"$error":"#REF!"},{"$f":"IF(#REF!=\"Tabela Não Desonerada\",VLOOKUP($C138,#REF!,14,FALSE),VLOOKUP($C138,#REF!,14,FALSE))","v":{"$error":"#REF!"}},{"$error":"#REF!"},{"$f":"IF(#REF!=\"Tabela Não Desonerada\",VLOOKUP($C138,#REF!,15,FALSE),VLOOKUP($C138,#REF!,15,FALSE))","v":{"$error":"#REF!"}},{"$error":"#REF!"}]
[1,{"$f":"'Orçamento-TCE'!B139","v":128},{"$f":"'Orçamento-TCE'!C139","v":"11.8"},{"$f":"'Orçamento-TCE'!G139","v":"TUBO PVC SÉRIE NORMAL, ESGOTO PREDIAL, DN 50MM, FORNECIDO E INSTALADO EM RAMAL DE DESCARGA OU RAMAL DE ESGOTO SANITÁRIO. AF_12/2014"},{"$f":"'Orçamento-TCE'!H139","v":134},{"$f":"'Orçamento-TCE'!I139","v":"M"},{"$f":"Orçamento!H147","v":36.700000000000003},{"$f":"Orçamento!I147","v":4917.8},{"$f":"Orçamento!G147","v":0.22159999999999999},1.1122000000000001,null,25.69,11.010000000000002,{"$error":"#REF!"},{"$f":"IF(#REF!=\"Tabela Não Desonerada\",VLOOKUP($C139,#REF!,13,FALSE),VLOOKUP($C139,#REF!,13,FALSE))","v":{"$error":"#REF!"}},{"$error":"#REF!"},{"$f":"IF(#REF!=\"Tabela Não Desonerada\",VLOOKUP($C139,#REF!,14,FALSE),VLOOKUP($C139,#REF!,14,FALSE))","v":{"$error":"#REF!"}},{"$error":"#REF!"},{"$f":"IF(#REF!=\"Tabela Não Desonerada\",VLOOKUP($C139,#REF!,15,FALSE),VLOOKUP($C139,#REF!,15,FALSE))","v":{"$error":"#REF!"}},{"$error":"#REF!"}]
[1,{"$f":"'Orçamento-TCE'!B140","v":129},{"$f":"'Orçamento-TCE'!C140","v":"11.9"},{"$f":"'Orçamento-TCE'!G140","v":"TUBO, PVC, SOLDÁVEL, DN 75MM, INSTALADO EM PRUMADA DE ÁGUA - FORNECIMENTO E INSTALAÇÃO. AF_12/2014"},{"$f":"'Orçamento-TCE'!H140","v":155},{"$f":"'Orçamento-TCE'!I140","v":"M"},{"$f":"Orçamento!H148","v":87.76},{"$f":"Orçamento!I148","v":13602.8},{"$f":"Orçamento!G148","v":0.22159999999999999},1.1122000000000001,null,61.432000000000002,26.328000000000003,{"$error":"#REF!"},{"$f":"IF(#REF!=\"Tabela Não Desonerada\",VLOOKUP($C140,#REF!,13,FALSE),VLOOKUP($C140,#REF!,13,FALSE))","v":{"$error":"#REF!"}},{"$error":"#REF!"},{"$f":"IF(#REF!=\"Tabela Não Desonerada\",VLOOKUP($C140,#REF!,14,FALSE),VLOOKUP($C140,#REF!,14,FALSE))","v":{"$error":"#REF!"}},{"$error":"#REF!"},{"$f":"IF(#REF!=\"Tabela Não Desonerada\",VLOOKUP($C140,#REF!,15,FALSE),VLOOKUP($C140,#REF!,15,FALSE))","v":{"$error":"#REF!"}},{"$error":"#REF!"}]
[1,{"$f":"'Orçamento-TCE'!B141","v":130},{"$f":"'Orçamento-TCE'!C141","v":"11.10"},{"$f":"'Orçamento-TCE'!G141","v":"TUBO PVC SÉRIE NORMAL, ESGOTO PREDIAL, DN 75MM, FORNECIDO E INSTALADO EM RAMAL DE DESCARGA OU RAMAL DE ESGOTO SANITÁRIO. AF_12/2014"},{"$f":"'Orçamento-TCE'!H141","v":19},{"$f":"'Orçamento-TCE'!I141","v":"M"},{"$f":"Orçamento!H149","v":56.11},{"$f":"Orçamento!I149","v":1066.0899999999999},{"$f":"Orçamento!G149","v":0.22159999999999999},1.1122000000000001,null,{"$f":"G141*0.7","v":39.276999999999994},{"$f":"G141-L141","v":16.833000000000006},{"$f":"P141","v":{"$error":"#REF!"}},{"$f":"IF(#REF!=\"Tabela Não Desonerada\",VLOOKUP($C141,#REF!,13,FALSE),VLOOKUP($C141,#REF!,13,FALSE))","v":{"$error":"#REF!"}},{"$f":"O141/E141","v":{"$error":"#REF!"}},{"$f":"IF(#REF!=\"Tabela Não Desonerada\",VLOOKUP($C141,#REF!,14,FALSE),VLOOKUP($C141,#REF!,14,FALSE))","v":{"$error":"#REF!"}},{"$f":"Q141/E141","v":{"$error":"#REF!"}},{"$f":"IF(#REF!=\"Tabela Não Desonerada\",VLOOKUP($C141,#REF!,15,FALSE),VLOOKUP($C141,#REF!,15,FALSE))","v":{"$error":"#REF!"}},{"$f":"S141/E141","v":{"$error":"#REF!"}}]
[1,{"$f":"'Orçamento-TCE'!B142","v":131},{"$f":"'Orçamento-TCE'!C142","v":"11.11"},{"$f":"'Orçamento-TCE'!G142","v":"TUBO PVC SÉRIE NORMAL, ESGOTO PREDIAL, DN 100MM, FORNECIDO E INSTALADO EM RAMAL DE DESCARGA OU RAMAL DE ESGOTO SANITÁRIO. AF_12/2014"},{"$f":"'Orçamento-TCE'!H142","v":43},{"$f":"'Orçamento-TCE'!I142","v":"M"},{"$f":"Orçamento!H150","v":71.180000000000007},{"$f":"Orçamento!I150","v":3060.74},{"$f":"Orçamento!G150","v":0.22159999999999999},1.1122000000000001,null,49.826000000000001,21.354000000000006,{"$error":"#REF!"},{"$f":"IF(#REF!=\"Tabela Não Desonerada\",VLOOKUP($C142,#REF!,13,FALSE),VLOOKUP($C142,#REF!,13,FALSE))","v":{"$error":"#REF!"}},{"$error":"#REF!"},{"$f":"IF(#REF!=\"Tabela Não Desonerada\",VLOOKUP($C142,#REF!,14,FALSE),VLOOKUP($C142,#REF!,14,FALSE))","v":{"$error":"#REF!"}},{"$error":"#REF!"},{"$f":"IF(#REF!=\"Tabela Não Desonerada\",VLOOKUP($C142,#REF!,15,FALSE),VLOOKUP($C142,#REF!,15,FALSE))","v":{"$error":"#REF!"}},{"$error":"#REF!"}]
[1,{"$f":"'Orçamento-TCE'!B143","v":132},{"$f":"'Orçamento-TCE'!C143","v":"11.12"},{"$f":"'Orçamento-TCE'!G143","v":"JOELHO 90 GRAUS, PPR, DN 25MM, CLASSE PN 25, INSTALADO EM RAMAL DE DISTRIBUIÇÃO - FORNECIMENTO E INSTALAÇÃO. AF_06/2015"},{"$f":"'Orçamento-TCE'!H143","v":62},{"$f":"'Orçamento-TCE'!I143","v":"UN"},{"$f":"Orçamento!H151","v":11.52},{"$f":"Orçamento!I151","v":714.24},{"$f":"Orçamento!G151","v":0.22159999999999999},1.1122000000000001,null,8.0640000000000001,3.4559999999999995,{"$error":"#REF!"},{"$f":"IF(#REF!=\"Tabela Não Desonerada\",VLOOKUP($C143,#REF!,13,FALSE),VLOOKUP($C143,#REF!,13,FALSE))","v":{"$error":"#REF!"}},{"$error":"#REF!"},{"$f":"IF(#REF!=\"Tabela Não Desonerada\",VLOOKUP($C143,#REF!,14,FALSE),VLOOKUP($C143,#REF!,14,FALSE))","v":{"$error":"#REF!"}},{"$error":"#REF!"},{"$f":"IF(#REF!=\"Tabela Não Desonerada\",VLOOKUP($C143,#REF!,15,FALSE),VLOOKUP($C143,#REF!,15,FALSE))","v":{"$error":"#REF!"}},{"$error":"#REF!"}]
[1,{"$f":"'Orçamento-TCE'!B144","v":133},{"$f":"'Orçamento-TCE'!C144","v":"11.13"},{"$f":"'Orçamento-TCE'!G144","v":"TÊ NORMAL, PPR, DN 25MM, CLASSE PN 25, INSTALADO EM RAMAL DE DISTRIBUIÇÃO DE ÁGUA - FORNECIMENTO E INSTALAÇÃO. AF_06/2015"},{"$f":"'Orçamento-TCE'!H144","v":13},{"$f":"'Orçamento-TCE'!I144","v":"UN"},{"$f":"Orçamento!H152","v":15.15},{"$f":"Orçamento!I152","v":196.95},{"$f":"Orçamento!G152","v":0.22159999999999999},1.1122000000000001,null,10.605,4.5449999999999999,{"$error":"#REF!"},{"$f":"IF(#REF!=\"Tabela Não Desonerada\",VLOOKUP($C144,#REF!,13,FALSE),VLOOKUP($C144,#REF!,13,FALSE))","v":{"$error":"#REF!"}},{"$error":"#REF!"},{"$f":"IF(#REF!=\"Tabela Não Desonerada\",VLOOKUP($C144,#REF!,14,FALSE),VLOOKUP($C144,#REF!,14,FALSE))","v":{"$error":"#REF!"}},{"$error":"#REF!"},{"$f":"IF(#REF!=\"Tabela Não Desonerada\",VLOOKUP($C144,#REF!,15,FALSE),VLOOKUP($C144,#REF!,15,FALSE))","v":{"$error":"#REF!"}},{"$error":"#REF!"}]
[1,{"$f":"'Orçamento-TCE'!B145","v":134},{"$f":"'Orçamento-TCE'!C145","v":"11.14"},{"$f":"'Orçamento-TCE'!G145","v":"JOELHO 90 GRAUS, PVC, SOLDÁVEL, DN 25MM, INSTALADO EM RAMAL DE DISTRIBUIÇÃO DE ÁGUA - FORNECIMENTO E INSTALAÇÃO. AF_12/2014"},{"$f":"'Orçamento-TCE'!H145","v":113},{"$f":"'Orçamento-TCE'!I145","v":"UN"},{"$f":"Orçamento!H153","v":7.45},{"$f":"Orçamento!I153","v":841.85},{"$f":"Orçamento!G153","v":0.22159999999999999},1.1122000000000001,null,5.2149999999999999,2.2350000000000003,{"$error":"#REF!"},{"$f":"IF(#REF!=\"Tabela Não Desonerada\",VLOOKUP($C145,#REF!,13,FALSE),VLOOKUP($C145,#REF!,13,FALSE))","v":{"$error":"#REF!"}},{"$error":"#REF!"},{"$f":"IF(#REF!=\"Tabela Não Desonerada\",VLOOKUP($C145,#REF!,14,FALSE),VLOOKUP($C145,#REF!,14,FALSE))","v":{"$error":"#REF!"}},{"$error":"#REF!"},{"$f":"IF(#REF!=\"Tabela Não Desonerada\",VLOOKUP($C145,#REF!,15,FALSE),VLOOKUP($C145,#REF!,15,FALSE))","v":{"$error":"#REF!"}},{"$error":"#REF!"}]
[1,{"$f":"'Orçamento-TCE'!B146","v":135},{"$f":"'Orçamento-TCE'!C146","v":"11.15"},{"$f":"'Orçamento-TCE'!G146","v":"TÊ, PVC, SOLDÁVEL, DN 25MM, INSTALADO EM RAMAL OU SUB-RAMAL DE ÁGUA - FORNECIMENTO E INSTALAÇÃO. AF_12/2014"},{"$f":"'Orçamento-TCE'!H146","v":34},{"$f":"'Orçamento-TCE'!I146","v":"UN"},{"$f":"Orçamento!H154","v":14.74},{"$f":"Orçamento!I154","v":501.16},{"$f":"Orçamento!G154","v":0.22159999999999999},1.1122000000000001,null,10.318,4.4220000000000006,{"$error":"#REF!"},{"$f":"IF(#REF!=\"Tabela Não Desonerada\",VLOOKUP($C146,#REF!,13,FALSE),VLOOKUP($C146,#REF!,13,FALSE))","v":{"$error":"#REF!"}},{"$error":"#REF!"},{"$f":"IF(#REF!=\"Tabela Não Desonerada\",VLOOKUP($C146,#REF!,14,FALSE),VLOOKUP($C146,#REF!,14,FALSE))","v":{"$error":"#REF!"}},{"$error":"#REF!"},{"$f":"IF(#REF!=\"Tabela Não Desonerada\",VLOOKUP($C146,#REF!,15,FALSE),VLOOKUP($C146,#REF!,15,FALSE))","v":{"$error":"#REF!"}},{"$error":"#REF!"}]
[1,{"$f":"'Orçamento-TCE'!B147","v":136},{"$f":"'Orçamento-TCE'!C147","v":"11.16"},{"$f":"'Orçamento-TCE'!G147","v":"BUCHA DE REDUÇÃO, PPR, 32X25, CLASSE PN 25, INSTALADO EM RAMAL DE DISTRIBUIÇÃO DE ÁGUA - FORNECIMENTO E INSTALAÇÃO. AF_06/2015"},{"$f":"'Orçamento-TCE'!H147","v":3},{"$f":"'Orçamento-TCE'!I147","v":"UN"},{"$f":"Orçamento!H155","v":15.04},{"$f":"Orçamento!I155","v":45.12},{"$f":"Orçamento!G155","v":0.22159999999999999},1.1122000000000001,null,10.527999999999999,4.5120000000000005,{"$error":"#REF!"},{"$f":"IF(#REF!=\"Tabela Não Desonerada\",VLOOKUP($C147,#REF!,13,FALSE),VLOOKUP($C147,#REF!,13,FALSE))","v":{"$error":"#REF!"}},{"$error":"#REF!"},{"$f":"IF(#REF!=\"Tabela Não Desonerada\",VLOOKUP($C147,#REF!,14,FALSE),VLOOKUP($C147,#REF!,14,FALSE))","v":{"$error":"#REF!"}},{"$error":"#REF!"},{"$f":"IF(#REF!=\"Tabela Não Desonerada\",VLOOKUP($C147,#REF!,15,FALSE),VLOOKUP($C147,#REF!,15,FALSE))","v":{"$error":"#REF!"}},{"$error":"#REF!"}]
[1,{"$f":"'Orçamento-TCE'!B148","v":137},{"$f":"'Orçamento-TCE'!C148","v":"11.17"},{"$f":"'Orçamento-TCE'!G148","v":"LUVA DE REDUÇÃO, PVC, SOLDÁVEL, DN 32MMX25MM, INSTALADO EM RAMAL DE DISTRIBUIÇÃO DE ÁGUA - FORNECIMENTO E INSTALAÇÃO. AF_12/2014"},{"$f":"'Orçamento-TCE'!H148","v":3},{"$f":"'Orçamento-TCE'!I148","v":"UN"},{"$f":"Orçamento!H156","v":12.07},{"$f":"Orçamento!I156","v":36.21},{"$f":"Orçamento!G156","v":0.22159999999999999},1.1122000000000001,null,8.4489999999999998,3.6210000000000004,{"$error":"#REF!"},{"$f":"IF(#REF!=\"Tabela Não Desonerada\",VLOOKUP($C148,#REF!,13,FALSE),VLOOKUP($C148,#REF!,13,FALSE))","v":{"$error":"#REF!"}},{"$error":"#REF!"},{"$f":"IF(#REF!=\"Tabela Não Desonerada\",VLOOKUP($C148,#REF!,14,FALSE),VLOOKUP($C148,#REF!,14,FALSE))","v":{"$error":"#REF!"}},{"$error":"#REF!"},{"$f":"IF(#REF!=\"Tabela Não Desonerada\",VLOOKUP($C148,#REF!,15,FALSE),VLOOKUP($C148,#REF!,15,FALSE))","v":{"$error":"#REF!"}},{"$error":"#REF!"}]
[1,{"$f":"'Orçamento-TCE'!B149","v":138},{"$f":"'Orçamento-TCE'!C149","v":"11.18"},{"$f":"'Orçamento-TCE'!G149","v":"JOELHO 90 GRAUS, PVC, SOLDÁVEL, DN 32MM, INSTALADO EM RAMAL DE DISTRIBUIÇÃO DE ÁGUA - FORNECIMENTO E INSTALAÇÃO. AF_12/2014"},{"$f":"'Orçamento-TCE'!H149","v":20},{"$f":"'Orçamento-TCE'!I149","v":"UN"},{"$f":"Orçamento!H157","v":11.8},{"$f":"Orçamento!I157","v":236},{"$f":"Orçamento!G157","v":0.22159999999999999},1.1122000000000001,null,8.26,3.5400000000000009,{"$error":"#REF!"},{"$f":"IF(#REF!=\"Tabela Não Desonerada\",VLOOKUP($C149,#REF!,13,FALSE),VLOOKUP($C149,#REF!,13,FALSE))","v":{"$error":"#REF!"}},{"$error":"#REF!"},{"$f":"IF(#REF!=\"Tabela Não Desonerada\",VLOOKUP($C149,#REF!,14,FALSE),VLOOKUP($C149,#REF!,14,FALSE))","v":{"$error":"#REF!"}},{"$error":"#REF!"},{"$f":"IF(#REF!=\"Tabela Não Desonerada\",VLOOKUP($C149,#REF!,15,FALSE),VLOOKUP($C149,#REF!,15,FALSE))","v":{"$error":"#REF!"}},{"$error":"#REF!"}]
[1,{"$f":"'Orçamento-TCE'!B150","v":139},{"$f":"'Orçamento-TCE'!C150","v":"11.19"},{"$f":"'Orçamento-TCE'!G150","v":"JOELHO 90 GRAUS, PPR, DN 32 MM, CLASSE PN 25, INSTALADO EM PRUMADA DE ÁGUA FORNECIMENTO E INSTALAÇÃO . AF_06/2015"},{"$f":"'Orçamento-TCE'!H150","v":16},{"$f":"'Orçamento-TCE'!I150","v":"UN"},{"$f":"Orçamento!H158","v":9.06},{"$f":"Orçamento!I158","v":144.96},{"$f":"Orçamento!G158","v":0.22159999999999999},1.1122000000000001,null,6.3419999999999996,2.7180000000000009,{"$error":"#REF!"},{"$f":"IF(#REF!=\"Tabela Não Desonerada\",VLOOKUP($C150,#REF!,13,FALSE),VLOOKUP($C150,#REF!,13,FALSE))","v":{"$error":"#REF!"}},{"$error":"#REF!"},{"$f":"IF(#REF!=\"Tabela Não Desonerada\",VLOOKUP($C150,#REF!,14,FALSE),VLOOKUP($C150,#REF!,14,FALSE))","v":{"$error":"#REF!"}},{"$error":"#REF!"},{"$f":"IF(#REF!=\"Tabela Não Desonerada\",VLOOKUP($C150,#REF!,15,FALSE),VLOOKUP($C150,#REF!,15,FALSE))","v":{"$error":"#REF!"}},{"$error":"#REF!"}]
[1,{"$f":"'Orçamento-TCE'!B151","v":140},{"$f":"'Orçamento-TCE'!C151","v":"11.20"},{"$f":"'Orçamento-TCE'!G151","v":"JOELHO 90 GRAUS, PVC, SOLDÁVEL, DN 40MM, INSTALADO EM PRUMADA DE ÁGUA - FORNECIMENTO E INSTALAÇÃO. AF_12/2014"},{"$f":"'Orçamento-TCE'!H151","v":14},{"$f":"'Orçamento-TCE'!I151","v":"UN"},{"$f":"Orçamento!H159","v":17.7},{"$f":"Orçamento!I159","v":247.8},{"$f":"Orçamento!G159","v":0.22159999999999999},1.1122000000000001,null,12.389999999999999,5.3100000000000005,{"$error":"#REF!"},{"$f":"IF(#REF!=\"Tabela Não Desonerada\",VLOOKUP($C151,#REF!,13,FALSE),VLOOKUP($C151,#REF!,13,FALSE))","v":{"$error":"#REF!"}},{"$error":"#REF!"},{"$f":"IF(#REF!=\"Tabela Não Desonerada\",VLOOKUP($C151,#REF!,14,FALSE),VLOOKUP($C151,#REF!,14,FALSE))","v":{"$error":"#REF!"}},{"$error":"#REF!"},{"$f":"IF(#REF!=\"Tabela Não Desonerada\",VLOOKUP($C151,#REF!,15,FALSE),VLOOKUP($C151,#REF!,15,FALSE))","v":{"$error":"#REF!"}},{"$error":"#REF!"}]
[1,{"$f":"'Orçamento-TCE'!B152","v":141},{"$f":"'Orçamento-TCE'!C152","v":"11.21"},{"$f":"'Orçamento-TCE'!G152","v":"JOELHO 90 GRAUS, PVC, SERIE NORMAL, ESGOTO PREDIAL, DN 40MM, JUNTA SOLDÁVEL, FORNECIDO E INSTALADO EM RAMAL DE DESCARGA OU RAMAL DE ESGOTO SANITÁRIO. AF_12/2014"},{"$f":"'Orçamento-TCE'!H152","v":68},{"$f":"'Orçamento-TCE'!I152","v":"UN"},{"$f":"Orçamento!H160","v":13.39},{"$f":"Orçamento!I160","v":910.52},{"$f":"Orçamento!G160","v":0.22159999999999999},1.1122000000000001,null,9.3729999999999993,4.0170000000000012,{"$error":"#REF!"},{"$f":"IF(#REF!=\"Tabela Não Desonerada\",VLOOKUP($C152,#REF!,13,FALSE),VLOOKUP($C152,#REF!,13,FALSE))","v":{"$error":"#REF!"}},{"$error":"#REF!"},{"$f":"IF(#REF!=\"Tabela Não Desonerada\",VLOOKUP($C152,#REF!,14,FALSE),VLOOKUP($C152,#REF!,14,FALSE))","v":{"$error":"#REF!"}},{"$error":"#REF!"},{"$f":"IF(#REF!=\"Tabela Não Desonerada\",VLOOKUP($C152,#REF!,15,FALSE),VLOOKUP($C152,#REF!,15,FALSE))","v":{"$error":"#REF!"}},{"$error":"#REF!"}]
[1,{"$f":"'Orçamento-TCE'!B153","v":142},{"$f":"'Orçamento-TCE'!C153","v":"11.22"},{"$f":"'Orçamento-TCE'!G153","v":"JOELHO 45 GRAUS, PVC, SERIE NORMAL, ESGOTO PREDIAL, DN 40MM, JUNTA SOLDÁVEL, FORNECIDO E INSTALADO EM RAMAL DE DESCARGA OU RAMAL DE ESGOTO SANITÁRIO. AF_12/2014"},{"$f":"'Orçamento-TCE'!H153","v":80},{"$f":"'Orçamento-TCE'!I153","v":"UN"},{"$f":"Orçamento!H161","v":9.16},{"$f":"Orçamento!I161","v":732.8},{"$f":"Orçamento!G161","v":0.22159999999999999},1.1122000000000001,null,6.4119999999999999,2.7480000000000002,{"$error":"#REF!"},{"$f":"IF(#REF!=\"Tabela Não Desonerada\",VLOOKUP($C153,#REF!,13,FALSE),VLOOKUP($C153,#REF!,13,FALSE))","v":{"$error":"#REF!"}},{"$error":"#REF!"},{"$f":"IF(#REF!=\"Tabela Não Desonerada\",VLOOKUP($C153,#REF!,14,FALSE),VLOOKUP($C153,#REF!,14,FALSE))","v":{"$error":"#REF!"}},{"$error":"#REF!"},{"$f":"IF(#REF!=\"Tabela Não Desonerada\",VLOOKUP($C153,#REF!,15,FALSE),VLOOKUP($C153,#REF!,15,FALSE))","v":{"$error":"#REF!"}},{"$error":"#REF!"}]
[1,{"$f":"'Orçamento-TCE'!B154","v":143},{"$f":"'Orçamento-TCE'!C154","v":"11.23"},{"$f":"'Orçamento-TCE'!G154","v":"JUNÇÃO SIMPLES, PVC, SÉRIE NORMAL, ESGOTO PREDIAL, DN 40MM, JUNTA SOLDÁVEL, FORNECIDO E INSTALADO EM RAMAL DE DESCARGA OU RAMAL DE ESGOTO SANITÁRIO. AF_12/2014"},{"$f":"'Orçamento-TCE'!H154","v":28},{"$f":"'Orçamento-TCE'!I154","v":"UN"},{"$f":"Orçamento!H162","v":15.88},{"$f":"Orçamento!I162","v":444.64},{"$f":"Orçamento!G162","v":0.22159999999999999},1.1122000000000001,null,11.116,4.7640000000000011,{"$error":"#REF!"},{"$f":"IF(#REF!=\"Tabela Não Desonerada\",VLOOKUP($C154,#REF!,13,FALSE),VLOOKUP($C154,#REF!,13,FALSE))","v":{"$error":"#REF!"}},{"$error":"#REF!"},{"$f":"IF(#REF!=\"Tabela Não Desonerada\",VLOOKUP($C154,#REF!,14,FALSE),VLOOKUP($C154,#REF!,14,FALSE))","v":{"$error":"#REF!"}},{"$error":"#REF!"},{"$f":"IF(#REF!=\"Tabela Não Desonerada\",VLOOKUP($C154,#REF!,15,FALSE),VLOOKUP($C154,#REF!,15,FALSE))","v":{"$error":"#REF!"}},{"$error":"#REF!"}]
[1,{"$f":"'Orçamento-TCE'!B155","v":144},{"$f":"'Orçamento-TCE'!C155","v":"11.24"},{"$f":"'Orçamento-TCE'!G155","v":"JOELHO 90 GRAUS, PVC, SOLDÁVEL, DN 50MM, INSTALADO EM PRUMADA DE ÁGUA - FORNECIMENTO E INSTALAÇÃO. AF_12/2014"},{"$f":"'Orçamento-TCE'!H155","v":35},{"$f":"'Orçamento-TCE'!I155","v":"UN"},{"$f":"Orçamento!H163","v":20.96},{"$f":"Orçamento!I163","v":733.6},{"$f":"Orçamento!G163","v":0.22159999999999999},1.1122000000000001,null,14.671999999999999,6.288000000000002,{"$error":"#REF!"},{"$f":"IF(#REF!=\"Tabela Não Desonerada\",VLOOKUP($C155,#REF!,13,FALSE),VLOOKUP($C155,#REF!,13,FALSE))","v":{"$error":"#REF!"}},{"$error":"#REF!"},{"$f":"IF(#REF!=\"Tabela Não Desonerada\",VLOOKUP($C155,#REF!,14,FALSE),VLOOKUP($C155,#REF!,14,FALSE))","v":{"$error":"#REF!"}},{"$error":"#REF!"},{"$f":"IF(#REF!=\"Tabela Não Desonerada\",VLOOKUP($C155,#REF!,15,FALSE),VLOOKUP($C155,#REF!,15,FALSE))","v":{"$error":"#REF!"}},{"$error":"#REF!"}]
[1,{"$f":"'Orçamento-TCE'!B156","v":145},{"$f":"'Orçamento-TCE'!C156","v":"11.25"},{"$f":"'Orçamento-TCE'!G156","v":"JOELHO 45 GRAUS, PVC, SÉRIE NORMAL, ESGOTO PREDIAL, DN 50MM, JUNTA ELÁSTICA, FORNECIDO E INSTALADO  EM RAMAL DE DESCARGA OU ESGOTO SANITÁRIO. AF_12/2014"},{"$f":"'Orçamento-TCE'!H156","v":59},{"$f":"'Orçamento-TCE'!I156","v":"UN"},{"$f":"Orçamento!H164","v":14.54},{"$f":"Orçamento!I164","v":857.86},{"$f":"Orçamento!G164","v":0.22159999999999999},1.1122000000000001,null,10.177999999999999,4.3620000000000001,{"$error":"#REF!"},{"$f":"IF(#REF!=\"Tabela Não Desonerada\",VLOOKUP($C156,#REF!,13,FALSE),VLOOKUP($C156,#REF!,13,FALSE))","v":{"$error":"#REF!"}},{"$error":"#REF!"},{"$f":"IF(#REF!=\"Tabela Não Desonerada\",VLOOKUP($C156,#REF!,14,FALSE),VLOOKUP($C156,#REF!,14,FALSE))","v":{"$error":"#REF!"}},{"$error":"#REF!"},{"$f":"IF(#REF!=\"Tabela Não Desonerada\",VLOOKUP($C156,#REF!,15,FALSE),VLOOKUP($C156,#REF!,15,FALSE))","v":{"$error":"#REF!"}},{"$error":"#REF!"}]
[1,{"$f":"'Orçamento-TCE'!B157","v":146},{"$f":"'Orçamento-TCE'!C157","v":"11.26"},{"$f":"'Orçamento-TCE'!G157","v":"JOELHO 90 GRAUS, PVC, SÉRIE NORMAL, ESGOTO PREDIAL, DN 50M, JUNTA ELÁSTICA, FORNECIDO E INSTALADO EM REMAL DE DESCARGA OU RAMAL DE ESGOTO SANITÁRIO. AF_12/2014"},{"$f":"'Orçamento-TCE'!H157","v":50},{"$f":"'Orçamento-TCE'!I157","v":"UN"},{"$f":"Orçamento!H165","v":13.54},{"$f":"Orçamento!I165","v":677},{"$f":"Orçamento!G165","v":0.22159999999999999},1.1122000000000001,null,9.477999999999998,4.0620000000000012,{"$error":"#REF!"},{"$f":"IF(#REF!=\"Tabela Não Desonerada\",VLOOKUP($C157,#REF!,13,FALSE),VLOOKUP($C157,#REF!,13,FALSE))","v":{"$error":"#REF!"}},{"$error":"#REF!"},{"$f":"IF(#REF!=\"Tabela Não Desonerada\",VLOOKUP($C157,#REF!,14,FALSE),VLOOKUP($C157,#REF!,14,FALSE))","v":{"$error":"#REF!"}},{"$error":"#REF!"},{"$f":"IF(#REF!=\"Tabela Não Desonerada\",VLOOKUP($C157,#REF!,15,FALSE),VLOOKUP($C157,#REF!,15,FALSE))","v":{"$error":"#REF!"}},{"$error":"#REF!"}]
[1,{"$f":"'Orçamento-TCE'!B158","v":147},{"$f":"'Orçamento-TCE'!C158","v":"11.27"},{"$f":"'Orçamento-TCE'!G158","v":"TÊ, PVC, SOLDÁVEL, DN 50MM, INSTALADO EM PRUMADA DE ÁGUA - FORNECIMENTO E INSTALAÇÃO. AF_12/2014"},{"$f":"'Orçamento-TCE'!H158","v":15},{"$f":"'Orçamento-TCE'!I158","v":"UN"},{"$f":"Orçamento!H166","v":33.950000000000003},{"$f":"Orçamento!I166","v":509.25},{"$f":"Orçamento!G166","v":0.22159999999999999},1.1122000000000001,null,23.765000000000001,10.185000000000002,{"$error":"#REF!"},{"$f":"IF(#REF!=\"Tabela Não Desonerada\",VLOOKUP($C158,#REF!,13,FALSE),VLOOKUP($C158,#REF!,13,FALSE))","v":{"$error":"#REF!"}},{"$error":"#REF!"},{"$f":"IF(#REF!=\"Tabela Não Desonerada\",VLOOKUP($C158,#REF!,14,FALSE),VLOOKUP($C158,#REF!,14,FALSE))","v":{"$error":"#REF!"}},{"$error":"#REF!"},{"$f":"IF(#REF!=\"Tabela Não Desonerada\",VLOOKUP($C158,#REF!,15,FALSE),VLOOKUP($C158,#REF!,15,FALSE))","v":{"$error":"#REF!"}},{"$error":"#REF!"}]
[1,{"$f":"'Orçamento-TCE'!B159","v":148},{"$f":"'Orçamento-TCE'!C159","v":"11.28"},{"$f":"'Orçamento-TCE'!G159","v":"JUNÇÃO SIMPLES, PVC, SÉRIE NORMAL, ESGOTO PREDIAL, DN 50X50MM, JUNTA ELÁSTICA, FORNECIDO E INSTALADO EM RAMAL DE DESCARGA OU RAMAL DE ESGOTO SANITÁRIO. AF_12/2014"},{"$f":"'Orçamento-TCE'!H159","v":31},{"$f":"'Orçamento-TCE'!I159","v":"UN"},{"$f":"Orçamento!H167","v":28.94},{"$f":"Orçamento!I167","v":897.14},{"$f":"Orçamento!G167","v":0.22159999999999999},1.1122000000000001,null,20.257999999999999,8.6820000000000022,{"$error":"#REF!"},{"$f":"IF(#REF!=\"Tabela Não Desonerada\",VLOOKUP($C159,#REF!,13,FALSE),VLOOKUP($C159,#REF!,13,FALSE))","v":{"$error":"#REF!"}},{"$error":"#REF!"},{"$f":"IF(#REF!=\"Tabela Não Desonerada\",VLOOKUP($C159,#REF!,14,FALSE),VLOOKUP($C159,#REF!,14,FALSE))","v":{"$error":"#REF!"}},{"$error":"#REF!"},{"$f":"IF(#REF!=\"Tabela Não Desonerada\",VLOOKUP($C159,#REF!,15,FALSE),VLOOKUP($C159,#REF!,15,FALSE))","v":{"$error":"#REF!"}},{"$error":"#REF!"}]
[1,{"$f":"'Orçamento-TCE'!B160","v":149},{"$f":"'Orçamento-TCE'!C160","v":"11.29"},{"$f":"'Orçamento-TCE'!G160","v":"TÊ DE REDUÇÃO, PVC, SOLDÁVEL, DN 75MMX50MM, INSTALADO EM PRUMADA DE ÁGUA - FORNECIMENTO E INSTALAÇÃO. AF_12/2014"},{"$f":"'Orçamento-TCE'!H160","v":22},{"$f":"'Orçamento-TCE'!I160","v":"UN"},{"$f":"Orçamento!H168","v":126.73},{"$f":"Orçamento!I168","v":2788.06},{"$f":"Orçamento!G168","v":0.22159999999999999},1.1122000000000001,null,88.710999999999999,38.019000000000005,{"$error":"#REF!"},{"$f":"IF(#REF!=\"Tabela Não Desonerada\",VLOOKUP($C160,#REF!,13,FALSE),VLOOKUP($C160,#REF!,13,FALSE))","v":{"$error":"#REF!"}},{"$error":"#REF!"},{"$f":"IF(#REF!=\"Tabela Não Desonerada\",VLOOKUP($C160,#REF!,14,FALSE),VLOOKUP($C160,#REF!,14,FALSE))","v":{"$error":"#REF!"}},{"$error":"#REF!"},{"$f":"IF(#REF!=\"Tabela Não Desonerada\",VLOOKUP($C160,#REF!,15,FALSE),VLOOKUP($C160,#REF!,15,FALSE))","v":{"$error":"#REF!"}},{"$error":"#REF!"}]
[1,{"$f":"'Orçamento-TCE'!B161","v":150},{"$f":"'Orçamento-TCE'!C161","v":"11.30"},{"$f":"'Orçamento-TCE'!G161","v":"REDUÇÃO EXCÊNTRICA, PVC, SÉRIE R, ÁGUA PLUVIAL, DN 75X50MM, JUNTA ELÁSTICA, FORNECIDO E INSTALADO EM CONDUTORES VERTICAIS DE ÁGUAS PLUVIAIS. AF_12/2014"},{"$f":"'Orçamento-TCE'!H161","v":3},{"$f":"'Orçamento-TCE'!I161","v":"UN"},{"$f":"Orçamento!H169","v":19.190000000000001},{"$f":"Orçamento!I169","v":57.57},{"$f":"Orçamento!G169","v":0.22159999999999999},1.1122000000000001,null,13.433,5.7570000000000014,{"$error":"#REF!"},{"$f":"IF(#REF!=\"Tabela Não Desonerada\",VLOOKUP($C161,#REF!,13,FALSE),VLOOKUP($C161,#REF!,13,FALSE))","v":{"$error":"#REF!"}},{"$error":"#REF!"},{"$f":"IF(#REF!=\"Tabela Não Desonerada\",VLOOKUP($C161,#REF!,14,FALSE),VLOOKUP($C161,#REF!,14,FALSE))","v":{"$error":"#REF!"}},{"$error":"#REF!"},{"$f":"IF(#REF!=\"Tabela Não Desonerada\",VLOOKUP($C161,#REF!,15,FALSE),VLOOKUP($C161,#REF!,15,FALSE))","v":{"$error":"#REF!"}},{"$error":"#REF!"}]
[1,{"$f":"'Orçamento-TCE'!B162","v":151},{"$f":"'Orçamento-TCE'!C162","v":"11.31"},{"$f":"'Orçamento-TCE'!G162","v":"JOELHO 90 GRAUS, PVC, SOLDÁVEL, DN 75MM, INSTALADO EM RESERVAÇÃO DE ÁGUA DE EDIFICAÇÃO QUE POSSUA RESERVATÓRIO DE FIBRA/FIBROCIMENTO - FORNECIMENTO E INSTALAÇÃO. AF_06/2016"},{"$f":"'Orçamento-TCE'!H162","v":24},{"$f":"'Orçamento-TCE'!I162","v":"UN"},{"$f":"Orçamento!H170","v":210.76},{"$f":"Orçamento!I170","v":5058.24},{"$f":"Orçamento!G170","v":0.22159999999999999},1.1122000000000001,null,147.53199999999998,63.228000000000009,{"$error":"#REF!"},{"$f":"IF(#REF!=\"Tabela Não Desonerada\",VLOOKUP($C162,#REF!,13,FALSE),VLOOKUP($C162,#REF!,13,FALSE))","v":{"$error":"#REF!"}},{"$error":"#REF!"},{"$f":"IF(#REF!=\"Tabela Não Desonerada\",VLOOKUP($C162,#REF!,14,FALSE),VLOOKUP($C162,#REF!,14,FALSE))","v":{"$error":"#REF!"}},{"$error":"#REF!"},{"$f":"IF(#REF!=\"Tabela Não Desonerada\",VLOOKUP($C162,#REF!,15,FALSE),VLOOKUP($C162,#REF!,15,FALSE))","v":{"$error":"#REF!"}},{"$error":"#REF!"}]
[1,{"$f":"'Orçamento-TCE'!B163","v":152},{"$f":"'Orçamento-TCE'!C163","v":"11.32"},{"$f":"'Orçamento-TCE'!G163","v":"JOELHO 90 GRAUS, PVC, SÉRIE NORMAL, ESGOTO PREDIAL, DN 75MM, JUNTA ELÁSTICA, FORNECIDO E INSTALADO EM PRUMADA DE ESGOTO SANITÁRIO OU VENTILAÇÃO. AF_12/2014"},{"$f":"'Orçamento-TCE'!H163","v":9},{"$f":"'Orçamento-TCE'!I163","v":"UN"},{"$f":"Orçamento!H171","v":19.170000000000002},{"$f":"Orçamento!I171","v":172.53},{"$f":"Orçamento!G171","v":0.22159999999999999},1.1122000000000001,null,13.419,5.7510000000000012,{"$error":"#REF!"},{"$f":"IF(#REF!=\"Tabela Não Desonerada\",VLOOKUP($C163,#REF!,13,FALSE),VLOOKUP($C163,#REF!,13,FALSE))","v":{"$error":"#REF!"}},{"$error":"#REF!"},{"$f":"IF(#REF!=\"Tabela Não Desonerada\",VLOOKUP($C163,#REF!,14,FALSE),VLOOKUP($C163,#REF!,14,FALSE))","v":{"$error":"#REF!"}},{"$error":"#REF!"},{"$f":"IF(#REF!=\"Tabela Não Desonerada\",VLOOKUP($C163,#REF!,15,FALSE),VLOOKUP($C163,#REF!,15,FALSE))","v":{"$error":"#REF!"}},{"$error":"#REF!"}]
[1,{"$f":"'Orçamento-TCE'!B164","v":153},{"$f":"'Orçamento-TCE'!C164","v":"11.33"},{"$f":"'Orçamento-TCE'!G164","v":"TÊ, PVC, SOLDÁVEL, DN 75MM INSTALADO EM RESERVAÇÃO DE ÁGUA DE EDIFICAÇÃO QUE POSSUA RESERVATÓRIO DE FIBRA/FIBROCIMENTO - FORNECIMENTO E INSTALAÇÃO. AF_06/2016"},{"$f":"'Orçamento-TCE'!H164","v":13},{"$f":"'Orçamento-TCE'!I164","v":"UN"},{"$f":"Orçamento!H172","v":155.88999999999999},{"$f":"Orçamento!I172","v":2026.57},{"$f":"Orçamento!G172","v":0.22159999999999999},1.1122000000000001,null,109.12299999999999,46.766999999999996,{"$error":"#REF!"},{"$f":"IF(#REF!=\"Tabela Não Desonerada\",VLOOKUP($C164,#REF!,13,FALSE),VLOOKUP($C164,#REF!,13,FALSE))","v":{"$error":"#REF!"}},{"$error":"#REF!"},{"$f":"IF(#REF!=\"Tabela Não Desonerada\",VLOOKUP($C164,#REF!,14,FALSE),VLOOKUP($C164,#REF!,14,FALSE))","v":{"$error":"#REF!"}},{"$error":"#REF!"},{"$f":"IF(#REF!=\"Tabela Não Desonerada\",VLOOKUP($C164,#REF!,15,FALSE),VLOOKUP($C164,#REF!,15,FALSE))","v":{"$error":"#REF!"}},{"$error":"#REF!"}]
[1,{"$f":"'Orçamento-TCE'!B165","v":154},{"$f":"'Orçamento-TCE'!C165","v":"11.34"},{"$f":"'Orçamento-TCE'!G165","v":"JUNÇÃO SIMPLES, PVC, SÉRIE R, ÁGUA PLUVIAL, DN 75X75MM, JUNTA ELÁSTICA, FORNECIDO E INSTALADO EM RAMAL DE ENCAMINHAMENTO. AF_12/2014"},{"$f":"'Orçamento-TCE'!H165","v":10},{"$f":"'Orçamento-TCE'!I165","v":"UN"},{"$f":"Orçamento!H173","v":77.209999999999994},{"$f":"Orçamento!I173","v":772.1},{"$f":"Orçamento!G173","v":0.22159999999999999},1.1122000000000001,null,54.04699999999999,23.163000000000004,{"$error":"#REF!"},{"$f":"IF(#REF!=\"Tabela Não Desonerada\",VLOOKUP($C165,#REF!,13,FALSE),VLOOKUP($C165,#REF!,13,FALSE))","v":{"$error":"#REF!"}},{"$error":"#REF!"},{"$f":"IF(#REF!=\"Tabela Não Desonerada\",VLOOKUP($C165,#REF!,14,FALSE),VLOOKUP($C165,#REF!,14,FALSE))","v":{"$error":"#REF!"}},{"$error":"#REF!"},{"$f":"IF(#REF!=\"Tabela Não Desonerada\",VLOOKUP($C165,#REF!,15,FALSE),VLOOKUP($C165,#REF!,15,FALSE))","v":{"$error":"#REF!"}},{"$error":"#REF!"}]
[1,{"$f":"'Orçamento-TCE'!B166","v":155},{"$f":"'Orçamento-TCE'!C166","v":"11.35"},{"$f":"'Orçamento-TCE'!G166","v":"TÊ, PVC, SÉRIE R, ÁGUA PLUVIAL, DN 75MM, JUNTA ELÁSTICA - FORNECIDO E INSTALADO EM RAMAL DE ENCAMINHAMENTO. AF_12/2014"},{"$f":"'Orçamento-TCE'!H166","v":13},{"$f":"'Orçamento-TCE'!I166","v":"UN"},{"$f":"Orçamento!H174","v":65.650000000000006},{"$f":"Orçamento!I174","v":853.45},{"$f":"Orçamento!G174","v":0.22159999999999999},1.1122000000000001,null,45.954999999999998,19.695000000000007,{"$error":"#REF!"},{"$f":"IF(#REF!=\"Tabela Não Desonerada\",VLOOKUP($C166,#REF!,13,FALSE),VLOOKUP($C166,#REF!,13,FALSE))","v":{"$error":"#REF!"}},{"$error":"#REF!"},{"$f":"IF(#REF!=\"Tabela Não Desonerada\",VLOOKUP($C166,#REF!,14,FALSE),VLOOKUP($C166,#REF!,14,FALSE))","v":{"$error":"#REF!"}},{"$error":"#REF!"},{"$f":"IF(#REF!=\"Tabela Não Desonerada\",VLOOKUP($C166,#REF!,15,FALSE),VLOOKUP($C166,#REF!,15,FALSE))","v":{"$error":"#REF!"}},{"$error":"#REF!"}]
[1,{"$f":"'Orçamento-TCE'!B167","v":156},{"$f":"'Orçamento-TCE'!C167","v":"11.36"},{"$f":"'Orçamento-TCE'!G167","v":"REDUÇÃO EXCÊNTRICA, PVC, SERIE R, ÁGUA PLUVIAL, DN 100 X 75 MM, JUNTA ELÁSTICA, FORNECIDO E INSTALADO EM CONDUTORES VERTICAIS DE ÁGUAS PLUVIAIS. AF_12/2014"},{"$f":"'Orçamento-TCE'!H167","v":12},{"$f":"'Orçamento-TCE'!I167","v":"UN"},{"$f":"Orçamento!H175","v":39.21},{"$f":"Orçamento!I175","v":470.52},{"$f":"Orçamento!G175","v":0.22159999999999999},1.1122000000000001,null,27.446999999999999,11.763000000000002,{"$error":"#REF!"},{"$f":"IF(#REF!=\"Tabela Não Desonerada\",VLOOKUP($C167,#REF!,13,FALSE),VLOOKUP($C167,#REF!,13,FALSE))","v":{"$error":"#REF!"}},{"$error":"#REF!"},{"$f":"IF(#REF!=\"Tabela Não Desonerada\",VLOOKUP($C167,#REF!,14,FALSE),VLOOKUP($C167,#REF!,14,FALSE))","v":{"$error":"#REF!"}},{"$error":"#REF!"},{"$f":"IF(#REF!=\"Tabela Não Desonerada\",VLOOKUP($C167,#REF!,15,FALSE),VLOOKUP($C167,#REF!,15,FALSE))","v":{"$error":"#REF!"}},{"$error":"#REF!"}]
[1,{"$f":"'Orçamento-TCE'!B168","v":157},{"$f":"'Orçamento-TCE'!C168","v":"11.37"},{"$f":"'Orçamento-TCE'!G168","v":"CONECTOR, CPVC, SOLDÁVEL, DN 22MMX1/2, INSTALADO EM RAMAL DE DISTRIBUIÇÃO DE ÁGUA - FORNECIMENTO E INSTALAÇÃO. AF_12/2014"},{"$f":"'Orçamento-TCE'!H168","v":13},{"$f":"'Orçamento-TCE'!I168","v":"UN"},{"$f":"Orçamento!H176","v":41.17},{"$f":"Orçamento!I176","v":535.21},{"$f":"Orçamento!G176","v":0.22159999999999999},1.1122000000000001,null,28.818999999999999,12.351000000000003,{"$error":"#REF!"},{"$f":"IF(#REF!=\"Tabela Não Desonerada\",VLOOKUP($C168,#REF!,13,FALSE),VLOOKUP($C168,#REF!,13,FALSE))","v":{"$error":"#REF!"}},{"$error":"#REF!"},{"$f":"IF(#REF!=\"Tabela Não Desonerada\",VLOOKUP($C168,#REF!,14,FALSE),VLOOKUP($C168,#REF!,14,FALSE))","v":{"$error":"#REF!"}},{"$error":"#REF!"},{"$f":"IF(#REF!=\"Tabela Não Desonerada\",VLOOKUP($C168,#REF!,15,FALSE),VLOOKUP($C168,#REF!,15,FALSE))","v":{"$error":"#REF!"}},{"$error":"#REF!"}]
[1,{"$f":"'Orçamento-TCE'!B169","v":158},{"$f":"'Orçamento-TCE'!C169","v":"11.38"},{"$f":"'Orçamento-TCE'!G169","v":"JOELHO 45 GRAUS, PVC, SÉRIE NORMAL, ESGOTO PREDIAL, DN 100MM, JUNTA ELÁSTICA, FORNECIDO E INSTALADO  EM RAMAL DE DESCARGA OU ESGOTO SANITÁRIO. AF_12/2014"},{"$f":"'Orçamento-TCE'!H169","v":31},{"$f":"'Orçamento-TCE'!I169","v":"UN"},{"$f":"Orçamento!H177","v":31.52},{"$f":"Orçamento!I177","v":977.12},{"$f":"Orçamento!G177","v":0.22159999999999999},1.1122000000000001,null,22.064,9.4559999999999995,{"$error":"#REF!"},{"$f":"IF(#REF!=\"Tabela Não Desonerada\",VLOOKUP($C169,#REF!,13,FALSE),VLOOKUP($C169,#REF!,13,FALSE))","v":{"$error":"#REF!"}},{"$error":"#REF!"},{"$f":"IF(#REF!=\"Tabela Não Desonerada\",VLOOKUP($C169,#REF!,14,FALSE),VLOOKUP($C169,#REF!,14,FALSE))","v":{"$error":"#REF!"}},{"$error":"#REF!"},{"$f":"IF(#REF!=\"Tabela Não Desonerada\",VLOOKUP($C169,#REF!,15,FALSE),VLOOKUP($C169,#REF!,15,FALSE))","v":{"$error":"#REF!"}},{"$error":"#REF!"}]
[1,{"$f":"'Orçamento-TCE'!B170","v":159},{"$f":"'Orçamento-TCE'!C170","v":"11.39"},{"$f":"'Orçamento-TCE'!G170","v":"JUNÇÃO SIMPLES, PVC, SÉRIE NORMAL, ESGOTO PREDIAL, DN 100X100MM, JUNTA ELÁSTICA, FORNECIDO E INSTALADO EM RAMAL DE DESCARGA OU RAMAL DE ESGOTO SANITÁRIO. AF_12/2014"},{"$f":"'Orçamento-TCE'!H170","v":22},{"$f":"'Orçamento-TCE'!I170","v":"UN"},{"$f":"Orçamento!H178","v":63.12},{"$f":"Orçamento!I178","v":1388.64},{"$f":"Orçamento!G178","v":0.22159999999999999},1.1122000000000001,null,44.183999999999997,18.936,{"$error":"#REF!"},{"$f":"IF(#REF!=\"Tabela Não Desonerada\",VLOOKUP($C170,#REF!,13,FALSE),VLOOKUP($C170,#REF!,13,FALSE))","v":{"$error":"#REF!"}},{"$error":"#REF!"},{"$f":"IF(#REF!=\"Tabela Não Desonerada\",VLOOKUP($C170,#REF!,14,FALSE),VLOOKUP($C170,#REF!,14,FALSE))","v":{"$error":"#REF!"}},{"$error":"#REF!"},{"$f":"IF(#REF!=\"Tabela Não Desonerada\",VLOOKUP($C170,#REF!,15,FALSE),VLOOKUP($C170,#REF!,15,FALSE))","v":{"$error":"#REF!"}},{"$error":"#REF!"}]
[1,{"$f":"'Orçamento-TCE'!B171","v":160},{"$f":"'Orçamento-TCE'!C171","v":"11.40"},{"$f":"'Orçamento-TCE'!G171","v":"RALO SIFONADO, PVC, DN 100X40MM, JUNTA SOLDÁVEL, FORNECIDO E INSTALADO EM RAMAL DE DESCARGA OU EM RAMAL DE ESGOTO SANITÁRIO. AF_12/2014"},{"$f":"'Orçamento-TCE'!H171","v":17},{"$f":"'Orçamento-TCE'!I171","v":"UN"},{"$f":"Orçamento!H179","v":22.05},{"$f":"Orçamento!I179","v":374.85},{"$f":"Orçamento!G179","v":0.22159999999999999},1.1122000000000001,null,15.434999999999999,6.615000000000002,{"$error":"#REF!"},{"$f":"IF(#REF!=\"Tabela Não Desonerada\",VLOOKUP($C171,#REF!,13,FALSE),VLOOKUP($C171,#REF!,13,FALSE))","v":{"$error":"#REF!"}},{"$error":"#REF!"},{"$f":"IF(#REF!=\"Tabela Não Desonerada\",VLOOKUP($C171,#REF!,14,FALSE),VLOOKUP($C171,#REF!,14,FALSE))","v":{"$error":"#REF!"}},{"$error":"#REF!"},{"$f":"IF(#REF!=\"Tabela Não Desonerada\",VLOOKUP($C171,#REF!,15,FALSE),VLOOKUP($C171,#REF!,15,FALSE))","v":{"$error":"#REF!"}},{"$error":"#REF!"}]
[1,{"$f":"'Orçamento-TCE'!B172","v":161},{"$f":"'Orçamento-TCE'!C172","v":"11.41"},{"$f":"'Orçamento-TCE'!G172","v":"CAIXA DE GORDURA PEQUENA (CAPACIDADE: 19L), CIRCULAR, EM PVC, DIÂMETRO INTERNO  = 0,3M. AF_12/2020"},{"$f":"'Orçamento-TCE'!H172","v":3},{"$f":"'Orçamento-TCE'!I172","v":"UN"},{"$f":"Orçamento!H180","v":567.4},{"$f":"Orçamento!I180","v":1702.2},{"$f":"Orçamento!G180","v":0.22159999999999999},1.1122000000000001,null,397.17999999999995,170.22000000000003,{"$error":"#REF!"},{"$f":"IF(#REF!=\"Tabela Não Desonerada\",VLOOKUP($C172,#REF!,13,FALSE),VLOOKUP($C172,#REF!,13,FALSE))","v":{"$error":"#REF!"}},{"$error":"#REF!"},{"$f":"IF(#REF!=\"Tabela Não Desonerada\",VLOOKUP($C172,#REF!,14,FALSE),VLOOKUP($C172,#REF!,14,FALSE))","v":{"$error":"#REF!"}},{"$error":"#REF!"},{"$f":"IF(#REF!=\"Tabela Não Desonerada\",VLOOKUP($C172,#REF!,15,FALSE),VLOOKUP($C172,#REF!,15,FALSE))","v":{"$error":"#REF!"}},{"$error":"#REF!"}]
[1,{"$f":"'Orçamento-TCE'!B173","v":162},{"$f":"'Orçamento-TCE'!C173","v":"11.42"},{"$f":"'Orçamento-TCE'!G173","v":"MISTURADOR MONOCOMANDO PARA CHUVEIRO, BASE BRUTA E ACABAMENTO CROMADO - FORNECIDO E INSTALADO EM RAMAL DE ÁGUA. AF_12/2014"},{"$f":"'Orçamento-TCE'!H173","v":16},{"$f":"'Orçamento-TCE'!I173","v":"UN"},{"$f":"Orçamento!H181","v":952.15},{"$f":"Orçamento!I181","v":15234.4},{"$f":"Orçamento!G181","v":0.22159999999999999},1.1122000000000001,null,666.505,285.64499999999998,{"$error":"#REF!"},{"$f":"IF(#REF!=\"Tabela Não Desonerada\",VLOOKUP($C173,#REF!,13,FALSE),VLOOKUP($C173,#REF!,13,FALSE))","v":{"$error":"#REF!"}},{"$error":"#REF!"},{"$f":"IF(#REF!=\"Tabela Não Desonerada\",VLOOKUP($C173,#REF!,14,FALSE),VLOOKUP($C173,#REF!,14,FALSE))","v":{"$error":"#REF!"}},{"$error":"#REF!"},{"$f":"IF(#REF!=\"Tabela Não Desonerada\",VLOOKUP($C173,#REF!,15,FALSE),VLOOKUP($C173,#REF!,15,FALSE))","v":{"$error":"#REF!"}},{"$error":"#REF!"}]
[1,{"$f":"'Orçamento-TCE'!B174","v":163},{"$f":"'Orçamento-TCE'!C174","v":"11.43"},{"$f":"'Orçamento-TCE'!G174","v":"CAIXA SIFONADA, PVC, DN 150X185X75MM, FORNECIDA E INSTALADA EM RAMAIS DE ENCAMINHAMENTO DE ÁGUA PLUVIAL. AF_12/2014"},{"$f":"'Orçamento-TCE'!H174","v":16},{"$f":"'Orçamento-TCE'!I174","v":"UN"},{"$f":"Orçamento!H182","v":118.3},{"$f":"Orçamento!I182","v":1892.8},{"$f":"Orçamento!G182","v":0.22159999999999999},1.1122000000000001,null,82.809999999999988,35.490000000000009,{"$error":"#REF!"},{"$f":"IF(#REF!=\"Tabela Não Desonerada\",VLOOKUP($C174,#REF!,13,FALSE),VLOOKUP($C174,#REF!,13,FALSE))","v":{"$error":"#REF!"}},{"$error":"#REF!"},{"$f":"IF(#REF!=\"Tabela Não Desonerada\",VLOOKUP($C174,#REF!,14,FALSE),VLOOKUP($C174,#REF!,14,FALSE))","v":{"$error":"#REF!"}},{"$error":"#REF!"},{"$f":"IF(#REF!=\"Tabela Não Desonerada\",VLOOKUP($C174,#REF!,15,FALSE),VLOOKUP($C174,#REF!,15,FALSE))","v":{"$error":"#REF!"}},{"$error":"#REF!"}]
[1,{"$f":"'Orçamento-TCE'!B175","v":164},{"$f":"'Orçamento-TCE'!C175","v":"11.44"},{"$f":"'Orçamento-TCE'!G175","v":"VÁLVULA DE DESCARGA METÁLICA, BASE 1 1/2\", ACABAMENTO METÁLICO CROMADO - FORNECIMENTO E INSTALAÇÃO. AF_01/2019"},{"$f":"'Orçamento-TCE'!H175","v":12},{"$f":"'Orçamento-TCE'!I175","v":"UN"},{"$f":"Orçamento!H183","v":369.2},{"$f":"Orçamento!I183","v":4430.3999999999996},{"$f":"Orçamento!G183","v":0.22159999999999999},1.1122000000000001,null,258.44,110.75999999999999,{"$error":"#REF!"},{"$f":"IF(#REF!=\"Tabela Não Desonerada\",VLOOKUP($C175,#REF!,13,FALSE),VLOOKUP($C175,#REF!,13,FALSE))","v":{"$error":"#REF!"}},{"$error":"#REF!"},{"$f":"IF(#REF!=\"Tabela Não Desonerada\",VLOOKUP($C175,#REF!,14,FALSE),VLOOKUP($C175,#REF!,14,FALSE))","v":{"$error":"#REF!"}},{"$error":"#REF!"},{"$f":"IF(#REF!=\"Tabela Não Desonerada\",VLOOKUP($C175,#REF!,15,FALSE),VLOOKUP($C175,#REF!,15,FALSE))","v":{"$error":"#REF!"}},{"$error":"#REF!"}]
[1,{"$f":"'Orçamento-TCE'!B176","v":165},{"$f":"'Orçamento-TCE'!C176","v":"11.45"},{"$f":"'Orçamento-TCE'!G176","v":"REGISTRO DE ESFERA, PVC, SOLDÁVEL, DN 25MM, INSTALADO EM RESERVAÇÃO DE ÁGUA DE EDIFIAÇÃO QUE POSSUA RESERVATÓRIO DE FIBRA/FIBROCIMENTO - FORNECIMENTO E INSTALAÇÃO. AF_06/2016"},{"$f":"'Orçamento-TCE'!H176","v":5},{"$f":"'Orçamento-TCE'!I176","v":"UN"},{"$f":"Orçamento!H184","v":43.02},{"$f":"Orçamento!I184","v":215.1},{"$f":"Orçamento!G184","v":0.22159999999999999},1.1122000000000001,null,30.114000000000001,12.906000000000002,{"$error":"#REF!"},{"$f":"IF(#REF!=\"Tabela Não Desonerada\",VLOOKUP($C176,#REF!,13,FALSE),VLOOKUP($C176,#REF!,13,FALSE))","v":{"$error":"#REF!"}},{"$error":"#REF!"},{"$f":"IF(#REF!=\"Tabela Não Desonerada\",VLOOKUP($C176,#REF!,14,FALSE),VLOOKUP($C176,#REF!,14,FALSE))","v":{"$error":"#REF!"}},{"$error":"#REF!"},{"$f":"IF(#REF!=\"Tabela Não Desonerada\",VLOOKUP($C176,#REF!,15,FALSE),VLOOKUP($C176,#REF!,15,FALSE))","v":{"$error":"#REF!"}},{"$error":"#REF!"}]
[1,{"$f":"'Orçamento-TCE'!B177","v":166},{"$f":"'Orçamento-TCE'!C177","v":"11.46"},{"$f":"'Orçamento-TCE'!G177","v":"REGISTRO DE ESFERA, PVC, SOLDÁVEL, DN 32MM, INSTALADO EM RESERVAÇÃO DE ÁGUA DE EDIFIAÇÃO QUE POSSUA RESERVATÓRIO DE FIBRA/FIBROCIMENTO - FORNECIMENTO E INSTALAÇÃO. AF_06/2016"},{"$f":"'Orçamento-TCE'!H177","v":5},{"$f":"'Orçamento-TCE'!I177","v":"UN"},{"$f":"Orçamento!H185","v":64.709999999999994},{"$f":"Orçamento!I185","v":323.55},{"$f":"Orçamento!G185","v":0.22159999999999999},1.1122000000000001,null,45.29699999999999,19.413000000000004,{"$error":"#REF!"},{"$f":"IF(#REF!=\"Tabela Não Desonerada\",VLOOKUP($C177,#REF!,13,FALSE),VLOOKUP($C177,#REF!,13,FALSE))","v":{"$error":"#REF!"}},{"$error":"#REF!"},{"$f":"IF(#REF!=\"Tabela Não Desonerada\",VLOOKUP($C177,#REF!,14,FALSE),VLOOKUP($C177,#REF!,14,FALSE))","v":{"$error":"#REF!"}},{"$error":"#REF!"},{"$f":"IF(#REF!=\"Tabela Não Desonerada\",VLOOKUP($C177,#REF!,15,FALSE),VLOOKUP($C177,#REF!,15,FALSE))","v":{"$error":"#REF!"}},{"$error":"#REF!"}]
[1,{"$f":"'Orçamento-TCE'!B178","v":167},{"$f":"'Orçamento-TCE'!C178","v":"11.47"},{"$f":"'Orçamento-TCE'!G178","v":"REGISTRO DE ESFERA, PVC, SOLDÁVEL, DN 60MM, INSTALADO EM RESERVAÇÃO DE ÁGUA DE EDIFICAÇÃO QUE POSSUA RESERVATÓRIO DE FIBRA/FIBROCIMENTO - FORNECIMENTO E INSTALAÇÃO. AF_06/2016"},{"$f":"'Orçamento-TCE'!H178","v":2},{"$f":"'Orçamento-TCE'!I178","v":"UN"},{"$f":"Orçamento!H186","v":166.47},{"$f":"Orçamento!I186","v":332.94},{"$f":"Orçamento!G186","v":0.22159999999999999},1.1122000000000001,null,116.529,49.941000000000003,{"$error":"#REF!"},{"$f":"IF(#REF!=\"Tabela Não Desonerada\",VLOOKUP($C178,#REF!,13,FALSE),VLOOKUP($C178,#REF!,13,FALSE))","v":{"$error":"#REF!"}},{"$error":"#REF!"},{"$f":"IF(#REF!=\"Tabela Não Desonerada\",VLOOKUP($C178,#REF!,14,FALSE),VLOOKUP($C178,#REF!,14,FALSE))","v":{"$error":"#REF!"}},{"$error":"#REF!"},{"$f":"IF(#REF!=\"Tabela Não Desonerada\",VLOOKUP($C178,#REF!,15,FALSE),VLOOKUP($C178,#REF!,15,FALSE))","v":{"$error":"#REF!"}},{"$error":"#REF!"}]
[1,{"$f":"'Orçamento-TCE'!B179","v":168},{"$f":"'Orçamento-TCE'!C179","v":"11.48"},{"$f":"'Orçamento-TCE'!G179","v":"CALDEIRA MURAL GLP, POTÊNCIA NOMINAL 69,0KW, VAZÃO 42,5 L/MINM COM CHAMINÉ INCLUSA"},{"$f":"'Orçamento-TCE'!H179","v":2},{"$f":"'Orçamento-TCE'!I179","v":"UN"},{"$f":"Orçamento!H187","v":14284.71},{"$f":"Orçamento!I187","v":28569.42},{"$f":"Orçamento!G187","v":0.22159999999999999},1.1122000000000001,null,9999.2969999999987,4285.4130000000005,{"$error":"#REF!"},{"$f":"IF(#REF!=\"Tabela Não Desonerada\",VLOOKUP($C179,#REF!,13,FALSE),VLOOKUP($C179,#REF!,13,FALSE))","v":{"$error":"#REF!"}},{"$error":"#REF!"},{"$f":"IF(#REF!=\"Tabela Não Desonerada\",VLOOKUP($C179,#REF!,14,FALSE),VLOOKUP($C179,#REF!,14,FALSE))","v":{"$error":"#REF!"}},{"$error":"#REF!"},{"$f":"IF(#REF!=\"Tabela Não Desonerada\",VLOOKUP($C179,#REF!,15,FALSE),VLOOKUP($C179,#REF!,15,FALSE))","v":{"$error":"#REF!"}},{"$error":"#REF!"}]
[1,{"$f":"'Orçamento-TCE'!B180","v":169},{"$f":"'Orçamento-TCE'!C180","v":"11.49"},{"$f":"'Orçamento-TCE'!G180","v":"RESERVATÓRIO DE ÁGUA QUENTE 300 LITROS"},{"$f":"'Orçamento-TCE'!H180","v":2},{"$f":"'Orçamento-TCE'!I180","v":"UN"},{"$f":"Orçamento!H188","v":3987.89},{"$f":"Orçamento!I188","v":7975.78},{"$f":"Orçamento!G188","v":0.22159999999999999},1.1122000000000001,null,2791.5229999999997,1196.3670000000002,{"$error":"#REF!"},{"$f":"IF(#REF!=\"Tabela Não Desonerada\",VLOOKUP($C180,#REF!,13,FALSE),VLOOKUP($C180,#REF!,13,FALSE))","v":{"$error":"#REF!"}},{"$error":"#REF!"},{"$f":"IF(#REF!=\"Tabela Não Desonerada\",VLOOKUP($C180,#REF!,14,FALSE),VLOOKUP($C180,#REF!,14,FALSE))","v":{"$error":"#REF!"}},{"$error":"#REF!"},{"$f":"IF(#REF!=\"Tabela Não Desonerada\",VLOOKUP($C180,#REF!,15,FALSE),VLOOKUP($C180,#REF!,15,FALSE))","v":{"$error":"#REF!"}},{"$error":"#REF!"}]
[1,{"$f":"'Orçamento-TCE'!B181","v":170},{"$f":"'Orçamento-TCE'!C181","v":"11.50"},{"$f":"'Orçamento-TCE'!G181","v":"CONJUNTO HIDRÁULICO PARA INSTALAÇÃO DE BOMBA EM AÇO ROSCÁVEL, DN SUCÇÃO 40 (1 1/2\") E DN RECALQUE 32 (1 1/4\"), PARA EDIFICAÇÃO ENTRE 4 E 8 PAVIMENTOS - FORNECIMENTO E INSTALAÇÃO. AF_06/2016"},{"$f":"'Orçamento-TCE'!H181","v":2},{"$f":"'Orçamento-TCE'!I181","v":"UN"},{"$f":"Orçamento!H189","v":1755.48},{"$f":"Orçamento!I189","v":3510.96},{"$f":"Orçamento!G189","v":0.22159999999999999},1.1122000000000001,null,1228.836,526.64400000000001,{"$error":"#REF!"},{"$f":"IF(#REF!=\"Tabela Não Desonerada\",VLOOKUP($C181,#REF!,13,FALSE),VLOOKUP($C181,#REF!,13,FALSE))","v":{"$error":"#REF!"}},{"$error":"#REF!"},{"$f":"IF(#REF!=\"Tabela Não Desonerada\",VLOOKUP($C181,#REF!,14,FALSE),VLOOKUP($C181,#REF!,14,FALSE))","v":{"$error":"#REF!"}},{"$error":"#REF!"},{"$f":"IF(#REF!=\"Tabela Não Desonerada\",VLOOKUP($C181,#REF!,15,FALSE),VLOOKUP($C181,#REF!,15,FALSE))","v":{"$error":"#REF!"}},{"$error":"#REF!"}]
[1,{"$f":"'Orçamento-TCE'!B182","v":171},{"$f":"'Orçamento-TCE'!C182","v":"11.51"},{"$f":"'Orçamento-TCE'!G182","v":"VÁLVULA QUEBRA VÁCUO 32MM "},{"$f":"'Orçamento-TCE'!H182","v":2},{"$f":"'Orçamento-TCE'!I182","v":"UN"},{"$f":"Orçamento!H190","v":374.57},{"$f":"Orçamento!I190","v":749.14},{"$f":"Orçamento!G190","v":0.22159999999999999},1.1122000000000001,null,262.19899999999996,112.37100000000004,{"$error":"#REF!"},{"$f":"IF(#REF!=\"Tabela Não Desonerada\",VLOOKUP($C182,#REF!,13,FALSE),VLOOKUP($C182,#REF!,13,FALSE))","v":{"$error":"#REF!"}},{"$error":"#REF!"},{"$f":"IF(#REF!=\"Tabela Não Desonerada\",VLOOKUP($C182,#REF!,14,FALSE),VLOOKUP($C182,#REF!,14,FALSE))","v":{"$error":"#REF!"}},{"$error":"#REF!"},{"$f":"IF(#REF!=\"Tabela Não Desonerada\",VLOOKUP($C182,#REF!,15,FALSE),VLOOKUP($C182,#REF!,15,FALSE))","v":{"$error":"#REF!"}},{"$error":"#REF!"}]
[1,{"$f":"'Orçamento-TCE'!B183","v":172},{"$f":"'Orçamento-TCE'!C183","v":"11.52"},{"$f":"'Orçamento-TCE'!G183","v":"REGISTRO DE ESFERA, PVC SOLDÁVEL, DN 32MM, INSTALADO EM RESERVAÇÃO DE ÁGUA DE EDIFICAÇÃO QUE POSSUA RESERVATÓRIO DE FIBRA/FIBROCIMENTO - FORNECIMENTO E INSTALAÇÃO. AF_06/2016"},{"$f":"'Orçamento-TCE'!H183","v":2},{"$f":"'Orçamento-TCE'!I183","v":"UN"},{"$f":"Orçamento!H191","v":64.709999999999994},{"$f":"Orçamento!I191","v":129.41999999999999},{"$f":"Orçamento!G191","v":0.22159999999999999},1.1122000000000001,null,45.29699999999999,19.413000000000004,{"$error":"#REF!"},{"$f":"IF(#REF!=\"Tabela Não Desonerada\",VLOOKUP($C183,#REF!,13,FALSE),VLOOKUP($C183,#REF!,13,FALSE))","v":{"$error":"#REF!"}},{"$error":"#REF!"},{"$f":"IF(#REF!=\"Tabela Não Desonerada\",VLOOKUP($C183,#REF!,14,FALSE),VLOOKUP($C183,#REF!,14,FALSE))","v":{"$error":"#REF!"}},{"$error":"#REF!"},{"$f":"IF(#REF!=\"Tabela Não Desonerada\",VLOOKUP($C183,#REF!,15,FALSE),VLOOKUP($C183,#REF!,15,FALSE))","v":{"$error":"#REF!"}},{"$error":"#REF!"}]
[1,{"$f":"'Orçamento-TCE'!B184","v":173},{"$f":"'Orçamento-TCE'!C184","v":"11.53"},{"$f":"'Orçamento-TCE'!G184","v":"QUADRO DE DISTRIBUIÇÃO DE ENERGIA EM CHAPA DE AÇO GALVANIZADO, DE EMBUTIR, COM BARRAMENTO TRIFÁSICO, PARA 30 DISJUNTORES DIN 225A - FORNECIMENTO E INSTALAÇÃO. AF_10/2020"},{"$f":"'Orçamento-TCE'!H184","v":2},{"$f":"'Orçamento-TCE'!I184","v":"UN"},{"$f":"Orçamento!H192","v":2007.81},{"$f":"Orçamento!I192","v":4015.62},{"$f":"Orçamento!G192","v":0.22159999999999999},1.1122000000000001,null,1405.4669999999999,602.34300000000007,{"$error":"#REF!"},{"$f":"IF(#REF!=\"Tabela Não Desonerada\",VLOOKUP($C184,#REF!,13,FALSE),VLOOKUP($C184,#REF!,13,FALSE))","v":{"$error":"#REF!"}},{"$error":"#REF!"},{"$f":"IF(#REF!=\"Tabela Não Desonerada\",VLOOKUP($C184,#REF!,14,FALSE),VLOOKUP($C184,#REF!,14,FALSE))","v":{"$error":"#REF!"}},{"$error":"#REF!"},{"$f":"IF(#REF!=\"Tabela Não Desonerada\",VLOOKUP($C184,#REF!,15,FALSE),VLOOKUP($C184,#REF!,15,FALSE))","v":{"$error":"#REF!"}},{"$error":"#REF!"}]
[1,{"$f":"'Orçamento-TCE'!B185","v":174},{"$f":"'Orçamento-TCE'!C185","v":"11.54"},{"$f":"'Orçamento-TCE'!G185","v":"ELETRODUTO FLEXÍVEL CORRUGADO REFORÇADO, PVC, DN 25MM (3/4'), PARA CIRCUITOS TERMINAIS, INSTALADO EM PAREDE - FORNECIMENTO E INSTALAÇÃO. AF_12/2015"},{"$f":"'Orçamento-TCE'!H185","v":2},{"$f":"'Orçamento-TCE'!I185","v":"M"},{"$f":"Orçamento!H193","v":11.85},{"$f":"Orçamento!I193","v":23.7},{"$f":"Orçamento!G193","v":0.22159999999999999},1.1122000000000001,null,8.2949999999999999,3.5549999999999997,{"$error":"#REF!"},{"$f":"IF(#REF!=\"Tabela Não Desonerada\",VLOOKUP($C185,#REF!,13,FALSE),VLOOKUP($C185,#REF!,13,FALSE))","v":{"$error":"#REF!"}},{"$error":"#REF!"},{"$f":"IF(#REF!=\"Tabela Não Desonerada\",VLOOKUP($C185,#REF!,14,FALSE),VLOOKUP($C185,#REF!,14,FALSE))","v":{"$error":"#REF!"}},{"$error":"#REF!"},{"$f":"IF(#REF!=\"Tabela Não Desonerada\",VLOOKUP($C185,#REF!,15,FALSE),VLOOKUP($C185,#REF!,15,FALSE))","v":{"$error":"#REF!"}},{"$error":"#REF!"}]
[1,{"$f":"'Orçamento-TCE'!B186","v":175},{"$f":"'Orçamento-TCE'!C186","v":"11.55"},{"$f":"'Orçamento-TCE'!G186","v":"ELETRODUTO RÍGIDO ROSCÁVEL, PVC, DN 25MM (3/4\"), PARA CIRCUITOS TERMINAIS, INSTALADO EM FORRO - FORNECIMENTO E INSTALAÇÃO. AF_12/2015"},{"$f":"'Orçamento-TCE'!H186","v":6},{"$f":"'Orçamento-TCE'!I186","v":"M"},{"$f":"Orçamento!H194","v":13.14},{"$f":"Orçamento!I194","v":78.84},{"$f":"Orçamento!G194","v":0.22159999999999999},1.1122000000000001,null,9.1980000000000004,3.9420000000000002,{"$error":"#REF!"},{"$f":"IF(#REF!=\"Tabela Não Desonerada\",VLOOKUP($C186,#REF!,13,FALSE),VLOOKUP($C186,#REF!,13,FALSE))","v":{"$error":"#REF!"}},{"$error":"#REF!"},{"$f":"IF(#REF!=\"Tabela Não Desonerada\",VLOOKUP($C186,#REF!,14,FALSE),VLOOKUP($C186,#REF!,14,FALSE))","v":{"$error":"#REF!"}},{"$error":"#REF!"},{"$f":"IF(#REF!=\"Tabela Não Desonerada\",VLOOKUP($C186,#REF!,15,FALSE),VLOOKUP($C186,#REF!,15,FALSE))","v":{"$error":"#REF!"}},{"$error":"#REF!"}]
[1,{"$f":"'Orçamento-TCE'!B187","v":176},{"$f":"'Orçamento-TCE'!C187","v":"11.56"},{"$f":"'Orçamento-TCE'!G187","v":"CONDULETE DE PVC, TIPO B, PARA ELETRODUTO DE PVC SOLDÁVEL DN 20MM (1/2\"), APARENTE - FORNECIMENTO E INSTALAÇÃO. AF_11/2016"},{"$f":"'Orçamento-TCE'!H187","v":12},{"$f":"'Orçamento-TCE'!I187","v":"UN"},{"$f":"Orçamento!H195","v":30.63},{"$f":"Orçamento!I195","v":367.56},{"$f":"Orçamento!G195","v":0.22159999999999999},1.1122000000000001,null,21.440999999999999,9.1890000000000001,{"$error":"#REF!"},{"$f":"IF(#REF!=\"Tabela Não Desonerada\",VLOOKUP($C187,#REF!,13,FALSE),VLOOKUP($C187,#REF!,13,FALSE))","v":{"$error":"#REF!"}},{"$error":"#REF!"},{"$f":"IF(#REF!=\"Tabela Não Desonerada\",VLOOKUP($C187,#REF!,14,FALSE),VLOOKUP($C187,#REF!,14,FALSE))","v":{"$error":"#REF!"}},{"$error":"#REF!"},{"$f":"IF(#REF!=\"Tabela Não Desonerada\",VLOOKUP($C187,#REF!,15,FALSE),VLOOKUP($C187,#REF!,15,FALSE))","v":{"$error":"#REF!"}},{"$error":"#REF!"}]
[1,{"$f":"'Orçamento-TCE'!B188","v":177},{"$f":"'Orçamento-TCE'!C188","v":"11.57"},{"$f":"'Orçamento-TCE'!G188","v":"CUBA DE EMBUTIR OVAL EM LOUÇA BRANCA, 35X50CM OU EQUIVALENTE - FORNECIMENTO E INSTALAÇÃO. AF_11/2016"},{"$f":"'Orçamento-TCE'!H188","v":18},{"$f":"'Orçamento-TCE'!I188","v":"UN"},{"$f":"Orçamento!H196","v":157.16},{"$f":"Orçamento!I196","v":2828.88},{"$f":"Orçamento!G196","v":0.22159999999999999},1.1122000000000001,null,110.01199999999999,47.14800000000001,{"$error":"#REF!"},{"$f":"IF(#REF!=\"Tabela Não Desonerada\",VLOOKUP($C188,#REF!,13,FALSE),VLOOKUP($C188,#REF!,13,FALSE))","v":{"$error":"#REF!"}},{"$error":"#REF!"},{"$f":"IF(#REF!=\"Tabela Não Desonerada\",VLOOKUP($C188,#REF!,14,FALSE),VLOOKUP($C188,#REF!,14,FALSE))","v":{"$error":"#REF!"}},{"$error":"#REF!"},{"$f":"IF(#REF!=\"Tabela Não Desonerada\",VLOOKUP($C188,#REF!,15,FALSE),VLOOKUP($C188,#REF!,15,FALSE))","v":{"$error":"#REF!"}},{"$error":"#REF!"}]
[1,{"$f":"'Orçamento-TCE'!B189","v":178},{"$f":"'Orçamento-TCE'!C189","v":"11.58"},{"$f":"'Orçamento-TCE'!G189","v":"VASO SANITÁRIO SIFONADO CONVENCIONAL COM LOUÇA BRANCA - FORNECIMENTO E INSTALAÇÃO. AF_01/2020"},{"$f":"'Orçamento-TCE'!H189","v":7},{"$f":"'Orçamento-TCE'!I189","v":"UN"},{"$f":"Orçamento!H197","v":317.91000000000003},{"$f":"Orçamento!I197","v":2225.37},{"$f":"Orçamento!G197","v":0.22159999999999999},1.1122000000000001,null,222.53700000000001,95.373000000000019,{"$error":"#REF!"},{"$f":"IF(#REF!=\"Tabela Não Desonerada\",VLOOKUP($C189,#REF!,13,FALSE),VLOOKUP($C189,#REF!,13,FALSE))","v":{"$error":"#REF!"}},{"$error":"#REF!"},{"$f":"IF(#REF!=\"Tabela Não Desonerada\",VLOOKUP($C189,#REF!,14,FALSE),VLOOKUP($C189,#REF!,14,FALSE))","v":{"$error":"#REF!"}},{"$error":"#REF!"},{"$f":"IF(#REF!=\"Tabela Não Desonerada\",VLOOKUP($C189,#REF!,15,FALSE),VLOOKUP($C189,#REF!,15,FALSE))","v":{"$error":"#REF!"}},{"$error":"#REF!"}]
[1,{"$f":"'Orçamento-TCE'!B190","v":179},{"$f":"'Orçamento-TCE'!C190","v":"11.59"},{"$f":"'Orçamento-TCE'!G190","v":"VASO SANITARIO SIFONADO CONVENCIONAL COM LOUÇA BRANCA, INCLUSO CONJUNTO DE LIGAÇÃO PARA BACIA SANITÁRIA AJUSTÁVEL - FORNECIMENTO E INSTALAÇÃO. AF_10/2016"},{"$f":"'Orçamento-TCE'!H190","v":7},{"$f":"'Orçamento-TCE'!I190","v":"UN"},{"$f":"Orçamento!H198","v":329.8},{"$f":"Orçamento!I198","v":2308.6},{"$f":"Orçamento!G198","v":0.22159999999999999},1.1122000000000001,null,230.85999999999999,98.940000000000026,{"$error":"#REF!"},{"$f":"IF(#REF!=\"Tabela Não Desonerada\",VLOOKUP($C190,#REF!,13,FALSE),VLOOKUP($C190,#REF!,13,FALSE))","v":{"$error":"#REF!"}},{"$error":"#REF!"},{"$f":"IF(#REF!=\"Tabela Não Desonerada\",VLOOKUP($C190,#REF!,14,FALSE),VLOOKUP($C190,#REF!,14,FALSE))","v":{"$error":"#REF!"}},{"$error":"#REF!"},{"$f":"IF(#REF!=\"Tabela Não Desonerada\",VLOOKUP($C190,#REF!,15,FALSE),VLOOKUP($C190,#REF!,15,FALSE))","v":{"$error":"#REF!"}},{"$error":"#REF!"}]
[1,{"$f":"'Orçamento-TCE'!B191","v":180},{"$f":"'Orçamento-TCE'!C191","v":"11.60"},{"$f":"'Orçamento-TCE'!G191","v":"MICTÓRIO SIFONADO LOUÇA BRANCA, PADRÃO MÉDIO - FORNECIMENTO E INSTALAÇÃO. AF_01/2020"},{"$f":"'Orçamento-TCE'!H191","v":2},{"$f":"'Orçamento-TCE'!I191","v":"UN"},{"$f":"Orçamento!H199","v":741.98},{"$f":"Orçamento!I199","v":1483.96},{"$f":"Orçamento!G199","v":0.22159999999999999},1.1122000000000001,null,519.38599999999997,222.59400000000005,{"$error":"#REF!"},{"$f":"IF(#REF!=\"Tabela Não Desonerada\",VLOOKUP($C191,#REF!,13,FALSE),VLOOKUP($C191,#REF!,13,FALSE))","v":{"$error":"#REF!"}},{"$error":"#REF!"},{"$f":"IF(#REF!=\"Tabela Não Desonerada\",VLOOKUP($C191,#REF!,14,FALSE),VLOOKUP($C191,#REF!,14,FALSE))","v":{"$error":"#REF!"}},{"$error":"#REF!"},{"$f":"IF(#REF!=\"Tabela Não Desonerada\",VLOOKUP($C191,#REF!,15,FALSE),VLOOKUP($C191,#REF!,15,FALSE))","v":{"$error":"#REF!"}},{"$error":"#REF!"}]
[1,{"$f":"'Orçamento-TCE'!B192","v":181},{"$f":"'Orçamento-TCE'!C192","v":"11.61"},{"$f":"'Orçamento-TCE'!G192","v":"ASSENTO SANITÁRIO CONVENCIONAL - FORNECIMENTO E INSTALAÇÃO"},{"$f":"'Orçamento-TCE'!H192","v":14},{"$f":"'Orçamento-TCE'!I192","v":"UN"},{"$f":"Orçamento!H200","v":60.88},{"$f":"Orçamento!I200","v":852.32},{"$f":"Orçamento!G200","v":0.22159999999999999},1.1122000000000001,null,42.616,18.264000000000003,{"$error":"#REF!"},{"$f":"IF(#REF!=\"Tabela Não Desonerada\",VLOOKUP($C192,#REF!,13,FALSE),VLOOKUP($C192,#REF!,13,FALSE))","v":{"$error":"#REF!"}},{"$error":"#REF!"},{"$f":"IF(#REF!=\"Tabela Não Desonerada\",VLOOKUP($C192,#REF!,14,FALSE),VLOOKUP($C192,#REF!,14,FALSE))","v":{"$error":"#REF!"}},{"$error":"#REF!"},{"$f":"IF(#REF!=\"Tabela Não Desonerada\",VLOOKUP($C192,#REF!,15,FALSE),VLOOKUP($C192,#REF!,15,FALSE))","v":{"$error":"#REF!"}},{"$error":"#REF!"}]
[1,{"$f":"'Orçamento-TCE'!B193","v":182},{"$f":"'Orçamento-TCE'!C193","v":"11.62"},{"$f":"'Orçamento-TCE'!G193","v":"TORNEIRA PARA SANITÁRIO PNE AUTOMÁTICA"},{"$f":"'Orçamento-TCE'!H193","v":19},{"$f":"'Orçamento-TCE'!I193","v":"UN"},{"$f":"Orçamento!H201","v":286.43},{"$f":"Orçamento!I201","v":5442.17},{"$f":"Orçamento!G201","v":0.22159999999999999},1.1122000000000001,null,200.501,85.929000000000002,{"$error":"#REF!"},{"$f":"IF(#REF!=\"Tabela Não Desonerada\",VLOOKUP($C193,#REF!,13,FALSE),VLOOKUP($C193,#REF!,13,FALSE))","v":{"$error":"#REF!"}},{"$error":"#REF!"},{"$f":"IF(#REF!=\"Tabela Não Desonerada\",VLOOKUP($C193,#REF!,14,FALSE),VLOOKUP($C193,#REF!,14,FALSE))","v":{"$error":"#REF!"}},{"$error":"#REF!"},{"$f":"IF(#REF!=\"Tabela Não Desonerada\",VLOOKUP($C193,#REF!,15,FALSE),VLOOKUP($C193,#REF!,15,FALSE))","v":{"$error":"#REF!"}},{"$error":"#REF!"}]
[1,{"$f":"'Orçamento-TCE'!B194","v":183},{"$f":"'Orçamento-TCE'!C194","v":"11.63"},{"$f":"'Orçamento-TCE'!G194","v":"PORTA PAPEL HIGIÊNICO EM ROLO - DISPENSER EM PLÁSTICO"},{"$f":"'Orçamento-TCE'!H194","v":14},{"$f":"'Orçamento-TCE'!I194","v":"UN"},{"$f":"Orçamento!H202","v":63.5},{"$f":"Orçamento!I202","v":889},{"$f":"Orçamento!G202","v":0.22159999999999999},1.1122000000000001,null,44.449999999999996,19.050000000000004,{"$error":"#REF!"},{"$f":"IF(#REF!=\"Tabela Não Desonerada\",VLOOKUP($C194,#REF!,13,FALSE),VLOOKUP($C194,#REF!,13,FALSE))","v":{"$error":"#REF!"}},{"$error":"#REF!"},{"$f":"IF(#REF!=\"Tabela Não Desonerada\",VLOOKUP($C194,#REF!,14,FALSE),VLOOKUP($C194,#REF!,14,FALSE))","v":{"$error":"#REF!"}},{"$error":"#REF!"},{"$f":"IF(#REF!=\"Tabela Não Desonerada\",VLOOKUP($C194,#REF!,15,FALSE),VLOOKUP($C194,#REF!,15,FALSE))","v":{"$error":"#REF!"}},{"$error":"#REF!"}]
[1,{"$f":"'Orçamento-TCE'!B195","v":184},{"$f":"'Orçamento-TCE'!C195","v":"11.64"},{"$f":"'Orçamento-TCE'!G195","v":"SABONETEIRA DE PAREDE EM PLASTICO ABS COM ACABAMENTO CROMADO E ACRILICO, INCLUSO FIXAÇÃO. AF_01/2020"},{"$f":"'Orçamento-TCE'!H195","v":13},{"$f":"'Orçamento-TCE'!I195","v":"UN"},{"$f":"Orçamento!H203","v":83.06},{"$f":"Orçamento!I203","v":1079.78},{"$f":"Orçamento!G203","v":0.22159999999999999},1.1122000000000001,null,58.141999999999996,24.918000000000006,{"$error":"#REF!"},{"$f":"IF(#REF!=\"Tabela Não Desonerada\",VLOOKUP($C195,#REF!,13,FALSE),VLOOKUP($C195,#REF!,13,FALSE))","v":{"$error":"#REF!"}},{"$error":"#REF!"},{"$f":"IF(#REF!=\"Tabela Não Desonerada\",VLOOKUP($C195,#REF!,14,FALSE),VLOOKUP($C195,#REF!,14,FALSE))","v":{"$error":"#REF!"}},{"$error":"#REF!"},{"$f":"IF(#REF!=\"Tabela Não Desonerada\",VLOOKUP($C195,#REF!,15,FALSE),VLOOKUP($C195,#REF!,15,FALSE))","v":{"$error":"#REF!"}},{"$error":"#REF!"}]
[1,{"$f":"'Orçamento-TCE'!B196","v":185},{"$f":"'Orçamento-TCE'!C196","v":"11.65"},{"$f":"'Orçamento-TCE'!G196","v":"MEIA SABONETEIRA PARA CHUVEIRO"},{"$f":"'Orçamento-TCE'!H196","v":16},{"$f":"'Orçamento-TCE'!I196","v":"UN"},{"$f":"Orçamento!H204","v":82.94},{"$f":"Orçamento!I204","v":1327.04},{"$f":"Orçamento!G204","v":0.22159999999999999},1.1122000000000001,null,58.057999999999993,24.882000000000005,{"$error":"#REF!"},{"$f":"IF(#REF!=\"Tabela Não Desonerada\",VLOOKUP($C196,#REF!,13,FALSE),VLOOKUP($C196,#REF!,13,FALSE))","v":{"$error":"#REF!"}},{"$error":"#REF!"},{"$f":"IF(#REF!=\"Tabela Não Desonerada\",VLOOKUP($C196,#REF!,14,FALSE),VLOOKUP($C196,#REF!,14,FALSE))","v":{"$error":"#REF!"}},{"$error":"#REF!"},{"$f":"IF(#REF!=\"Tabela Não Desonerada\",VLOOKUP($C196,#REF!,15,FALSE),VLOOKUP($C196,#REF!,15,FALSE))","v":{"$error":"#REF!"}},{"$error":"#REF!"}]
[1,{"$f":"'Orçamento-TCE'!B197","v":186},{"$f":"'Orçamento-TCE'!C197","v":"11.66"},{"$f":"'Orçamento-TCE'!G197","v":"TOALHEIRO DISPENSER PARA TOALHA DE PAPEL, EM PLÁSTICO"},{"$f":"'Orçamento-TCE'!H197","v":14},{"$f":"'Orçamento-TCE'!I197","v":"UN"},{"$f":"Orçamento!H205","v":63.5},{"$f":"Orçamento!I205","v":889},{"$f":"Orçamento!G205","v":0.22159999999999999},1.1122000000000001,null,44.449999999999996,19.050000000000004,{"$error":"#REF!"},{"$f":"IF(#REF!=\"Tabela Não Desonerada\",VLOOKUP($C197,#REF!,13,FALSE),VLOOKUP($C197,#REF!,13,FALSE))","v":{"$error":"#REF!"}},{"$error":"#REF!"},{"$f":"IF(#REF!=\"Tabela Não Desonerada\",VLOOKUP($C197,#REF!,14,FALSE),VLOOKUP($C197,#REF!,14,FALSE))","v":{"$error":"#REF!"}},{"$error":"#REF!"},{"$f":"IF(#REF!=\"Tabela Não Desonerada\",VLOOKUP($C197,#REF!,15,FALSE),VLOOKUP($C197,#REF!,15,FALSE))","v":{"$error":"#REF!"}},{"$error":"#REF!"}]
[1,{"$f":"'Orçamento-TCE'!B198","v":187},{"$f":"'Orçamento-TCE'!C198","v":"11.67"},{"$f":"'Orçamento-TCE'!G198","v":"CHUVEIRO AQUECEDOR A GÁS"},{"$f":"'Orçamento-TCE'!H198","v":16},{"$f":"'Orçamento-TCE'!I198","v":"UN"},{"$f":"Orçamento!H206","v":325.73},{"$f":"Orçamento!I206","v":5211.68},{"$f":"Orçamento!G206","v":0.22159999999999999},1.1122000000000001,null,228.011,97.719000000000023,{"$error":"#REF!"},{"$f":"IF(#REF!=\"Tabela Não Desonerada\",VLOOKUP($C198,#REF!,13,FALSE),VLOOKUP($C198,#REF!,13,FALSE))","v":{"$error":"#REF!"}},{"$error":"#REF!"},{"$f":"IF(#REF!=\"Tabela Não Desonerada\",VLOOKUP($C198,#REF!,14,FALSE),VLOOKUP($C198,#REF!,14,FALSE))","v":{"$error":"#REF!"}},{"$error":"#REF!"},{"$f":"IF(#REF!=\"Tabela Não Desonerada\",VLOOKUP($C198,#REF!,15,FALSE),VLOOKUP($C198,#REF!,15,FALSE))","v":{"$error":"#REF!"}},{"$error":"#REF!"}]
[1,{"$f":"'Orçamento-TCE'!B199","v":188},{"$f":"'Orçamento-TCE'!C199","v":"11.68"},{"$f":"'Orçamento-TCE'!G199","v":"BATEDOR DE AÇO POLIDO"},{"$f":"'Orçamento-TCE'!H199","v":14},{"$f":"'Orçamento-TCE'!I199","v":"UN"},{"$f":"Orçamento!H207","v":381.09},{"$f":"Orçamento!I207","v":5335.26},{"$f":"Orçamento!G207","v":0.22159999999999999},1.1122000000000001,null,266.76299999999998,114.327,{"$error":"#REF!"},{"$f":"IF(#REF!=\"Tabela Não Desonerada\",VLOOKUP($C199,#REF!,13,FALSE),VLOOKUP($C199,#REF!,13,FALSE))","v":{"$error":"#REF!"}},{"$error":"#REF!"},{"$f":"IF(#REF!=\"Tabela Não Desonerada\",VLOOKUP($C199,#REF!,14,FALSE),VLOOKUP($C199,#REF!,14,FALSE))","v":{"$error":"#REF!"}},{"$error":"#REF!"},{"$f":"IF(#REF!=\"Tabela Não Desonerada\",VLOOKUP($C199,#REF!,15,FALSE),VLOOKUP($C199,#REF!,15,FALSE))","v":{"$error":"#REF!"}},{"$error":"#REF!"}]
[1,{"$f":"'Orçamento-TCE'!B200","v":189},{"$f":"'Orçamento-TCE'!C200","v":"11.69"},{"$f":"'Orçamento-TCE'!G200","v":"BANCO ARTICULADO, EM AÇO INOX, PARA PCD, FIXADO NA PAREDE - FORNECIMENTO E INSTALAÇÃO. AF_01/2020"},{"$f":"'Orçamento-TCE'!H200","v":10},{"$f":"'Orçamento-TCE'!I200","v":"UN"},{"$f":"Orçamento!H208","v":1635.03},{"$f":"Orçamento!I208","v":16350.3},{"$f":"Orçamento!G208","v":0.22159999999999999},1.1122000000000001,null,1144.521,490.50900000000001,{"$error":"#REF!"},{"$f":"IF(#REF!=\"Tabela Não Desonerada\",VLOOKUP($C200,#REF!,13,FALSE),VLOOKUP($C200,#REF!,13,FALSE))","v":{"$error":"#REF!"}},{"$error":"#REF!"},{"$f":"IF(#REF!=\"Tabela Não Desonerada\",VLOOKUP($C200,#REF!,14,FALSE),VLOOKUP($C200,#REF!,14,FALSE))","v":{"$error":"#REF!"}},{"$error":"#REF!"},{"$f":"IF(#REF!=\"Tabela Não Desonerada\",VLOOKUP($C200,#REF!,15,FALSE),VLOOKUP($C200,#REF!,15,FALSE))","v":{"$error":"#REF!"}},{"$error":"#REF!"}]
[1,{"$f":"'Orçamento-TCE'!B201","v":190},{"$f":"'Orçamento-TCE'!C201","v":"11.70"},{"$f":"'Orçamento-TCE'!G201","v":"BANCOS EM \"L\""},{"$f":"'Orçamento-TCE'!H201","v":14.44},{"$f":"'Orçamento-TCE'!I201","v":"M"},{"$f":"Orçamento!H209","v":738.36},{"$f":"Orçamento!I209","v":10661.92},{"$f":"Orçamento!G209","v":0.22159999999999999},1.1122000000000001,null,516.85199999999998,221.50800000000004,{"$error":"#REF!"},{"$f":"IF(#REF!=\"Tabela Não Desonerada\",VLOOKUP($C201,#REF!,13,FALSE),VLOOKUP($C201,#REF!,13,FALSE))","v":{"$error":"#REF!"}},{"$error":"#REF!"},{"$f":"IF(#REF!=\"Tabela Não Desonerada\",VLOOKUP($C201,#REF!,14,FALSE),VLOOKUP($C201,#REF!,14,FALSE))","v":{"$error":"#REF!"}},{"$error":"#REF!"},{"$f":"IF(#REF!=\"Tabela Não Desonerada\",VLOOKUP($C201,#REF!,15,FALSE),VLOOKUP($C201,#REF!,15,FALSE))","v":{"$error":"#REF!"}},{"$error":"#REF!"}]
[1,{"$f":"'Orçamento-TCE'!B202","v":191},{"$f":"'Orçamento-TCE'!C202","v":"11.71"},{"$f":"'Orçamento-TCE'!G202","v":"ESPELHO PRATA LAMINADO 60X80CM"},{"$f":"'Orçamento-TCE'!H202","v":8.64},{"$f":"'Orçamento-TCE'!I202","v":"M2"},{"$f":"Orçamento!H210","v":226.49},{"$f":"Orçamento!I210","v":1956.87},{"$f":"Orçamento!G210","v":0.22159999999999999},1.1122000000000001,null,158.54300000000001,67.947000000000003,{"$error":"#REF!"},{"$f":"IF(#REF!=\"Tabela Não Desonerada\",VLOOKUP($C202,#REF!,13,FALSE),VLOOKUP($C202,#REF!,13,FALSE))","v":{"$error":"#REF!"}},{"$error":"#REF!"},{"$f":"IF(#REF!=\"Tabela Não Desonerada\",VLOOKUP($C202,#REF!,14,FALSE),VLOOKUP($C202,#REF!,14,FALSE))","v":{"$error":"#REF!"}},{"$error":"#REF!"},{"$f":"IF(#REF!=\"Tabela Não Desonerada\",VLOOKUP($C202,#REF!,15,FALSE),VLOOKUP($C202,#REF!,15,FALSE))","v":{"$error":"#REF!"}},{"$error":"#REF!"}]
[1,{"$f":"'Orçamento-TCE'!B203","v":192},{"$f":"'Orçamento-TCE'!C203","v":"11.72"},{"$f":"'Orçamento-TCE'!G203","v":"BANCADA DE GRANITO CINZA POLIDO, DE 1,50X0,60M, PARA PIA DE COZINHA - FORNECIMENTO E INSTALAÇÃO. AF_01/2020"},{"$f":"'Orçamento-TCE'!H203","v":5},{"$f":"'Orçamento-TCE'!I203","v":"UN"},{"$f":"Orçamento!H211","v":790.77},{"$f":"Orçamento!I211","v":3953.85},{"$f":"Orçamento!G211","v":0.22159999999999999},1.1122000000000001,null,553.53899999999999,237.23099999999999,{"$error":"#REF!"},{"$f":"IF(#REF!=\"Tabela Não Desonerada\",VLOOKUP($C203,#REF!,13,FALSE),VLOOKUP($C203,#REF!,13,FALSE))","v":{"$error":"#REF!"}},{"$error":"#REF!"},{"$f":"IF(#REF!=\"Tabela Não Desonerada\",VLOOKUP($C203,#REF!,14,FALSE),VLOOKUP($C203,#REF!,14,FALSE))","v":{"$error":"#REF!"}},{"$error":"#REF!"},{"$f":"IF(#REF!=\"Tabela Não Desonerada\",VLOOKUP($C203,#REF!,15,FALSE),VLOOKUP($C203,#REF!,15,FALSE))","v":{"$error":"#REF!"}},{"$error":"#REF!"}]
[1,{"$f":"'Orçamento-TCE'!B204","v":193},{"$f":"'Orçamento-TCE'!C204","v":"11.73"},{"$f":"'Orçamento-TCE'!G204","v":"PUXADOR PARA PCD, FIXADO NA PORTA - FORNECIMENTO E INSTALAÇÃO. AF_01/2020"},{"$f":"'Orçamento-TCE'!H204","v":7},{"$f":"'Orçamento-TCE'!I204","v":"UN"},{"$f":"Orçamento!H212","v":437.08},{"$f":"Orçamento!I212","v":3059.56},{"$f":"Orçamento!G212","v":0.22159999999999999},1.1122000000000001,null,305.95599999999996,131.12400000000002,{"$error":"#REF!"},{"$f":"IF(#REF!=\"Tabela Não Desonerada\",VLOOKUP($C204,#REF!,13,FALSE),VLOOKUP($C204,#REF!,13,FALSE))","v":{"$error":"#REF!"}},{"$error":"#REF!"},{"$f":"IF(#REF!=\"Tabela Não Desonerada\",VLOOKUP($C204,#REF!,14,FALSE),VLOOKUP($C204,#REF!,14,FALSE))","v":{"$error":"#REF!"}},{"$error":"#REF!"},{"$f":"IF(#REF!=\"Tabela Não Desonerada\",VLOOKUP($C204,#REF!,15,FALSE),VLOOKUP($C204,#REF!,15,FALSE))","v":{"$error":"#REF!"}},{"$error":"#REF!"}]
[1,{"$f":"'Orçamento-TCE'!B205","v":194},{"$f":"'Orçamento-TCE'!C205","v":"11.74"},{"$f":"'Orçamento-TCE'!G205","v":"BARRA DE APOIO RETA, EM AÇO INOX POLIDO, COMPRIMENTO 40CM, FIXADO NA PAREDE - FORNECIMENTO E INSTALAÇÃO. AF_01/2020"},{"$f":"'Orçamento-TCE'!H205","v":14},{"$f":"'Orçamento-TCE'!I205","v":"UN"},{"$f":"Orçamento!H213","v":354.92},{"$f":"Orçamento!I213","v":4968.88},{"$f":"Orçamento!G213","v":0.22159999999999999},1.1122000000000001,null,{"$f":"G205*0.7","v":248.44399999999999},{"$f":"G205-L205","v":106.47600000000003},{"$f":"P205","v":{"$error":"#REF!"}},{"$f":"IF(#REF!=\"Tabela Não Desonerada\",VLOOKUP($C205,#REF!,13,FALSE),VLOOKUP($C205,#REF!,13,FALSE))","v":{"$error":"#REF!"}},{"$f":"O205/E205","v":{"$error":"#REF!"}},{"$f":"IF(#REF!=\"Tabela Não Desonerada\",VLOOKUP($C205,#REF!,14,FALSE),VLOOKUP($C205,#REF!,14,FALSE))","v":{"$error":"#REF!"}},{"$f":"Q205/E205","v":{"$error":"#REF!"}},{"$f":"IF(#REF!=\"Tabela Não Desonerada\",VLOOKUP($C205,#REF!,15,FALSE),VLOOKUP($C205,#REF!,15,FALSE))","v":{"$error":"#REF!"}},{"$f":"S205/E205","v":{"$error":"#REF!"}}]
[1,{"$f":"'Orçamento-TCE'!B206","v":195},{"$f":"'Orçamento-TCE'!C206","v":"11.75"},{"$f":"'Orçamento-TCE'!G206","v":"BARRA DE APOIO RETA, EM AÇO INOX POLIDO, COMPRIMENTO 70CM, FIXADO NA PAREDE - FORNECIMENTO E INSTALAÇÃO. AF_01/2020"},{"$f":"'Orçamento-TCE'!H206","v":75},{"$f":"'Orçamento-TCE'!I206","v":"UN"},{"$f":"Orçamento!H214","v":467.75},{"$f":"Orçamento!I214","v":35081.25},{"$f":"Orçamento!G214","v":0.22159999999999999},1.1122000000000001,null,327.42499999999995,140.32500000000005,{"$error":"#REF!"},{"$f":"IF(#REF!=\"Tabela Não Desonerada\",VLOOKUP($C206,#REF!,13,FALSE),VLOOKUP($C206,#REF!,13,FALSE))","v":{"$error":"#REF!"}},{"$error":"#REF!"},{"$f":"IF(#REF!=\"Tabela Não Desonerada\",VLOOKUP($C206,#REF!,14,FALSE),VLOOKUP($C206,#REF!,14,FALSE))","v":{"$error":"#REF!"}},{"$error":"#REF!"},{"$f":"IF(#REF!=\"Tabela Não Desonerada\",VLOOKUP($C206,#REF!,15,FALSE),VLOOKUP($C206,#REF!,15,FALSE))","v":{"$error":"#REF!"}},{"$error":"#REF!"}]
[1,{"$f":"'Orçamento-TCE'!B207","v":196},{"$f":"'Orçamento-TCE'!C207","v":"11.76"},{"$f":"'Orçamento-TCE'!G207","v":"BARRA DE APOIO RETA, EM AÇO INOX POLIDO, COMPRIMENTO 80CM, FIXADA NA PAREDE - FORNECIMENTO E INSTALAÇÃO. AF_01/2020"},{"$f":"'Orçamento-TCE'!H207","v":14},{"$f":"'Orçamento-TCE'!I207","v":"UN"},{"$f":"Orçamento!H215","v":488.15},{"$f":"Orçamento!I215","v":6834.1},{"$f":"Orçamento!G215","v":0.22159999999999999},1.1122000000000001,null,341.70499999999998,146.44499999999999,{"$error":"#REF!"},{"$f":"IF(#REF!=\"Tabela Não Desonerada\",VLOOKUP($C207,#REF!,13,FALSE),VLOOKUP($C207,#REF!,13,FALSE))","v":{"$error":"#REF!"}},{"$error":"#REF!"},{"$f":"IF(#REF!=\"Tabela Não Desonerada\",VLOOKUP($C207,#REF!,14,FALSE),VLOOKUP($C207,#REF!,14,FALSE))","v":{"$error":"#REF!"}},{"$error":"#REF!"},{"$f":"IF(#REF!=\"Tabela Não Desonerada\",VLOOKUP($C207,#REF!,15,FALSE),VLOOKUP($C207,#REF!,15,FALSE))","v":{"$error":"#REF!"}},{"$error":"#REF!"}]
[1,{"$f":"'Orçamento-TCE'!B208","v":197},{"$f":"'Orçamento-TCE'!C208","v":"12.1"},{"$f":"'Orçamento-TCE'!G208","v":"TUBO DE AÇO PRETO SEM COSTURA, CONEXÃO SOLDADA, DN 40 (1 1/2\"), INSTALADO EM REDE DE ALIMENTAÇÃO PARA SPRINKLER - FORNECIMENTO E INSTALAÇÃO. AF_10/2020"},{"$f":"'Orçamento-TCE'!H208","v":3},{"$f":"'Orçamento-TCE'!I208","v":"M"},{"$f":"Orçamento!H217","v":96.45},{"$f":"Orçamento!I217","v":289.35000000000002},{"$f":"Orçamento!G217","v":0.22159999999999999},1.1122000000000001,null,67.515000000000001,28.935000000000002,{"$error":"#REF!"},{"$f":"IF(#REF!=\"Tabela Não Desonerada\",VLOOKUP($C208,#REF!,13,FALSE),VLOOKUP($C208,#REF!,13,FALSE))","v":{"$error":"#REF!"}},{"$error":"#REF!"},{"$f":"IF(#REF!=\"Tabela Não Desonerada\",VLOOKUP($C208,#REF!,14,FALSE),VLOOKUP($C208,#REF!,14,FALSE))","v":{"$error":"#REF!"}},{"$error":"#REF!"},{"$f":"IF(#REF!=\"Tabela Não Desonerada\",VLOOKUP($C208,#REF!,15,FALSE),VLOOKUP($C208,#REF!,15,FALSE))","v":{"$error":"#REF!"}},{"$error":"#REF!"}]
[1,{"$f":"'Orçamento-TCE'!B209","v":198},{"$f":"'Orçamento-TCE'!C209","v":"12.2"},{"$f":"'Orçamento-TCE'!G209","v":"TUBO DE AÇO PRETO SEM COSTURA, CONEXÃO SOLDADA, DN 65 (2 1/2\"), INSTALADO EM PRUMADAS - FORNECIMENTO E INSTALAÇÃO. AF_10/2020"},{"$f":"'Orçamento-TCE'!H209","v":135},{"$f":"'Orçamento-TCE'!I209","v":"M"},{"$f":"Orçamento!H218","v":204.89},{"$f":"Orçamento!I218","v":27660.15},{"$f":"Orçamento!G218","v":0.22159999999999999},1.1122000000000001,null,143.42299999999997,61.467000000000013,{"$error":"#REF!"},{"$f":"IF(#REF!=\"Tabela Não Desonerada\",VLOOKUP($C209,#REF!,13,FALSE),VLOOKUP($C209,#REF!,13,FALSE))","v":{"$error":"#REF!"}},{"$error":"#REF!"},{"$f":"IF(#REF!=\"Tabela Não Desonerada\",VLOOKUP($C209,#REF!,14,FALSE),VLOOKUP($C209,#REF!,14,FALSE))","v":{"$error":"#REF!"}},{"$error":"#REF!"},{"$f":"IF(#REF!=\"Tabela Não Desonerada\",VLOOKUP($C209,#REF!,15,FALSE),VLOOKUP($C209,#REF!,15,FALSE))","v":{"$error":"#REF!"}},{"$error":"#REF!"}]
[1,{"$f":"'Orçamento-TCE'!B210","v":199},{"$f":"'Orçamento-TCE'!C210","v":"12.3"},{"$f":"'Orçamento-TCE'!G210","v":"CURVA 45 GRAUS, EM AÇO, CONEXÃO SOLDADA DN 40 (1 1/2\"), INSTALADO EM REDE DE ALIMENTAÇÃO DE HIDRANTE - FORNECIMENTO E INSTALAÇÃO. AF_10/2020"},{"$f":"'Orçamento-TCE'!H210","v":3},{"$f":"'Orçamento-TCE'!I210","v":"UN"},{"$f":"Orçamento!H219","v":228.15},{"$f":"Orçamento!I219","v":684.45},{"$f":"Orçamento!G219","v":0.22159999999999999},1.1122000000000001,null,159.70499999999998,68.445000000000022,{"$error":"#REF!"},{"$f":"IF(#REF!=\"Tabela Não Desonerada\",VLOOKUP($C210,#REF!,13,FALSE),VLOOKUP($C210,#REF!,13,FALSE))","v":{"$error":"#REF!"}},{"$error":"#REF!"},{"$f":"IF(#REF!=\"Tabela Não Desonerada\",VLOOKUP($C210,#REF!,14,FALSE),VLOOKUP($C210,#REF!,14,FALSE))","v":{"$error":"#REF!"}},{"$error":"#REF!"},{"$f":"IF(#REF!=\"Tabela Não Desonerada\",VLOOKUP($C210,#REF!,15,FALSE),VLOOKUP($C210,#REF!,15,FALSE))","v":{"$error":"#REF!"}},{"$error":"#REF!"}]
[1,{"$f":"'Orçamento-TCE'!B211","v":200},{"$f":"'Orçamento-TCE'!C211","v":"12.4"},{"$f":"'Orçamento-TCE'!G211","v":"CURVA 45 GRAUS, EM AÇO, CONEXÃO RANHURADA, DN 65 (2 1/2\"), INSTALADO EM PRUMADAS - FORNECIMENTO E INSTALAÇÃO. AF_10/2020"},{"$f":"'Orçamento-TCE'!H211","v":6},{"$f":"'Orçamento-TCE'!I211","v":"UN"},{"$f":"Orçamento!H220","v":159.66},{"$f":"Orçamento!I220","v":957.96},{"$f":"Orçamento!G220","v":0.22159999999999999},1.1122000000000001,null,111.76199999999999,47.89800000000001,{"$error":"#REF!"},{"$f":"IF(#REF!=\"Tabela Não Desonerada\",VLOOKUP($C211,#REF!,13,FALSE),VLOOKUP($C211,#REF!,13,FALSE))","v":{"$error":"#REF!"}},{"$error":"#REF!"},{"$f":"IF(#REF!=\"Tabela Não Desonerada\",VLOOKUP($C211,#REF!,14,FALSE),VLOOKUP($C211,#REF!,14,FALSE))","v":{"$error":"#REF!"}},{"$error":"#REF!"},{"$f":"IF(#REF!=\"Tabela Não Desonerada\",VLOOKUP($C211,#REF!,15,FALSE),VLOOKUP($C211,#REF!,15,FALSE))","v":{"$error":"#REF!"}},{"$error":"#REF!"}]
[1,{"$f":"'Orçamento-TCE'!B212","v":201},{"$f":"'Orçamento-TCE'!C212","v":"12.5"},{"$f":"'Orçamento-TCE'!G212","v":"CURVA 90 GRAUS, EM AÇO, CONEXÃO RANHURADA, DN 65 (2 1/2\"), INSTALADO EM PRUMADAS - FORNECIMENTO E INSTALAÇÃO. AF_10/2020"},{"$f":"'Orçamento-TCE'!H212","v":9},{"$f":"'Orçamento-TCE'!I212","v":"UN"},{"$f":"Orçamento!H221","v":165.21},{"$f":"Orçamento!I221","v":1486.89},{"$f":"Orçamento!G221","v":0.22159999999999999},1.1122000000000001,null,115.64699999999999,49.563000000000017,{"$error":"#REF!"},{"$f":"IF(#REF!=\"Tabela Não Desonerada\",VLOOKUP($C212,#REF!,13,FALSE),VLOOKUP($C212,#REF!,13,FALSE))","v":{"$error":"#REF!"}},{"$error":"#REF!"},{"$f":"IF(#REF!=\"Tabela Não Desonerada\",VLOOKUP($C212,#REF!,14,FALSE),VLOOKUP($C212,#REF!,14,FALSE))","v":{"$error":"#REF!"}},{"$error":"#REF!"},{"$f":"IF(#REF!=\"Tabela Não Desonerada\",VLOOKUP($C212,#REF!,15,FALSE),VLOOKUP($C212,#REF!,15,FALSE))","v":{"$error":"#REF!"}},{"$error":"#REF!"}]
[1,{"$f":"'Orçamento-TCE'!B213","v":202},{"$f":"'Orçamento-TCE'!C213","v":"12.6"},{"$f":"'Orçamento-TCE'!G213","v":"TÊ EM AÇO, CONEXÃO RANHURADA, DN 65 (2 1/2\"), I NSTALADO EM PRUMADAS - FORNECIMENTO E INSTALAÇÃO. AF_10/2020"},{"$f":"'Orçamento-TCE'!H213","v":3},{"$f":"'Orçamento-TCE'!I213","v":"UN"},{"$f":"Orçamento!H222","v":251.99},{"$f":"Orçamento!I222","v":755.97},{"$f":"Orçamento!G222","v":0.22159999999999999},1.1122000000000001,null,176.393,75.597000000000008,{"$error":"#REF!"},{"$f":"IF(#REF!=\"Tabela Não Desonerada\",VLOOKUP($C213,#REF!,13,FALSE),VLOOKUP($C213,#REF!,13,FALSE))","v":{"$error":"#REF!"}},{"$error":"#REF!"},{"$f":"IF(#REF!=\"Tabela Não Desonerada\",VLOOKUP($C213,#REF!,14,FALSE),VLOOKUP($C213,#REF!,14,FALSE))","v":{"$error":"#REF!"}},{"$error":"#REF!"},{"$f":"IF(#REF!=\"Tabela Não Desonerada\",VLOOKUP($C213,#REF!,15,FALSE),VLOOKUP($C213,#REF!,15,FALSE))","v":{"$error":"#REF!"}},{"$error":"#REF!"}]
[1,{"$f":"'Orçamento-TCE'!B214","v":203},{"$f":"'Orçamento-TCE'!C214","v":"12.7"},{"$f":"'Orçamento-TCE'!G214","v":"LUVA COM REDUÇÃO, EM AÇO, CONEXÃO SOLDADA, DN 65X50MM (2 1/2\"X2\"), INSTALADO EM REDE DE ALIMENTAÇÃO PARA HIDRANTE - FORNECIMENTO E INSTALAÇÃO.AF_10/2020"},{"$f":"'Orçamento-TCE'!H214","v":3},{"$f":"'Orçamento-TCE'!I214","v":"UN"},{"$f":"Orçamento!H223","v":451.19},{"$f":"Orçamento!I223","v":1353.57},{"$f":"Orçamento!G223","v":0.22159999999999999},1.1122000000000001,null,315.83299999999997,135.35700000000003,{"$error":"#REF!"},{"$f":"IF(#REF!=\"Tabela Não Desonerada\",VLOOKUP($C214,#REF!,13,FALSE),VLOOKUP($C214,#REF!,13,FALSE))","v":{"$error":"#REF!"}},{"$error":"#REF!"},{"$f":"IF(#REF!=\"Tabela Não Desonerada\",VLOOKUP($C214,#REF!,14,FALSE),VLOOKUP($C214,#REF!,14,FALSE))","v":{"$error":"#REF!"}},{"$error":"#REF!"},{"$f":"IF(#REF!=\"Tabela Não Desonerada\",VLOOKUP($C214,#REF!,15,FALSE),VLOOKUP($C214,#REF!,15,FALSE))","v":{"$error":"#REF!"}},{"$error":"#REF!"}]
[1,{"$f":"'Orçamento-TCE'!B215","v":204},{"$f":"'Orçamento-TCE'!C215","v":"12.8"},{"$f":"'Orçamento-TCE'!G215","v":"VÁLVULA DE ESFERA BRUTA, BRONZE, ROSCÁVEL, 1 1/2\", INSTALADO EM RESERVAÇÃO DE ÁGUA DE EDIFICAÇÃO QUE POSSUA RESERVATÓRIO DE FIBRA/FIBROCIMENTO - FORNECIMENTO E INSTALAÇÃO. AF_06/2016"},{"$f":"'Orçamento-TCE'!H215","v":3},{"$f":"'Orçamento-TCE'!I215","v":"UN"},{"$f":"Orçamento!H224","v":215.78},{"$f":"Orçamento!I224","v":647.34},{"$f":"Orçamento!G224","v":0.22159999999999999},1.1122000000000001,null,151.04599999999999,64.734000000000009,{"$error":"#REF!"},{"$f":"IF(#REF!=\"Tabela Não Desonerada\",VLOOKUP($C215,#REF!,13,FALSE),VLOOKUP($C215,#REF!,13,FALSE))","v":{"$error":"#REF!"}},{"$error":"#REF!"},{"$f":"IF(#REF!=\"Tabela Não Desonerada\",VLOOKUP($C215,#REF!,14,FALSE),VLOOKUP($C215,#REF!,14,FALSE))","v":{"$error":"#REF!"}},{"$error":"#REF!"},{"$f":"IF(#REF!=\"Tabela Não Desonerada\",VLOOKUP($C215,#REF!,15,FALSE),VLOOKUP($C215,#REF!,15,FALSE))","v":{"$error":"#REF!"}},{"$error":"#REF!"}]
[1,{"$f":"'Orçamento-TCE'!B216","v":205},{"$f":"'Orçamento-TCE'!C216","v":"12.9"},{"$f":"'Orçamento-TCE'!G216","v":"REGISTRO DE GAVETA BRUTO, LATÃO, ROSCÁVEL, 2 1/2\", INSTALADO EM RESERVAÇÃO DE ÁGUA DE EDIFICAÇÃO QUE POSSUA RESERVATÓRIO DE FIBRA/FIBROCIMENTO - FORNECIMENTO E INSTALAÇÃO. AF_06/2016"},{"$f":"'Orçamento-TCE'!H216","v":3},{"$f":"'Orçamento-TCE'!I216","v":"UN"},{"$f":"Orçamento!H225","v":422.38},{"$f":"Orçamento!I225","v":1267.1400000000001},{"$f":"Orçamento!G225","v":0.22159999999999999},1.1122000000000001,null,295.666,126.714,{"$error":"#REF!"},{"$f":"IF(#REF!=\"Tabela Não Desonerada\",VLOOKUP($C216,#REF!,13,FALSE),VLOOKUP($C216,#REF!,13,FALSE))","v":{"$error":"#REF!"}},{"$error":"#REF!"},{"$f":"IF(#REF!=\"Tabela Não Desonerada\",VLOOKUP($C216,#REF!,14,FALSE),VLOOKUP($C216,#REF!,14,FALSE))","v":{"$error":"#REF!"}},{"$error":"#REF!"},{"$f":"IF(#REF!=\"Tabela Não Desonerada\",VLOOKUP($C216,#REF!,15,FALSE),VLOOKUP($C216,#REF!,15,FALSE))","v":{"$error":"#REF!"}},{"$error":"#REF!"}]
[1,{"$f":"'Orçamento-TCE'!B217","v":206},{"$f":"'Orçamento-TCE'!C217","v":"12.10"},{"$f":"'Orçamento-TCE'!G217","v":"ADAPTADOR ROSCA 25MM"},{"$f":"'Orçamento-TCE'!H217","v":3},{"$f":"'Orçamento-TCE'!I217","v":"UN"},{"$f":"Orçamento!H226","v":8.32},{"$f":"Orçamento!I226","v":24.96},{"$f":"Orçamento!G226","v":0.22159999999999999},1.1122000000000001,null,5.8239999999999998,2.4960000000000004,{"$error":"#REF!"},{"$f":"IF(#REF!=\"Tabela Não Desonerada\",VLOOKUP($C217,#REF!,13,FALSE),VLOOKUP($C217,#REF!,13,FALSE))","v":{"$error":"#REF!"}},{"$error":"#REF!"},{"$f":"IF(#REF!=\"Tabela Não Desonerada\",VLOOKUP($C217,#REF!,14,FALSE),VLOOKUP($C217,#REF!,14,FALSE))","v":{"$error":"#REF!"}},{"$error":"#REF!"},{"$f":"IF(#REF!=\"Tabela Não Desonerada\",VLOOKUP($C217,#REF!,15,FALSE),VLOOKUP($C217,#REF!,15,FALSE))","v":{"$error":"#REF!"}},{"$error":"#REF!"}]
[1,{"$f":"'Orçamento-TCE'!B218","v":207},{"$f":"'Orçamento-TCE'!C218","v":"12.11"},{"$f":"'Orçamento-TCE'!G218","v":"MANGOTINHO 25MM EM CARRETEL COM 30M"},{"$f":"'Orçamento-TCE'!H218","v":3},{"$f":"'Orçamento-TCE'!I218","v":"UN"},{"$f":"Orçamento!H227","v":3682.12},{"$f":"Orçamento!I227","v":11046.36},{"$f":"Orçamento!G227","v":0.22159999999999999},1.1122000000000001,null,2577.4839999999999,1104.636,{"$error":"#REF!"},{"$f":"IF(#REF!=\"Tabela Não Desonerada\",VLOOKUP($C218,#REF!,13,FALSE),VLOOKUP($C218,#REF!,13,FALSE))","v":{"$error":"#REF!"}},{"$error":"#REF!"},{"$f":"IF(#REF!=\"Tabela Não Desonerada\",VLOOKUP($C218,#REF!,14,FALSE),VLOOKUP($C218,#REF!,14,FALSE))","v":{"$error":"#REF!"}},{"$error":"#REF!"},{"$f":"IF(#REF!=\"Tabela Não Desonerada\",VLOOKUP($C218,#REF!,15,FALSE),VLOOKUP($C218,#REF!,15,FALSE))","v":{"$error":"#REF!"}},{"$error":"#REF!"}]
[1,{"$f":"'Orçamento-TCE'!B219","v":208},{"$f":"'Orçamento-TCE'!C219","v":"12.12"},{"$f":"'Orçamento-TCE'!G219","v":"ESGUICHO NEBLINA 25MM"},{"$f":"'Orçamento-TCE'!H219","v":3},{"$f":"'Orçamento-TCE'!I219","v":"UN"},{"$f":"Orçamento!H228","v":413.03},{"$f":"Orçamento!I228","v":1239.0899999999999},{"$f":"Orçamento!G228","v":0.22159999999999999},1.1122000000000001,null,289.12099999999998,123.90899999999999,{"$error":"#REF!"},{"$f":"IF(#REF!=\"Tabela Não Desonerada\",VLOOKUP($C219,#REF!,13,FALSE),VLOOKUP($C219,#REF!,13,FALSE))","v":{"$error":"#REF!"}},{"$error":"#REF!"},{"$f":"IF(#REF!=\"Tabela Não Desonerada\",VLOOKUP($C219,#REF!,14,FALSE),VLOOKUP($C219,#REF!,14,FALSE))","v":{"$error":"#REF!"}},{"$error":"#REF!"},{"$f":"IF(#REF!=\"Tabela Não Desonerada\",VLOOKUP($C219,#REF!,15,FALSE),VLOOKUP($C219,#REF!,15,FALSE))","v":{"$error":"#REF!"}},{"$error":"#REF!"}]
[1,{"$f":"'Orçamento-TCE'!B220","v":209},{"$f":"'Orçamento-TCE'!C220","v":"12.13"},{"$f":"'Orçamento-TCE'!G220","v":"TOMADA STORZ 40MM"},{"$f":"'Orçamento-TCE'!H220","v":3},{"$f":"'Orçamento-TCE'!I220","v":"UN"},{"$f":"Orçamento!H229","v":274.75},{"$f":"Orçamento!I229","v":824.25},{"$f":"Orçamento!G229","v":0.22159999999999999},1.1122000000000001,null,192.32499999999999,82.425000000000011,{"$error":"#REF!"},{"$f":"IF(#REF!=\"Tabela Não Desonerada\",VLOOKUP($C220,#REF!,13,FALSE),VLOOKUP($C220,#REF!,13,FALSE))","v":{"$error":"#REF!"}},{"$error":"#REF!"},{"$f":"IF(#REF!=\"Tabela Não Desonerada\",VLOOKUP($C220,#REF!,14,FALSE),VLOOKUP($C220,#REF!,14,FALSE))","v":{"$error":"#REF!"}},{"$error":"#REF!"},{"$f":"IF(#REF!=\"Tabela Não Desonerada\",VLOOKUP($C220,#REF!,15,FALSE),VLOOKUP($C220,#REF!,15,FALSE))","v":{"$error":"#REF!"}},{"$error":"#REF!"}]
[1,{"$f":"'Orçamento-TCE'!B221","v":210},{"$f":"'Orçamento-TCE'!C221","v":"12.14"},{"$f":"'Orçamento-TCE'!G221","v":"CHAVE DE UNIÕES"},{"$f":"'Orçamento-TCE'!H221","v":3},{"$f":"'Orçamento-TCE'!I221","v":"UN"},{"$f":"Orçamento!H230","v":31.06},{"$f":"Orçamento!I230","v":93.18},{"$f":"Orçamento!G230","v":0.22159999999999999},1.1122000000000001,null,21.741999999999997,9.3180000000000014,{"$error":"#REF!"},{"$f":"IF(#REF!=\"Tabela Não Desonerada\",VLOOKUP($C221,#REF!,13,FALSE),VLOOKUP($C221,#REF!,13,FALSE))","v":{"$error":"#REF!"}},{"$error":"#REF!"},{"$f":"IF(#REF!=\"Tabela Não Desonerada\",VLOOKUP($C221,#REF!,14,FALSE),VLOOKUP($C221,#REF!,14,FALSE))","v":{"$error":"#REF!"}},{"$error":"#REF!"},{"$f":"IF(#REF!=\"Tabela Não Desonerada\",VLOOKUP($C221,#REF!,15,FALSE),VLOOKUP($C221,#REF!,15,FALSE))","v":{"$error":"#REF!"}},{"$error":"#REF!"}]
[1,{"$f":"'Orçamento-TCE'!B222","v":211},{"$f":"'Orçamento-TCE'!C222","v":"12.15"},{"$f":"'Orçamento-TCE'!G222","v":"CAIXA PARA CARRETEL DE MANGOTINHO DE 50M"},{"$f":"'Orçamento-TCE'!H222","v":3},{"$f":"'Orçamento-TCE'!I222","v":"UN"},{"$f":"Orçamento!H231","v":615.26},{"$f":"Orçamento!I231","v":1845.78},{"$f":"Orçamento!G231","v":0.22159999999999999},1.1122000000000001,null,430.68199999999996,184.57800000000003,{"$error":"#REF!"},{"$f":"IF(#REF!=\"Tabela Não Desonerada\",VLOOKUP($C222,#REF!,13,FALSE),VLOOKUP($C222,#REF!,13,FALSE))","v":{"$error":"#REF!"}},{"$error":"#REF!"},{"$f":"IF(#REF!=\"Tabela Não Desonerada\",VLOOKUP($C222,#REF!,14,FALSE),VLOOKUP($C222,#REF!,14,FALSE))","v":{"$error":"#REF!"}},{"$error":"#REF!"},{"$f":"IF(#REF!=\"Tabela Não Desonerada\",VLOOKUP($C222,#REF!,15,FALSE),VLOOKUP($C222,#REF!,15,FALSE))","v":{"$error":"#REF!"}},{"$error":"#REF!"}]
[1,{"$f":"'Orçamento-TCE'!B223","v":212},{"$f":"'Orçamento-TCE'!C223","v":"12.16"},{"$f":"'Orçamento-TCE'!G223","v":"ABRIGO PARA HIDRANTE, 90X60X17CM, COM REGISTRO GLOBO ANGULAR 45 GRAUS 2 1/2\", ADAPTADOR STORZ DE 2 1/2\", MANGUEIRA DE INCÊNDIO 20M, REDUÇÃO 2 1/2\" X 1 1/2\" E ESGUICHO EM LATÃO 1 1/2\" - FORNECIMENTO E INSTALAÇÃO. AF_10/2020"},{"$f":"'Orçamento-TCE'!H223","v":3},{"$f":"'Orçamento-TCE'!I223","v":"UN"},{"$f":"Orçamento!H232","v":1850.77},{"$f":"Orçamento!I232","v":5552.31},{"$f":"Orçamento!G232","v":0.22159999999999999},1.1122000000000001,null,1295.539,555.23099999999999,{"$error":"#REF!"},{"$f":"IF(#REF!=\"Tabela Não Desonerada\",VLOOKUP($C223,#REF!,13,FALSE),VLOOKUP($C223,#REF!,13,FALSE))","v":{"$error":"#REF!"}},{"$error":"#REF!"},{"$f":"IF(#REF!=\"Tabela Não Desonerada\",VLOOKUP($C223,#REF!,14,FALSE),VLOOKUP($C223,#REF!,14,FALSE))","v":{"$error":"#REF!"}},{"$error":"#REF!"},{"$f":"IF(#REF!=\"Tabela Não Desonerada\",VLOOKUP($C223,#REF!,15,FALSE),VLOOKUP($C223,#REF!,15,FALSE))","v":{"$error":"#REF!"}},{"$error":"#REF!"}]
[1,{"$f":"'Orçamento-TCE'!B224","v":213},{"$f":"'Orçamento-TCE'!C224","v":"12.17"},{"$f":"'Orçamento-TCE'!G224","v":"EXTINTOR DE INCÊNDIO PORTÁTIL COM CARGA DE ÁGUA PRESSURIZADA DE 10 L, CLASSE A - FORNECIMENTO E INSTALAÇÃO. AF_10/2020_P"},{"$f":"'Orçamento-TCE'!H224","v":3},{"$f":"'Orçamento-TCE'!I224","v":"UN"},{"$f":"Orçamento!H233","v":291.82},{"$f":"Orçamento!I233","v":875.46},{"$f":"Orçamento!G233","v":0.22159999999999999},1.1122000000000001,null,204.27399999999997,87.546000000000021,{"$error":"#REF!"},{"$f":"IF(#REF!=\"Tabela Não Desonerada\",VLOOKUP($C224,#REF!,13,FALSE),VLOOKUP($C224,#REF!,13,FALSE))","v":{"$error":"#REF!"}},{"$error":"#REF!"},{"$f":"IF(#REF!=\"Tabela Não Desonerada\",VLOOKUP($C224,#REF!,14,FALSE),VLOOKUP($C224,#REF!,14,FALSE))","v":{"$error":"#REF!"}},{"$error":"#REF!"},{"$f":"IF(#REF!=\"Tabela Não Desonerada\",VLOOKUP($C224,#REF!,15,FALSE),VLOOKUP($C224,#REF!,15,FALSE))","v":{"$error":"#REF!"}},{"$error":"#REF!"}]
[1,{"$f":"'Orçamento-TCE'!B225","v":214},{"$f":"'Orçamento-TCE'!C225","v":"12.18"},{"$f":"'Orçamento-TCE'!G225","v":"PLACA DE SINALIZAÇÃO DE SEGURANÇA CONTRA INCÊNDIO, FOTOLUMINISCENTE, QUADRADA, 20X20CM EM PVC 2MM, ANTI-CHAMAS (SÍMBOLOS, CORES E PICTOGRAMAS CONFORME NBR 13434)"},{"$f":"'Orçamento-TCE'!H225","v":68},{"$f":"'Orçamento-TCE'!I225","v":"UN"},{"$f":"Orçamento!H234","v":28.23},{"$f":"Orçamento!I234","v":1919.64},{"$f":"Orçamento!G234","v":0.22159999999999999},1.1122000000000001,null,19.760999999999999,8.4690000000000012,{"$error":"#REF!"},{"$f":"IF(#REF!=\"Tabela Não Desonerada\",VLOOKUP($C225,#REF!,13,FALSE),VLOOKUP($C225,#REF!,13,FALSE))","v":{"$error":"#REF!"}},{"$error":"#REF!"},{"$f":"IF(#REF!=\"Tabela Não Desonerada\",VLOOKUP($C225,#REF!,14,FALSE),VLOOKUP($C225,#REF!,14,FALSE))","v":{"$error":"#REF!"}},{"$error":"#REF!"},{"$f":"IF(#REF!=\"Tabela Não Desonerada\",VLOOKUP($C225,#REF!,15,FALSE),VLOOKUP($C225,#REF!,15,FALSE))","v":{"$error":"#REF!"}},{"$error":"#REF!"}]
[1,{"$f":"'Orçamento-TCE'!B226","v":215},{"$f":"'Orçamento-TCE'!C226","v":"12.19"},{"$f":"'Orçamento-TCE'!G226","v":"EXTINTOR DE INCÊNDIO PORTÁTIL COM CARGA DE PQS DE 4 KG, CLASSE BC - FORNECIMENTO E INSTALAÇÃO. AF_10/2020_P"},{"$f":"'Orçamento-TCE'!H226","v":12},{"$f":"'Orçamento-TCE'!I226","v":"UN"},{"$f":"Orçamento!H235","v":282.97000000000003},{"$f":"Orçamento!I235","v":3395.64},{"$f":"Orçamento!G235","v":0.22159999999999999},1.1122000000000001,null,198.07900000000001,84.89100000000002,{"$error":"#REF!"},{"$f":"IF(#REF!=\"Tabela Não Desonerada\",VLOOKUP($C226,#REF!,13,FALSE),VLOOKUP($C226,#REF!,13,FALSE))","v":{"$error":"#REF!"}},{"$error":"#REF!"},{"$f":"IF(#REF!=\"Tabela Não Desonerada\",VLOOKUP($C226,#REF!,14,FALSE),VLOOKUP($C226,#REF!,14,FALSE))","v":{"$error":"#REF!"}},{"$error":"#REF!"},{"$f":"IF(#REF!=\"Tabela Não Desonerada\",VLOOKUP($C226,#REF!,15,FALSE),VLOOKUP($C226,#REF!,15,FALSE))","v":{"$error":"#REF!"}},{"$error":"#REF!"}]
[1,{"$f":"'Orçamento-TCE'!B227","v":216},{"$f":"'Orçamento-TCE'!C227","v":"12.20"},{"$f":"'Orçamento-TCE'!G227","v":"SUPORTE PARA FIXAÇÃO DE EXTINTOR EM PAREDE, COM BUCHA E PARAFUSO"},{"$f":"'Orçamento-TCE'!H227","v":10},{"$f":"'Orçamento-TCE'!I227","v":"UN"},{"$f":"Orçamento!H236","v":22.57},{"$f":"Orçamento!I236","v":225.7},{"$f":"Orçamento!G236","v":0.22159999999999999},1.1122000000000001,null,15.798999999999999,6.7710000000000008,{"$error":"#REF!"},{"$f":"IF(#REF!=\"Tabela Não Desonerada\",VLOOKUP($C227,#REF!,13,FALSE),VLOOKUP($C227,#REF!,13,FALSE))","v":{"$error":"#REF!"}},{"$error":"#REF!"},{"$f":"IF(#REF!=\"Tabela Não Desonerada\",VLOOKUP($C227,#REF!,14,FALSE),VLOOKUP($C227,#REF!,14,FALSE))","v":{"$error":"#REF!"}},{"$error":"#REF!"},{"$f":"IF(#REF!=\"Tabela Não Desonerada\",VLOOKUP($C227,#REF!,15,FALSE),VLOOKUP($C227,#REF!,15,FALSE))","v":{"$error":"#REF!"}},{"$error":"#REF!"}]
[1,{"$f":"'Orçamento-TCE'!B228","v":217},{"$f":"'Orçamento-TCE'!C228","v":"12.21"},{"$f":"'Orçamento-TCE'!G228","v":"ACIONADOR MANUAL DE INCÊNDIO"},{"$f":"'Orçamento-TCE'!H228","v":3},{"$f":"'Orçamento-TCE'!I228","v":"UN"},{"$f":"Orçamento!H237","v":88.04},{"$f":"Orçamento!I237","v":264.12},{"$f":"Orçamento!G237","v":0.22159999999999999},1.1122000000000001,null,61.628,26.412000000000006,{"$error":"#REF!"},{"$f":"IF(#REF!=\"Tabela Não Desonerada\",VLOOKUP($C228,#REF!,13,FALSE),VLOOKUP($C228,#REF!,13,FALSE))","v":{"$error":"#REF!"}},{"$error":"#REF!"},{"$f":"IF(#REF!=\"Tabela Não Desonerada\",VLOOKUP($C228,#REF!,14,FALSE),VLOOKUP($C228,#REF!,14,FALSE))","v":{"$error":"#REF!"}},{"$error":"#REF!"},{"$f":"IF(#REF!=\"Tabela Não Desonerada\",VLOOKUP($C228,#REF!,15,FALSE),VLOOKUP($C228,#REF!,15,FALSE))","v":{"$error":"#REF!"}},{"$error":"#REF!"}]
[1,{"$f":"'Orçamento-TCE'!B229","v":218},{"$f":"'Orçamento-TCE'!C229","v":"12.22"},{"$f":"'Orçamento-TCE'!G229","v":"GUARDA-CORPO DE AÇO GALVANIZADO DE 1,10M DE ALTURA, MONTANTES TUBULARES DE 1 1/2\" ESPAÇADOS DE 1,20M, TRAVESSA SUPERIOR DE 2\", GRADIL FORMADO POR BARRAS CHATAS EM FERRO DE 32X4,8MM, FIXADO COM CHUMBADOR MECÂNICO. AF_04/2019_P"},{"$f":"'Orçamento-TCE'!H229","v":105},{"$f":"'Orçamento-TCE'!I229","v":"M"},{"$f":"Orçamento!H238","v":607.91999999999996},{"$f":"Orçamento!I238","v":63831.6},{"$f":"Orçamento!G238","v":0.22159999999999999},1.1122000000000001,null,425.54399999999993,182.37600000000003,{"$error":"#REF!"},{"$f":"IF(#REF!=\"Tabela Não Desonerada\",VLOOKUP($C229,#REF!,13,FALSE),VLOOKUP($C229,#REF!,13,FALSE))","v":{"$error":"#REF!"}},{"$error":"#REF!"},{"$f":"IF(#REF!=\"Tabela Não Desonerada\",VLOOKUP($C229,#REF!,14,FALSE),VLOOKUP($C229,#REF!,14,FALSE))","v":{"$error":"#REF!"}},{"$error":"#REF!"},{"$f":"IF(#REF!=\"Tabela Não Desonerada\",VLOOKUP($C229,#REF!,15,FALSE),VLOOKUP($C229,#REF!,15,FALSE))","v":{"$error":"#REF!"}},{"$error":"#REF!"}]
[1,{"$f":"'Orçamento-TCE'!B230","v":219},{"$f":"'Orçamento-TCE'!C230","v":"12.23"},{"$f":"'Orçamento-TCE'!G230","v":"CORRIMÃO SIMPLES, DIÂMETRO EXTERNO = 1 1/2\", EM AÇO GALVANIZADO. AF_04/2019_P"},{"$f":"'Orçamento-TCE'!H230","v":40},{"$f":"'Orçamento-TCE'!I230","v":"M"},{"$f":"Orçamento!H239","v":143.12},{"$f":"Orçamento!I239","v":5724.8},{"$f":"Orçamento!G239","v":0.22159999999999999},1.1122000000000001,null,100.184,42.936000000000007,{"$error":"#REF!"},{"$f":"IF(#REF!=\"Tabela Não Desonerada\",VLOOKUP($C230,#REF!,13,FALSE),VLOOKUP($C230,#REF!,13,FALSE))","v":{"$error":"#REF!"}},{"$error":"#REF!"},{"$f":"IF(#REF!=\"Tabela Não Desonerada\",VLOOKUP($C230,#REF!,14,FALSE),VLOOKUP($C230,#REF!,14,FALSE))","v":{"$error":"#REF!"}},{"$error":"#REF!"},{"$f":"IF(#REF!=\"Tabela Não Desonerada\",VLOOKUP($C230,#REF!,15,FALSE),VLOOKUP($C230,#REF!,15,FALSE))","v":{"$error":"#REF!"}},{"$error":"#REF!"}]
[1,{"$f":"'Orçamento-TCE'!B231","v":220},{"$f":"'Orçamento-TCE'!C231","v":"12.24"},{"$f":"'Orçamento-TCE'!G231","v":"CONJUNTO DE MOTOBOMBAS PARA HIDRANTE"},{"$f":"'Orçamento-TCE'!H231","v":1},{"$f":"'Orçamento-TCE'!I231","v":"UN"},{"$f":"Orçamento!H240","v":25130.560000000001},{"$f":"Orçamento!I240","v":25130.560000000001},{"$f":"Orçamento!G240","v":0.22159999999999999},1.1122000000000001,null,17591.392,7539.1680000000015,{"$error":"#REF!"},{"$f":"IF(#REF!=\"Tabela Não Desonerada\",VLOOKUP($C231,#REF!,13,FALSE),VLOOKUP($C231,#REF!,13,FALSE))","v":{"$error":"#REF!"}},{"$error":"#REF!"},{"$f":"IF(#REF!=\"Tabela Não Desonerada\",VLOOKUP($C231,#REF!,14,FALSE),VLOOKUP($C231,#REF!,14,FALSE))","v":{"$error":"#REF!"}},{"$error":"#REF!"},{"$f":"IF(#REF!=\"Tabela Não Desonerada\",VLOOKUP($C231,#REF!,15,FALSE),VLOOKUP($C231,#REF!,15,FALSE))","v":{"$error":"#REF!"}},{"$error":"#REF!"}]
[1,{"$f":"'Orçamento-TCE'!B232","v":221},{"$f":"'Orçamento-TCE'!C232","v":"13.1"},{"$f":"'Orçamento-TCE'!G232","v":"TUBO DE AÇO PRETO SEM COSTURA, CLASSE MÉDIA, CONEXÃO SOLDADA, DN 20 (3/4\"), INSTALADO EM RAMAIS E SUB-RAMAIS DE GÁS - FORNECIMENTO E INSTALAÇÃO. AF_10/2020"},{"$f":"'Orçamento-TCE'!H232","v":150},{"$f":"'Orçamento-TCE'!I232","v":"M"},{"$f":"Orçamento!H242","v":68.209999999999994},{"$f":"Orçamento!I242","v":10231.5},{"$f":"Orçamento!G242","v":0.22159999999999999},1.1122000000000001,null,47.746999999999993,20.463000000000001,{"$error":"#REF!"},{"$f":"IF(#REF!=\"Tabela Não Desonerada\",VLOOKUP($C232,#REF!,13,FALSE),VLOOKUP($C232,#REF!,13,FALSE))","v":{"$error":"#REF!"}},{"$error":"#REF!"},{"$f":"IF(#REF!=\"Tabela Não Desonerada\",VLOOKUP($C232,#REF!,14,FALSE),VLOOKUP($C232,#REF!,14,FALSE))","v":{"$error":"#REF!"}},{"$error":"#REF!"},{"$f":"IF(#REF!=\"Tabela Não Desonerada\",VLOOKUP($C232,#REF!,15,FALSE),VLOOKUP($C232,#REF!,15,FALSE))","v":{"$error":"#REF!"}},{"$error":"#REF!"}]
[1,{"$f":"'Orçamento-TCE'!B233","v":222},{"$f":"'Orçamento-TCE'!C233","v":"13.2"},{"$f":"'Orçamento-TCE'!G233","v":"CURVA 90 GRAUS, EM AÇO, CONEXÃO SOLDADA, DN 20 (3/4\"), INSTALADO EM RAMAIS E SUB-RAMAIS DE GÁS - FORNECIMENTO E INSTALAÇÃO. AF_10/2020"},{"$f":"'Orçamento-TCE'!H233","v":26},{"$f":"'Orçamento-TCE'!I233","v":"UN"},{"$f":"Orçamento!H243","v":86.93},{"$f":"Orçamento!I243","v":2260.1799999999998},{"$f":"Orçamento!G243","v":0.22159999999999999},1.1122000000000001,null,60.850999999999999,26.079000000000008,{"$error":"#REF!"},{"$f":"IF(#REF!=\"Tabela Não Desonerada\",VLOOKUP($C233,#REF!,13,FALSE),VLOOKUP($C233,#REF!,13,FALSE))","v":{"$error":"#REF!"}},{"$error":"#REF!"},{"$f":"IF(#REF!=\"Tabela Não Desonerada\",VLOOKUP($C233,#REF!,14,FALSE),VLOOKUP($C233,#REF!,14,FALSE))","v":{"$error":"#REF!"}},{"$error":"#REF!"},{"$f":"IF(#REF!=\"Tabela Não Desonerada\",VLOOKUP($C233,#REF!,15,FALSE),VLOOKUP($C233,#REF!,15,FALSE))","v":{"$error":"#REF!"}},{"$error":"#REF!"}]
[1,{"$f":"'Orçamento-TCE'!B234","v":223},{"$f":"'Orçamento-TCE'!C234","v":"13.3"},{"$f":"'Orçamento-TCE'!G234","v":"CURVA 45 GRAUS, EM AÇO, CONEXÃO SOLDADA, DN 20 (3/4\"), INSTALADO EM RAMAIS E SUB-RAMAIS DE GÁS - FORNECIMENTO E INSTALAÇÃO. AF_10/2020"},{"$f":"'Orçamento-TCE'!H234","v":7},{"$f":"'Orçamento-TCE'!I234","v":"UN"},{"$f":"Orçamento!H244","v":86.93},{"$f":"Orçamento!I244","v":608.51},{"$f":"Orçamento!G244","v":0.22159999999999999},1.1122000000000001,null,60.850999999999999,26.079000000000008,{"$error":"#REF!"},{"$f":"IF(#REF!=\"Tabela Não Desonerada\",VLOOKUP($C234,#REF!,13,FALSE),VLOOKUP($C234,#REF!,13,FALSE))","v":{"$error":"#REF!"}},{"$error":"#REF!"},{"$f":"IF(#REF!=\"Tabela Não Desonerada\",VLOOKUP($C234,#REF!,14,FALSE),VLOOKUP($C234,#REF!,14,FALSE))","v":{"$error":"#REF!"}},{"$error":"#REF!"},{"$f":"IF(#REF!=\"Tabela Não Desonerada\",VLOOKUP($C234,#REF!,15,FALSE),VLOOKUP($C234,#REF!,15,FALSE))","v":{"$error":"#REF!"}},{"$error":"#REF!"}]
[1,{"$f":"'Orçamento-TCE'!B235","v":224},{"$f":"'Orçamento-TCE'!C235","v":"13.4"},{"$f":"'Orçamento-TCE'!G235","v":"TÊ, EM AÇO, CONEXÃO SOLDADA, DN 20 (3/4\"), INSTALADO EM RAMAIS E SUB-RAMAIS DE GÁS - FORNECIMENTO E INSTALAÇÃO. AF_10/2020"},{"$f":"'Orçamento-TCE'!H235","v":25},{"$f":"'Orçamento-TCE'!I235","v":"UN"},{"$f":"Orçamento!H245","v":125.51},{"$f":"Orçamento!I245","v":3137.75},{"$f":"Orçamento!G245","v":0.22159999999999999},1.1122000000000001,null,87.856999999999999,37.653000000000006,{"$error":"#REF!"},{"$f":"IF(#REF!=\"Tabela Não Desonerada\",VLOOKUP($C235,#REF!,13,FALSE),VLOOKUP($C235,#REF!,13,FALSE))","v":{"$error":"#REF!"}},{"$error":"#REF!"},{"$f":"IF(#REF!=\"Tabela Não Desonerada\",VLOOKUP($C235,#REF!,14,FALSE),VLOOKUP($C235,#REF!,14,FALSE))","v":{"$error":"#REF!"}},{"$error":"#REF!"},{"$f":"IF(#REF!=\"Tabela Não Desonerada\",VLOOKUP($C235,#REF!,15,FALSE),VLOOKUP($C235,#REF!,15,FALSE))","v":{"$error":"#REF!"}},{"$error":"#REF!"}]
[1,{"$f":"'Orçamento-TCE'!B236","v":225},{"$f":"'Orçamento-TCE'!C236","v":"13.5"},{"$f":"'Orçamento-TCE'!G236","v":"LUVA COM REDUÇÃO, EM AÇO, CONEXÃO SOLDADA, DN 25X20MM (1X3/4\"), INSTALADO EM REDE DE ALIMENTAÇÃO PARA HIDRANTE - FORNECIMENTO E INSTALAÇÃO. AF_10/2020"},{"$f":"'Orçamento-TCE'!H236","v":20},{"$f":"'Orçamento-TCE'!I236","v":"UN"},{"$f":"Orçamento!H246","v":52.53},{"$f":"Orçamento!I246","v":1050.5999999999999},{"$f":"Orçamento!G246","v":0.22159999999999999},1.1122000000000001,null,36.771000000000001,15.759,{"$error":"#REF!"},{"$f":"IF(#REF!=\"Tabela Não Desonerada\",VLOOKUP($C236,#REF!,13,FALSE),VLOOKUP($C236,#REF!,13,FALSE))","v":{"$error":"#REF!"}},{"$error":"#REF!"},{"$f":"IF(#REF!=\"Tabela Não Desonerada\",VLOOKUP($C236,#REF!,14,FALSE),VLOOKUP($C236,#REF!,14,FALSE))","v":{"$error":"#REF!"}},{"$error":"#REF!"},{"$f":"IF(#REF!=\"Tabela Não Desonerada\",VLOOKUP($C236,#REF!,15,FALSE),VLOOKUP($C236,#REF!,15,FALSE))","v":{"$error":"#REF!"}},{"$error":"#REF!"}]
[1,{"$f":"'Orçamento-TCE'!B237","v":226},{"$f":"'Orçamento-TCE'!C237","v":"13.6"},{"$f":"'Orçamento-TCE'!G237","v":"VÁLVULA DE ESFERA BRUTA, BRONZE, ROSCÁVEL, 3/4\", INSTALADO EM RESERVAÇÃO DE ÁGUA DE EDIFICAÇÃO QUE POSSUA RESERVATÓRIO DE FIBRA/FIBROCIMENTO - FORNECIMENTO E INSTALAÇÃO. AF_06/2016"},{"$f":"'Orçamento-TCE'!H237","v":7},{"$f":"'Orçamento-TCE'!I237","v":"UN"},{"$f":"Orçamento!H247","v":89.12},{"$f":"Orçamento!I247","v":623.84},{"$f":"Orçamento!G247","v":0.22159999999999999},1.1122000000000001,null,62.384,26.736000000000004,{"$error":"#REF!"},{"$f":"IF(#REF!=\"Tabela Não Desonerada\",VLOOKUP($C237,#REF!,13,FALSE),VLOOKUP($C237,#REF!,13,FALSE))","v":{"$error":"#REF!"}},{"$error":"#REF!"},{"$f":"IF(#REF!=\"Tabela Não Desonerada\",VLOOKUP($C237,#REF!,14,FALSE),VLOOKUP($C237,#REF!,14,FALSE))","v":{"$error":"#REF!"}},{"$error":"#REF!"},{"$f":"IF(#REF!=\"Tabela Não Desonerada\",VLOOKUP($C237,#REF!,15,FALSE),VLOOKUP($C237,#REF!,15,FALSE))","v":{"$error":"#REF!"}},{"$error":"#REF!"}]
[1,{"$f":"'Orçamento-TCE'!B238","v":227},{"$f":"'Orçamento-TCE'!C238","v":"13.7"},{"$f":"'Orçamento-TCE'!G238","v":"VÁLVULA DE ESFERA BRUTA, BRONZE, ROSCÁVEL, 1/2\", INSTALADO EM RESERVAÇÃO DE ÁGUA DE EDIFICAÇÃO QUE POSSUA RESERVATÓRIO DE FIBRA/FIBROCIMENTO - FORNECIMENTO E INSTALAÇÃO. AF_06/2016"},{"$f":"'Orçamento-TCE'!H238","v":2},{"$f":"'Orçamento-TCE'!I238","v":"UN"},{"$f":"Orçamento!H248","v":76.040000000000006},{"$f":"Orçamento!I248","v":152.08000000000001},{"$f":"Orçamento!G248","v":0.22159999999999999},1.1122000000000001,null,53.228000000000002,22.812000000000005,{"$error":"#REF!"},{"$f":"IF(#REF!=\"Tabela Não Desonerada\",VLOOKUP($C238,#REF!,13,FALSE),VLOOKUP($C238,#REF!,13,FALSE))","v":{"$error":"#REF!"}},{"$error":"#REF!"},{"$f":"IF(#REF!=\"Tabela Não Desonerada\",VLOOKUP($C238,#REF!,14,FALSE),VLOOKUP($C238,#REF!,14,FALSE))","v":{"$error":"#REF!"}},{"$error":"#REF!"},{"$f":"IF(#REF!=\"Tabela Não Desonerada\",VLOOKUP($C238,#REF!,15,FALSE),VLOOKUP($C238,#REF!,15,FALSE))","v":{"$error":"#REF!"}},{"$error":"#REF!"}]
[1,{"$f":"'Orçamento-TCE'!B239","v":228},{"$f":"'Orçamento-TCE'!C239","v":"13.8"},{"$f":"'Orçamento-TCE'!G239","v":"TUBO PVC, SÉRIE NORMAL, ESGOTO PREDIAL, DN 40MM, FORNECIDO E INSTALADO EM RAMAL DE DESCARGA OU RAMAL DE ESGOTO SANITÁRIO. AF_12/2014"},{"$f":"'Orçamento-TCE'!H239","v":138},{"$f":"'Orçamento-TCE'!I239","v":"M"},{"$f":"Orçamento!H249","v":23.63},{"$f":"Orçamento!I249","v":3260.94},{"$f":"Orçamento!G249","v":0.22159999999999999},1.1122000000000001,null,16.540999999999997,7.0890000000000022,{"$error":"#REF!"},{"$f":"IF(#REF!=\"Tabela Não Desonerada\",VLOOKUP($C239,#REF!,13,FALSE),VLOOKUP($C239,#REF!,13,FALSE))","v":{"$error":"#REF!"}},{"$error":"#REF!"},{"$f":"IF(#REF!=\"Tabela Não Desonerada\",VLOOKUP($C239,#REF!,14,FALSE),VLOOKUP($C239,#REF!,14,FALSE))","v":{"$error":"#REF!"}},{"$error":"#REF!"},{"$f":"IF(#REF!=\"Tabela Não Desonerada\",VLOOKUP($C239,#REF!,15,FALSE),VLOOKUP($C239,#REF!,15,FALSE))","v":{"$error":"#REF!"}},{"$error":"#REF!"}]
[1,{"$f":"'Orçamento-TCE'!B240","v":229},{"$f":"'Orçamento-TCE'!C240","v":"13.9"},{"$f":"'Orçamento-TCE'!G240","v":"JOELHO 90 GRAUS, PVC, SOLDÁVEL, DN 40MM, INSTALADO EM PRUMADA DE ÁGUA - FORNECIMENTO E INSTALAÇÃO. AF_12/2014"},{"$f":"'Orçamento-TCE'!H240","v":24},{"$f":"'Orçamento-TCE'!I240","v":"UN"},{"$f":"Orçamento!H250","v":17.7},{"$f":"Orçamento!I250","v":424.8},{"$f":"Orçamento!G250","v":0.22159999999999999},1.1122000000000001,null,12.389999999999999,5.3100000000000005,{"$error":"#REF!"},{"$f":"IF(#REF!=\"Tabela Não Desonerada\",VLOOKUP($C240,#REF!,13,FALSE),VLOOKUP($C240,#REF!,13,FALSE))","v":{"$error":"#REF!"}},{"$error":"#REF!"},{"$f":"IF(#REF!=\"Tabela Não Desonerada\",VLOOKUP($C240,#REF!,14,FALSE),VLOOKUP($C240,#REF!,14,FALSE))","v":{"$error":"#REF!"}},{"$error":"#REF!"},{"$f":"IF(#REF!=\"Tabela Não Desonerada\",VLOOKUP($C240,#REF!,15,FALSE),VLOOKUP($C240,#REF!,15,FALSE))","v":{"$error":"#REF!"}},{"$error":"#REF!"}]
[1,{"$f":"'Orçamento-TCE'!B241","v":230},{"$f":"'Orçamento-TCE'!C241","v":"13.10"},{"$f":"'Orçamento-TCE'!G241","v":"JOELHO 45 GRAUS, PVC, SOLDÁVEL, DN 40MM, INSTALADO EM PRUMADA DE ÁGUA - FORNECIMENTO E INSTALAÇÃO. AF_12/2014"},{"$f":"'Orçamento-TCE'!H241","v":7},{"$f":"'Orçamento-TCE'!I241","v":"UN"},{"$f":"Orçamento!H251","v":19.7},{"$f":"Orçamento!I251","v":137.9},{"$f":"Orçamento!G251","v":0.22159999999999999},1.1122000000000001,null,13.79,5.91,{"$error":"#REF!"},{"$f":"IF(#REF!=\"Tabela Não Desonerada\",VLOOKUP($C241,#REF!,13,FALSE),VLOOKUP($C241,#REF!,13,FALSE))","v":{"$error":"#REF!"}},{"$error":"#REF!"},{"$f":"IF(#REF!=\"Tabela Não Desonerada\",VLOOKUP($C241,#REF!,14,FALSE),VLOOKUP($C241,#REF!,14,FALSE))","v":{"$error":"#REF!"}},{"$error":"#REF!"},{"$f":"IF(#REF!=\"Tabela Não Desonerada\",VLOOKUP($C241,#REF!,15,FALSE),VLOOKUP($C241,#REF!,15,FALSE))","v":{"$error":"#REF!"}},{"$error":"#REF!"}]
[1,{"$f":"'Orçamento-TCE'!B242","v":231},{"$f":"'Orçamento-TCE'!C242","v":"13.11"},{"$f":"'Orçamento-TCE'!G242","v":"TÊ, PVC, SÉRIE NORMAL, ESGOTO PREDIAL, DN 40X40MM, JUNTA SOLDÁVEL, FORNECIDO E INSTALADO EM RAMAL DE DESCARGA OU RAMAL DE ESGOTO SANITÁRIO. AF_12/2014"},{"$f":"'Orçamento-TCE'!H242","v":5},{"$f":"'Orçamento-TCE'!I242","v":"UN"},{"$f":"Orçamento!H252","v":15.44},{"$f":"Orçamento!I252","v":77.2},{"$f":"Orçamento!G252","v":0.22159999999999999},1.1122000000000001,null,10.808,4.6319999999999997,{"$error":"#REF!"},{"$f":"IF(#REF!=\"Tabela Não Desonerada\",VLOOKUP($C242,#REF!,13,FALSE),VLOOKUP($C242,#REF!,13,FALSE))","v":{"$error":"#REF!"}},{"$error":"#REF!"},{"$f":"IF(#REF!=\"Tabela Não Desonerada\",VLOOKUP($C242,#REF!,14,FALSE),VLOOKUP($C242,#REF!,14,FALSE))","v":{"$error":"#REF!"}},{"$error":"#REF!"},{"$f":"IF(#REF!=\"Tabela Não Desonerada\",VLOOKUP($C242,#REF!,15,FALSE),VLOOKUP($C242,#REF!,15,FALSE))","v":{"$error":"#REF!"}},{"$error":"#REF!"}]
[1,{"$f":"'Orçamento-TCE'!B243","v":232},{"$f":"'Orçamento-TCE'!C243","v":"13.12"},{"$f":"'Orçamento-TCE'!G243","v":"MANGOTE FLEXÍVEL 7/16\""},{"$f":"'Orçamento-TCE'!H243","v":20},{"$f":"'Orçamento-TCE'!I243","v":"M"},{"$f":"Orçamento!H253","v":4.4400000000000004},{"$f":"Orçamento!I253","v":88.8},{"$f":"Orçamento!G253","v":0.22159999999999999},1.1122000000000001,null,3.1080000000000001,1.3320000000000003,{"$error":"#REF!"},{"$f":"IF(#REF!=\"Tabela Não Desonerada\",VLOOKUP($C243,#REF!,13,FALSE),VLOOKUP($C243,#REF!,13,FALSE))","v":{"$error":"#REF!"}},{"$error":"#REF!"},{"$f":"IF(#REF!=\"Tabela Não Desonerada\",VLOOKUP($C243,#REF!,14,FALSE),VLOOKUP($C243,#REF!,14,FALSE))","v":{"$error":"#REF!"}},{"$error":"#REF!"},{"$f":"IF(#REF!=\"Tabela Não Desonerada\",VLOOKUP($C243,#REF!,15,FALSE),VLOOKUP($C243,#REF!,15,FALSE))","v":{"$error":"#REF!"}},{"$error":"#REF!"}]
[1,{"$f":"'Orçamento-TCE'!B244","v":233},{"$f":"'Orçamento-TCE'!C244","v":"13.13"},{"$f":"'Orçamento-TCE'!G244","v":"MANGOTE FLEXÍVEL 1/2\""},{"$f":"'Orçamento-TCE'!H244","v":2},{"$f":"'Orçamento-TCE'!I244","v":"M"},{"$f":"Orçamento!H254","v":8.15},{"$f":"Orçamento!I254","v":16.3},{"$f":"Orçamento!G254","v":0.22159999999999999},1.1122000000000001,null,5.7050000000000001,2.4450000000000003,{"$error":"#REF!"},{"$f":"IF(#REF!=\"Tabela Não Desonerada\",VLOOKUP($C244,#REF!,13,FALSE),VLOOKUP($C244,#REF!,13,FALSE))","v":{"$error":"#REF!"}},{"$error":"#REF!"},{"$f":"IF(#REF!=\"Tabela Não Desonerada\",VLOOKUP($C244,#REF!,14,FALSE),VLOOKUP($C244,#REF!,14,FALSE))","v":{"$error":"#REF!"}},{"$error":"#REF!"},{"$f":"IF(#REF!=\"Tabela Não Desonerada\",VLOOKUP($C244,#REF!,15,FALSE),VLOOKUP($C244,#REF!,15,FALSE))","v":{"$error":"#REF!"}},{"$error":"#REF!"}]
[1,{"$f":"'Orçamento-TCE'!B245","v":234},{"$f":"'Orçamento-TCE'!C245","v":"13.14"},{"$f":"'Orçamento-TCE'!G245","v":"MANÔMETRO DIÂMETRO 75MM, RANGE DE PRESSÃO DE 0 A 7KgF/CM2"},{"$f":"'Orçamento-TCE'!H245","v":2},{"$f":"'Orçamento-TCE'!I245","v":"UN"},{"$f":"Orçamento!H255","v":188.68},{"$f":"Orçamento!I255","v":377.36},{"$f":"Orçamento!G255","v":0.22159999999999999},1.1122000000000001,null,132.07599999999999,56.604000000000013,{"$error":"#REF!"},{"$f":"IF(#REF!=\"Tabela Não Desonerada\",VLOOKUP($C245,#REF!,13,FALSE),VLOOKUP($C245,#REF!,13,FALSE))","v":{"$error":"#REF!"}},{"$error":"#REF!"},{"$f":"IF(#REF!=\"Tabela Não Desonerada\",VLOOKUP($C245,#REF!,14,FALSE),VLOOKUP($C245,#REF!,14,FALSE))","v":{"$error":"#REF!"}},{"$error":"#REF!"},{"$f":"IF(#REF!=\"Tabela Não Desonerada\",VLOOKUP($C245,#REF!,15,FALSE),VLOOKUP($C245,#REF!,15,FALSE))","v":{"$error":"#REF!"}},{"$error":"#REF!"}]
[1,{"$f":"'Orçamento-TCE'!B246","v":235},{"$f":"'Orçamento-TCE'!C246","v":"13.15"},{"$f":"'Orçamento-TCE'!G246","v":"REGULADOR DE PRESSÃO COM VÁLVULA DE SEGURANÇA, COM MANÔMETRO, SEGUNDO ESTÁGIO, ENTRADA DE 1,5 KgF/CM2 E SAÍDA DE 280MMCA"},{"$f":"'Orçamento-TCE'!H246","v":2},{"$f":"'Orçamento-TCE'!I246","v":"UN"},{"$f":"Orçamento!H256","v":257.57},{"$f":"Orçamento!I256","v":515.14},{"$f":"Orçamento!G256","v":0.22159999999999999},1.1122000000000001,null,180.29899999999998,77.271000000000015,{"$error":"#REF!"},{"$f":"IF(#REF!=\"Tabela Não Desonerada\",VLOOKUP($C246,#REF!,13,FALSE),VLOOKUP($C246,#REF!,13,FALSE))","v":{"$error":"#REF!"}},{"$error":"#REF!"},{"$f":"IF(#REF!=\"Tabela Não Desonerada\",VLOOKUP($C246,#REF!,14,FALSE),VLOOKUP($C246,#REF!,14,FALSE))","v":{"$error":"#REF!"}},{"$error":"#REF!"},{"$f":"IF(#REF!=\"Tabela Não Desonerada\",VLOOKUP($C246,#REF!,15,FALSE),VLOOKUP($C246,#REF!,15,FALSE))","v":{"$error":"#REF!"}},{"$error":"#REF!"}]
[1,{"$f":"'Orçamento-TCE'!B247","v":236},{"$f":"'Orçamento-TCE'!C247","v":"13.16"},{"$f":"'Orçamento-TCE'!G247","v":"REGULADOR DE PRESSÃO COM VÁLVULA DE SEGURANÇA, COM MANÔMETRO, PRIMEIRO ESTÁGIO, ENTRADA DE 5 KgF/CM2 E SAÍDA DE 1,5KgF/CM2"},{"$f":"'Orçamento-TCE'!H247","v":2},{"$f":"'Orçamento-TCE'!I247","v":"UN"},{"$f":"Orçamento!H257","v":257.57},{"$f":"Orçamento!I257","v":515.14},{"$f":"Orçamento!G257","v":0.22159999999999999},1.1122000000000001,null,180.29899999999998,77.271000000000015,{"$error":"#REF!"},{"$f":"IF(#REF!=\"Tabela Não Desonerada\",VLOOKUP($C247,#REF!,13,FALSE),VLOOKUP($C247,#REF!,13,FALSE))","v":{"$error":"#REF!"}},{"$error":"#REF!"},{"$f":"IF(#REF!=\"Tabela Não Desonerada\",VLOOKUP($C247,#REF!,14,FALSE),VLOOKUP($C247,#REF!,14,FALSE))","v":{"$error":"#REF!"}},{"$error":"#REF!"},{"$f":"IF(#REF!=\"Tabela Não Desonerada\",VLOOKUP($C247,#REF!,15,FALSE),VLOOKUP($C247,#REF!,15,FALSE))","v":{"$error":"#REF!"}},{"$error":"#REF!"}]
[1,{"$f":"'Orçamento-TCE'!B248","v":237},{"$f":"'Orçamento-TCE'!C248","v":"14.1"},{"$f":"'Orçamento-TCE'!G248","v":"EXECUÇÃO DE RADIER, ESPESSURA DE 10CM, FCK=30MPA, COM USO DE FORMAS EM MADEIRA SERRADA. AF_09/2017"},{"$f":"'Orçamento-TCE'!H248","v":9},{"$f":"'Orçamento-TCE'!I248","v":"M2"},{"$f":"Orçamento!H259","v":218.14},{"$f":"Orçamento!I259","v":1963.26},{"$f":"Orçamento!G259","v":0.22159999999999999},1.1122000000000001,null,152.69799999999998,65.442000000000007,{"$error":"#REF!"},{"$f":"IF(#REF!=\"Tabela Não Desonerada\",VLOOKUP($C248,#REF!,13,FALSE),VLOOKUP($C248,#REF!,13,FALSE))","v":{"$error":"#REF!"}},{"$error":"#REF!"},{"$f":"IF(#REF!=\"Tabela Não Desonerada\",VLOOKUP($C248,#REF!,14,FALSE),VLOOKUP($C248,#REF!,14,FALSE))","v":{"$error":"#REF!"}},{"$error":"#REF!"},{"$f":"IF(#REF!=\"Tabela Não Desonerada\",VLOOKUP($C248,#REF!,15,FALSE),VLOOKUP($C248,#REF!,15,FALSE))","v":{"$error":"#REF!"}},{"$error":"#REF!"}]
[1,{"$f":"'Orçamento-TCE'!B249","v":238},{"$f":"'Orçamento-TCE'!C249","v":"14.2"},{"$f":"'Orçamento-TCE'!G249","v":"EXECUÇÃO DE ESTRUTURAS DE CONCRETO ARMADO, PARA EDIFICAÇÃO HABITACIONAL UNIFAMILIAR TÉRREA (CASA ISOLADA), FCK=25MPA. AF_01/2017"},{"$f":"'Orçamento-TCE'!H249","v":1},{"$f":"'Orçamento-TCE'!I249","v":"M3"},{"$f":"Orçamento!H260","v":3955.24},{"$f":"Orçamento!I260","v":3955.24},{"$f":"Orçamento!G260","v":0.22159999999999999},1.1122000000000001,null,2768.6679999999997,1186.5720000000001,{"$error":"#REF!"},{"$f":"IF(#REF!=\"Tabela Não Desonerada\",VLOOKUP($C249,#REF!,13,FALSE),VLOOKUP($C249,#REF!,13,FALSE))","v":{"$error":"#REF!"}},{"$error":"#REF!"},{"$f":"IF(#REF!=\"Tabela Não Desonerada\",VLOOKUP($C249,#REF!,14,FALSE),VLOOKUP($C249,#REF!,14,FALSE))","v":{"$error":"#REF!"}},{"$error":"#REF!"},{"$f":"IF(#REF!=\"Tabela Não Desonerada\",VLOOKUP($C249,#REF!,15,FALSE),VLOOKUP($C249,#REF!,15,FALSE))","v":{"$error":"#REF!"}},{"$error":"#REF!"}]
[1,{"$f":"'Orçamento-TCE'!B250","v":239},{"$f":"'Orçamento-TCE'!C250","v":"14.3"},{"$f":"'Orçamento-TCE'!G250","v":"ALVENARIA DE VEDAÇÃO DE BLOCOS CERÂMICOS MACIÇOS DE 5X10X20CM (ESPESSURA 10CM) E ARGAMASSA DE ASSENTAMENTO COM PREPARO EM BETONEIRA. AF_05/2020"},{"$f":"'Orçamento-TCE'!H250","v":30},{"$f":"'Orçamento-TCE'!I250","v":"M2"},{"$f":"Orçamento!H261","v":152.41},{"$f":"Orçamento!I261","v":4572.3},{"$f":"Orçamento!G261","v":0.22159999999999999},1.1122000000000001,null,106.687,45.722999999999999,{"$error":"#REF!"},{"$f":"IF(#REF!=\"Tabela Não Desonerada\",VLOOKUP($C250,#REF!,13,FALSE),VLOOKUP($C250,#REF!,13,FALSE))","v":{"$error":"#REF!"}},{"$error":"#REF!"},{"$f":"IF(#REF!=\"Tabela Não Desonerada\",VLOOKUP($C250,#REF!,14,FALSE),VLOOKUP($C250,#REF!,14,FALSE))","v":{"$error":"#REF!"}},{"$error":"#REF!"},{"$f":"IF(#REF!=\"Tabela Não Desonerada\",VLOOKUP($C250,#REF!,15,FALSE),VLOOKUP($C250,#REF!,15,FALSE))","v":{"$error":"#REF!"}},{"$error":"#REF!"}]
[1,{"$f":"'Orçamento-TCE'!B251","v":240},{"$f":"'Orçamento-TCE'!C251","v":"14.4"},{"$f":"'Orçamento-TCE'!G251","v":"CHAPISCO APLICADO EM ALVENARIAS E ESTRUTURAS DE CONCRETO INTERNAS, COM COLHER DE PEDREIRO. ARGAMASSA TRAÇO 1:3 COM PREPARO MANUAL. AF_06/2014"},{"$f":"'Orçamento-TCE'!H251","v":30},{"$f":"'Orçamento-TCE'!I251","v":"M2"},{"$f":"Orçamento!H262","v":5.0199999999999996},{"$f":"Orçamento!I262","v":150.6},{"$f":"Orçamento!G262","v":0.22159999999999999},1.1122000000000001,null,3.5139999999999993,1.5060000000000002,{"$error":"#REF!"},{"$f":"IF(#REF!=\"Tabela Não Desonerada\",VLOOKUP($C251,#REF!,13,FALSE),VLOOKUP($C251,#REF!,13,FALSE))","v":{"$error":"#REF!"}},{"$error":"#REF!"},{"$f":"IF(#REF!=\"Tabela Não Desonerada\",VLOOKUP($C251,#REF!,14,FALSE),VLOOKUP($C251,#REF!,14,FALSE))","v":{"$error":"#REF!"}},{"$error":"#REF!"},{"$f":"IF(#REF!=\"Tabela Não Desonerada\",VLOOKUP($C251,#REF!,15,FALSE),VLOOKUP($C251,#REF!,15,FALSE))","v":{"$error":"#REF!"}},{"$error":"#REF!"}]
[1,{"$f":"'Orçamento-TCE'!B252","v":241},{"$f":"'Orçamento-TCE'!C252","v":"14.5"},{"$f":"'Orçamento-TCE'!G252","v":"EMBOÇO OU MASSA ÚNICA EM ARGAMASSA TRAÇO 1:2:8, PREPARO MECÂNICO COM BETONEIRA 400L, APLICADA MANUALMENTE EM SUPERFÍCIES EXTERNAS DA SACADA, ESPESSURA DE 35MM, SEM USO DE TELA METÁLICA DE REFORÇA CONTRA FISSURAÇÃO. AF_06/2014"},{"$f":"'Orçamento-TCE'!H252","v":30},{"$f":"'Orçamento-TCE'!I252","v":"M2"},{"$f":"Orçamento!H263","v":104.03},{"$f":"Orçamento!I263","v":3120.9},{"$f":"Orçamento!G263","v":0.22159999999999999},1.1122000000000001,null,72.820999999999998,31.209000000000003,{"$error":"#REF!"},{"$f":"IF(#REF!=\"Tabela Não Desonerada\",VLOOKUP($C252,#REF!,13,FALSE),VLOOKUP($C252,#REF!,13,FALSE))","v":{"$error":"#REF!"}},{"$error":"#REF!"},{"$f":"IF(#REF!=\"Tabela Não Desonerada\",VLOOKUP($C252,#REF!,14,FALSE),VLOOKUP($C252,#REF!,14,FALSE))","v":{"$error":"#REF!"}},{"$error":"#REF!"},{"$f":"IF(#REF!=\"Tabela Não Desonerada\",VLOOKUP($C252,#REF!,15,FALSE),VLOOKUP($C252,#REF!,15,FALSE))","v":{"$error":"#REF!"}},{"$error":"#REF!"}]
[1,{"$f":"'Orçamento-TCE'!B253","v":242},{"$f":"'Orçamento-TCE'!C253","v":"14.6"},{"$f":"'Orçamento-TCE'!G253","v":"IMPERMEABILIZAÇÃO DE SUPERFÍCIE COM MANTA ASFÁLTICA, DUAS CAMADAS, INCLUSIVE APLICAÇÃO DE PRIMER ASFÁLTICO, E=3MM E E=4MM. AF_06/2018"},{"$f":"'Orçamento-TCE'!H253","v":37},{"$f":"'Orçamento-TCE'!I253","v":"M2"},{"$f":"Orçamento!H264","v":212.09},{"$f":"Orçamento!I264","v":7847.33},{"$f":"Orçamento!G264","v":0.22159999999999999},1.1122000000000001,null,148.46299999999999,63.62700000000001,{"$error":"#REF!"},{"$f":"IF(#REF!=\"Tabela Não Desonerada\",VLOOKUP($C253,#REF!,13,FALSE),VLOOKUP($C253,#REF!,13,FALSE))","v":{"$error":"#REF!"}},{"$error":"#REF!"},{"$f":"IF(#REF!=\"Tabela Não Desonerada\",VLOOKUP($C253,#REF!,14,FALSE),VLOOKUP($C253,#REF!,14,FALSE))","v":{"$error":"#REF!"}},{"$error":"#REF!"},{"$f":"IF(#REF!=\"Tabela Não Desonerada\",VLOOKUP($C253,#REF!,15,FALSE),VLOOKUP($C253,#REF!,15,FALSE))","v":{"$error":"#REF!"}},{"$error":"#REF!"}]
[1,{"$f":"'Orçamento-TCE'!B254","v":243},{"$f":"'Orçamento-TCE'!C254","v":"14.7"},{"$f":"'Orçamento-TCE'!G254","v":"PISO CIMENTADO, TRAÇO 1:3 (CIMENTO E AREIA), ACABAMENTO LISO, ESPESSURA 4,0 CM, PREPARO MECÂNICO DA ARGAMASSA. AF_09/2020"},{"$f":"'Orçamento-TCE'!H254","v":37},{"$f":"'Orçamento-TCE'!I254","v":"M2"},{"$f":"Orçamento!H265","v":57.34},{"$f":"Orçamento!I265","v":2121.58},{"$f":"Orçamento!G265","v":0.22159999999999999},1.1122000000000001,null,40.137999999999998,17.202000000000005,{"$error":"#REF!"},{"$f":"IF(#REF!=\"Tabela Não Desonerada\",VLOOKUP($C254,#REF!,13,FALSE),VLOOKUP($C254,#REF!,13,FALSE))","v":{"$error":"#REF!"}},{"$error":"#REF!"},{"$f":"IF(#REF!=\"Tabela Não Desonerada\",VLOOKUP($C254,#REF!,14,FALSE),VLOOKUP($C254,#REF!,14,FALSE))","v":{"$error":"#REF!"}},{"$error":"#REF!"},{"$f":"IF(#REF!=\"Tabela Não Desonerada\",VLOOKUP($C254,#REF!,15,FALSE),VLOOKUP($C254,#REF!,15,FALSE))","v":{"$error":"#REF!"}},{"$error":"#REF!"}]
[1,{"$f":"'Orçamento-TCE'!B255","v":244},{"$f":"'Orçamento-TCE'!C255","v":"14.8"},{"$f":"'Orçamento-TCE'!G255","v":"Tratamento de estrutura metálica "},{"$f":"'Orçamento-TCE'!H255","v":37},{"$f":"'Orçamento-TCE'!I255","v":"M2"},{"$f":"Orçamento!H266","v":44.58},{"$f":"Orçamento!I266","v":1649.46},{"$f":"Orçamento!G266","v":0.22159999999999999},1.1122000000000001,null,31.205999999999996,13.374000000000002,{"$error":"#REF!"},{"$f":"IF(#REF!=\"Tabela Não Desonerada\",VLOOKUP($C255,#REF!,13,FALSE),VLOOKUP($C255,#REF!,13,FALSE))","v":{"$error":"#REF!"}},{"$error":"#REF!"},{"$f":"IF(#REF!=\"Tabela Não Desonerada\",VLOOKUP($C255,#REF!,14,FALSE),VLOOKUP($C255,#REF!,14,FALSE))","v":{"$error":"#REF!"}},{"$error":"#REF!"},{"$f":"IF(#REF!=\"Tabela Não Desonerada\",VLOOKUP($C255,#REF!,15,FALSE),VLOOKUP($C255,#REF!,15,FALSE))","v":{"$error":"#REF!"}},{"$error":"#REF!"}]
[1,{"$f":"'Orçamento-TCE'!B256","v":245},{"$f":"'Orçamento-TCE'!C256","v":"14.9"},{"$f":"'Orçamento-TCE'!G256","v":"TESTES FINAIS DE INSTALAÇÕES"},{"$f":"'Orçamento-TCE'!H256","v":1},{"$f":"'Orçamento-TCE'!I256","v":"UN"},{"$f":"Orçamento!H267","v":669.09},{"$f":"Orçamento!I267","v":669.09},{"$f":"Orçamento!G267","v":0.22159999999999999},1.1122000000000001,null,468.363,200.72700000000003,{"$error":"#REF!"},{"$f":"IF(#REF!=\"Tabela Não Desonerada\",VLOOKUP($C256,#REF!,13,FALSE),VLOOKUP($C256,#REF!,13,FALSE))","v":{"$error":"#REF!"}},{"$error":"#REF!"},{"$f":"IF(#REF!=\"Tabela Não Desonerada\",VLOOKUP($C256,#REF!,14,FALSE),VLOOKUP($C256,#REF!,14,FALSE))","v":{"$error":"#REF!"}},{"$error":"#REF!"},{"$f":"IF(#REF!=\"Tabela Não Desonerada\",VLOOKUP($C256,#REF!,15,FALSE),VLOOKUP($C256,#REF!,15,FALSE))","v":{"$error":"#REF!"}},{"$error":"#REF!"}]
[1,{"$f":"'Orçamento-TCE'!B257","v":246},{"$f":"'Orçamento-TCE'!C257","v":"14.10"},{"$f":"'Orçamento-TCE'!G257","v":"LIMPEZA FINAL DE OBRA"},{"$f":"'Orçamento-TCE'!H257","v":1300},{"$f":"'Orçamento-TCE'!I257","v":"M2"},{"$f":"Orçamento!H268","v":4.5599999999999996},{"$f":"Orçamento!I268","v":5928},{"$f":"Orçamento!G268","v":0.22159999999999999},1.1122000000000001,null,3.1919999999999997,1.3679999999999999,{"$error":"#REF!"},{"$f":"IF(#REF!=\"Tabela Não Desonerada\",VLOOKUP($C257,#REF!,13,FALSE),VLOOKUP($C257,#REF!,13,FALSE))","v":{"$error":"#REF!"}},{"$error":"#REF!"},{"$f":"IF(#REF!=\"Tabela Não Desonerada\",VLOOKUP($C257,#REF!,14,FALSE),VLOOKUP($C257,#REF!,14,FALSE))","v":{"$error":"#REF!"}},{"$error":"#REF!"},{"$f":"IF(#REF!=\"Tabela Não Desonerada\",VLOOKUP($C257,#REF!,15,FALSE),VLOOKUP($C257,#REF!,15,FALSE))","v":{"$error":"#REF!"}},{"$error":"#REF!"}]

{"sheet":"Orçamento-TCE","index":1,"n_rows":257,"n_cols":20,"rows_kept":257,"cut":false,"hidden":true,"merged":[[9,19,10,19],[5,2,5,6],[9,0,10,0],[9,1,10,1],[9,2,10,2],[9,3,10,3],[9,4,10,4],[9,5,10,5],[9,6,10,6],[9,7,9,12],[9,13,9,14],[9,15,9,16],[9,17,10,17],[9,18,10,18],[4,2,4,6],[0,0,0,10],[1,2,1,6],[2,0,2,1],[2,2,2,10],[3,2,3,8]]}
["ORÇAMENTO"]
["Modalidade",null,"",{"$nulls":4},"N° ","","Ano ",""]
["Descrição do Objeto",null,{"$f":"'Identificação-TCE'!B3","v":"Reforma dos setores 2 e 4 do Ginásio Municipal Osmar Fortes Barcellos (Ginásio Tesourinha) "}]
["Órgão",null,{"$f":"'Identificação-TCE'!B4","v":"SMELJ"},{"$nulls":6},"CNPJ ",""]
["Tipo de Objeto",null,""]
["Preço T. Estimado",null,{"$f":"SUM(K12:K257)","v":2045309.4300000018}]
[]
["Atenção! Para incluir mais de 100 linhas de itens, selecione as células A113 a R113 e arraste as fórmulas para baixo, de acordo com o número de itens necessário."]
["*Preenchimento obrigatório",{"$nulls":4},"**Obrigatório só para Obras e Serviços de Engenharia",null,"***Obrigatório só para licitação composta por Lotes"]
["Nº  do Lote***","N° Ordem","Nº Item*","Fonte de Referência**","Código de Referência**","Data de Referência**","Descrição do item*","Estimativa",{"$nulls":5},"Família",null,"Subfamília",null,"Tipo de Orçamento","Pr. Unit. Material","Pr. Unit. Mão de obra"]
[{"$nulls":7},"Qtd.*","Unid.*","Preço unitário (R$)*","Preço Total (R$)","% BDI**","% Encargos Sociais**","Código","Descrição","Código","Descrição"]
[{"$f":"'[1]Identificação-TCE'!$A$13","v":1},{"$f":"IF(AND(G12<>\"\",H12>0,I12<>\"\",J12<>0,K12<>0),COUNT($B$11:B11)+1,\"\")","v":1},{"$f":"Orçamento!A10","v":"1.1"},"CCU","CPUE  30","2022-02-11",{"$f":"VLOOKUP($C12,Orçamento!A10:C268,3,FALSE)","v":"PLACA DE OBRA"},{"$f":"IFERROR(VLOOKUP($C12,Orçamento!A10:E268,5,FALSE),0)","v":2.88},{"$f":"VLOOKUP($C12,Orçamento!A10:D268,4,FALSE)","v":"M2"},{"$f":"VLOOKUP($C12,Orçamento!A10:H269,8,FALSE)","v":390.92},{"$f":"VLOOKUP($C12,Orçamento!A10:I269,9,FALSE)","v":1125.8499999999999},{"$f":"VLOOKUP($C12,Orçamento!A10:G269,7,FALSE)","v":0.22159999999999999},1.1122000000000001,null,"",null,""]
[{"$f":"'[1]Identificação-TCE'!$A$13","v":1},{"$f":"IF(AND(G13<>\"\",H13>0,I13<>\"\",J13<>0,K13<>0),COUNT($B$11:B12)+1,\"\")","v":2},{"$f":"Orçamento!A11","v":"1.2"},"CCU","CPUE  54","2022-02-11",{"$f":"VLOOKUP($C13,Orçamento!A11:C269,3,FALSE)","v":"ANDAIME TUBULAR METÁLICO"},{"$f":"IFERROR(VLOOKUP($C13,Orçamento!A11:E269,5,FALSE),0)","v":8},{"$f":"VLOOKUP($C13,Orçamento!A11:D269,4,FALSE)","v":"MÊS"},{"$f":"VLOOKUP($C13,Orçamento!A11:H270,8,FALSE)","v":789.78},{"$f":"VLOOKUP($C13,Orçamento!A11:I270,9,FALSE)","v":6318.24},{"$f":"VLOOKUP($C13,Orçamento!A11:G270,7,FALSE)","v":0.22159999999999999},1.1122000000000001,null,"",null,""]
[{"$f":"'[1]Identificação-TCE'!$A$13","v":1},{"$f":"IF(AND(G14<>\"\",H14>0,I14<>\"\",J14<>0,K14<>0),COUNT($B$11:B13)+1,\"\")","v":3},{"$f":"Orçamento!A12","v":"1.3"},"SINAPI","SINAPI 101908","2022-02-11",{"$f":"VLOOKUP($C14,Orçamento!A12:C270,3,FALSE)","v":"EXTINTOR DE INCÊNDIO PORTÁTIL COM CARGA DE PQS DE 4 KG, CLASSE BC - FORNECIMENTO E INSTALAÇÃO. AF_10/2020_P"},{"$f":"IFERROR(VLOOKUP($C14,Orçamento!A12:E270,5,FALSE),0)","v":2},"UN",{"$f":"VLOOKUP($C14,Orçamento!A12:H271,8,FALSE)","v":282.97000000000003},{"$f":"VLOOKUP($C14,Orçamento!A12:I271,9,FALSE)","v":565.94000000000005},{"$f":"VLOOKUP($C14,Orçamento!A12:G271,7,FALSE)","v":0.22159999999999999},1.1122000000000001,null,"",null,""]
[{"$f":"'[1]Identificação-TCE'!$A$13","v":1},{"$f":"IF(AND(G15<>\"\",H15>0,I15<>\"\",J15<>0,K15<>0),COUNT($B$11:B14)+1,\"\")","v":4},{"$f":"Orçamento!A13","v":"1.4"},"SINAPI","SINAPI 101905","2022-02-11",{"$f":"VLOOKUP($C15,Orçamento!A13:C271,3,FALSE)","v":"EXTINTOR DE INCÊNDIO PORTÁTIL COM CARGA DE ÁGUA PRESSURIZADA DE 10 L, CLASSE A - FORNECIMENTO E INSTALAÇÃO. AF_10/2020_P"},{"$f":"IFERROR(VLOOKUP($C15,Orçamento!A13:E271,5,FALSE),0)","v":2},"UN",{"$f":"VLOOKUP($C15,Orçamento!A13:H272,8,FALSE)","v":291.82},{"$f":"VLOOKUP($C15,Orçamento!A13:I272,9,FALSE)","v":583.64},{"$f":"VLOOKUP($C15,Orçamento!A13:G272,7,FALSE)","v":0.22159999999999999},1.1122000000000001,null,"",null,""]
[{"$f":"'[1]Identificação-TCE'!$A$13","v":1},{"$f":"IF(AND(G16<>\"\",H16>0,I16<>\"\",J16<>0,K16<>0),COUNT($B$11:B15)+1,\"\")","v":5},{"$f":"Orçamento!A15","v":"2.1"},"CCU","CPUE 116","2022-02-11",{"$f":"VLOOKUP($C16,Orçamento!A15:C273,3,FALSE)","v":"ADMINISTRAÇÃO LOCAL"},{"$f":"IFERROR(VLOOKUP($C16,Orçamento!A15:E273,5,FALSE),0)","v":1},"UN",{"$f":"VLOOKUP($C16,Orçamento!A15:H274,8,FALSE)","v":116639.28},{"$f":"VLOOKUP($C16,Orçamento!A15:I274,9,FALSE)","v":116639.28},{"$f":"VLOOKUP($C16,Orçamento!A15:G274,7,FALSE)","v":0.22159999999999999},1.1122000000000001,null,"",null,""]
[{"$f":"'[1]Identificação-TCE'!$A$13","v":1},{"$f":"IF(AND(G17<>\"\",H17>0,I17<>\"\",J17<>0,K17<>0),COUNT($B$11:B16)+1,\"\")","v":6},{"$f":"Orçamento!A17","v":"3.1"},"SINAPI","SINAPI 97640","2022-02-11",{"$f":"VLOOKUP($C17,Orçamento!A17:C275,3,FALSE)","v":"REMOÇÃO DE FORROS DE DRYWALL, PVC E FIBROMINERAL, DE FORMA MANUAL, SEM REAPROVEITAMENTO. AF_12/2017"},{"$f":"IFERROR(VLOOKUP($C17,Orçamento!A17:E275,5,FALSE),0)","v":317.29000000000002},{"$f":"VLOOKUP($C17,Orçamento!A17:D275,4,FALSE)","v":"M2"},{"$f":"VLOOKUP($C17,Orçamento!A17:H276,8,FALSE)","v":1.84},{"$f":"VLOOKUP($C17,Orçamento!A17:I276,9,FALSE)","v":583.80999999999995},{"$f":"VLOOKUP($C17,Orçamento!A17:G276,7,FALSE)","v":0.22159999999999999},1.1122000000000001,null,"",null,""]
[{"$f":"'[1]Identificação-TCE'!$A$13","v":1},{"$f":"IF(AND(G18<>\"\",H18>0,I18<>\"\",J18<>0,K18<>0),COUNT($B$11:B17)+1,\"\")","v":7},{"$f":"Orçamento!A18","v":"3.2"},"SINAPI","SINAPI 97629","2022-02-11",{"$f":"VLOOKUP($C18,Orçamento!A18:C276,3,FALSE)","v":"DEMOLIÇÃO DE LAJES, DE FORMA MECANIZADA COM MARTELETE, SEM REAPROVEITAMENTO. AF_12/2017"},{"$f":"IFERROR(VLOOKUP($C18,Orçamento!A18:E276,5,FALSE),0)","v":7.53},{"$f":"VLOOKUP($C18,Orçamento!A18:D276,4,FALSE)","v":"M3"},{"$f":"VLOOKUP($C18,Orçamento!A18:H277,8,FALSE)","v":149.19},{"$f":"VLOOKUP($C18,Orçamento!A18:I277,9,FALSE)","v":1123.4000000000001},{"$f":"VLOOKUP($C18,Orçamento!A18:G277,7,FALSE)","v":0.22159999999999999},1.1122000000000001,null,"",null,""]
[{"$f":"'[1]Identificação-TCE'!$A$13","v":1},{"$f":"IF(AND(G19<>\"\",H19>0,I19<>\"\",J19<>0,K19<>0),COUNT($B$11:B18)+1,\"\")","v":8},{"$f":"Orçamento!A19","v":"3.3"},"SINAPI","SINAPI 97642","2022-02-11",{"$f":"VLOOKUP($C19,Orçamento!A19:C277,3,FALSE)","v":"REMOÇÃO DE TRAMA METÁLICA OU DE MADEIRA PARA FORRO, DE FORMA MANUAL SEM REAPROVEITAMENTO. AF_12/2017"},{"$f":"IFERROR(VLOOKUP($C19,Orçamento!A19:E277,5,FALSE),0)","v":189.14},{"$f":"VLOOKUP($C19,Orçamento!A19:D277,4,FALSE)","v":"M2"},{"$f":"VLOOKUP($C19,Orçamento!A19:H278,8,FALSE)","v":3.31},{"$f":"VLOOKUP($C19,Orçamento!A19:I278,9,FALSE)","v":626.04999999999995},{"$f":"VLOOKUP($C19,Orçamento!A19:G278,7,FALSE)","v":0.22159999999999999},1.1122000000000001,null,"",null,""]
[{"$f":"'[1]Identificação-TCE'!$A$13","v":1},{"$f":"IF(AND(G20<>\"\",H20>0,I20<>\"\",J20<>0,K20<>0),COUNT($B$11:B19)+1,\"\")","v":9},{"$f":"Orçamento!A20","v":"3.4"},"SINAPI","SINAPI  97633","2022-02-11",{"$f":"VLOOKUP($C20,Orçamento!A20:C278,3,FALSE)","v":"DEMOLIÇÃO DE REVESTIMENTO CERÂMICO, DE FORMA MANUAL, SEM REAPROVEITAMENTO. AF_12/2017"},{"$f":"IFERROR(VLOOKUP($C20,Orçamento!A20:E278,5,FALSE),0)","v":301.22000000000003},{"$f":"VLOOKUP($C20,Orçamento!A20:D278,4,FALSE)","v":"M2"},{"$f":"VLOOKUP($C20,Orçamento!A20:H279,8,FALSE)","v":23.63},{"$f":"VLOOKUP($C20,Orçamento!A20:I279,9,FALSE)","v":7117.83},{"$f":"VLOOKUP($C20,Orçamento!A20:G279,7,FALSE)","v":0.22159999999999999},1.1122000000000001,null,"",null,""]
[{"$f":"'[1]Identificação-TCE'!$A$13","v":1},{"$f":"IF(AND(G21<>\"\",H21>0,I21<>\"\",J21<>0,K21<>0),COUNT($B$11:B20)+1,\"\")","v":10},{"$f":"Orçamento!A21","v":"3.5"},"SINAPI","SINAPI  97634","2022-02-11",{"$f":"VLOOKUP($C21,Orçamento!A21:C279,3,FALSE)","v":"DEMOLIÇÃO DE REVESTIMENTO CERÂMICO, DE FORMA MECANIZADA COM MARTELETE, SEM REAPROVEITAMENTO. AF_12/2017"},{"$f":"IFERROR(VLOOKUP($C21,Orçamento!A21:E279,5,FALSE),0)","v":1053.1600000000001},{"$f":"VLOOKUP($C21,Orçamento!A21:D279,4,FALSE)","v":"M2"},{"$f":"VLOOKUP($C21,Orçamento!A21:H280,8,FALSE)","v":13.71},{"$f":"VLOOKUP($C21,Orçamento!A21:I280,9,FALSE)","v":14438.82},{"$f":"VLOOKUP($C21,Orçamento!A21:G280,7,FALSE)","v":0.22159999999999999},1.1122000000000001,null,"",null,""]
[{"$f":"'[1]Identificação-TCE'!$A$13","v":1},{"$f":"IF(AND(G22<>\"\",H22>0,I22<>\"\",J22<>0,K22<>0),COUNT($B$11:B21)+1,\"\")","v":11},{"$f":"Orçamento!A22","v":"3.6"},"SINAPI","SINAPI  97621","2022-02-11",{"$f":"VLOOKUP($C22,Orçamento!A22:C280,3,FALSE)","v":"DEMOLIÇÃO DE ALVENARIA DE BLOCO FURADO, DE FORMA MANUAL, COM REAPROVEITAMENTO. AF_12/2017"},{"$f":"IFERROR(VLOOKUP($C22,Orçamento!A22:E280,5,FALSE),0)","v":66.849999999999994},{"$f":"VLOOKUP($C22,Orçamento!A22:D280,4,FALSE)","v":"M3"},{"$f":"VLOOKUP($C22,Orçamento!A22:H281,8,FALSE)","v":122.61},{"$f":"VLOOKUP($C22,Orçamento!A22:I281,9,FALSE)","v":8196.48},{"$f":"VLOOKUP($C22,Orçamento!A22:G281,7,FALSE)","v":0.22159999999999999},1.1122000000000001,null,"",null,""]
[{"$f":"'[1]Identificação-TCE'!$A$13","v":1},{"$f":"IF(AND(G23<>\"\",H23>0,I23<>\"\",J23<>0,K23<>0),COUNT($B$11:B22)+1,\"\")","v":12},{"$f":"Orçamento!A23","v":"3.7"},"SINAPI","SINAPI  97638","2022-02-11",{"$f":"VLOOKUP($C23,Orçamento!A23:C281,3,FALSE)","v":"REMOÇÃO DE CHAPAS E PERFIS DE DRYWALL, DE FORMA MANUAL, SEM REAPROVEITAMENTO. AF_12/2017"},{"$f":"IFERROR(VLOOKUP($C23,Orçamento!A23:E281,5,FALSE),0)","v":23.23},{"$f":"VLOOKUP($C23,Orçamento!A23:D281,4,FALSE)","v":"M2"},{"$f":"VLOOKUP($C23,Orçamento!A23:H282,8,FALSE)","v":8.5399999999999991},{"$f":"VLOOKUP($C23,Orçamento!A23:I282,9,FALSE)","v":198.38},{"$f":"VLOOKUP($C23,Orçamento!A23:G282,7,FALSE)","v":0.22159999999999999},1.1122000000000001,null,"",null,""]
[{"$f":"'[1]Identificação-TCE'!$A$13","v":1},{"$f":"IF(AND(G24<>\"\",H24>0,I24<>\"\",J24<>0,K24<>0),COUNT($B$11:B23)+1,\"\")","v":13},{"$f":"Orçamento!A24","v":"3.8"},"SINAPI","SINAPI  97644","2022-02-11",{"$f":"VLOOKUP($C24,Orçamento!A24:C282,3,FALSE)","v":"REMOÇÃO DE PORTAS, DE FORMA MANUAL, SEM REAPROVEITAMENTO. AF_12/2017"},{"$f":"IFERROR(VLOOKUP($C24,Orçamento!A24:E282,5,FALSE),0)","v":84.21},{"$f":"VLOOKUP($C24,Orçamento!A24:D282,4,FALSE)","v":"m2"},{"$f":"VLOOKUP($C24,Orçamento!A24:H283,8,FALSE)","v":9.59},{"$f":"VLOOKUP($C24,Orçamento!A24:I283,9,FALSE)","v":807.57},{"$f":"VLOOKUP($C24,Orçamento!A24:G283,7,FALSE)","v":0.22159999999999999},1.1122000000000001,null,"",null,""]
[{"$f":"'[1]Identificação-TCE'!$A$13","v":1},{"$f":"IF(AND(G25<>\"\",H25>0,I25<>\"\",J25<>0,K25<>0),COUNT($B$11:B24)+1,\"\")","v":14},{"$f":"Orçamento!A25","v":"3.9"},"SINAPI","SINAPI  97645","2022-02-11",{"$f":"VLOOKUP($C25,Orçamento!A25:C283,3,FALSE)","v":"REMOÇÃO DE JANELAS, DE FORMA MANUAL, SEM REAPROVEIAMENTO. AF_12/2017"},{"$f":"IFERROR(VLOOKUP($C25,Orçamento!A25:E283,5,FALSE),0)","v":116.42},{"$f":"VLOOKUP($C25,Orçamento!A25:D283,4,FALSE)","v":"M2"},{"$f":"VLOOKUP($C25,Orçamento!A25:H284,8,FALSE)","v":36.159999999999997},{"$f":"VLOOKUP($C25,Orçamento!A25:I284,9,FALSE)","v":4209.75},{"$f":"VLOOKUP($C25,Orçamento!A25:G284,7,FALSE)","v":0.22159999999999999},1.1122000000000001,null,"",null,""]
[{"$f":"'[1]Identificação-TCE'!$A$13","v":1},{"$f":"IF(AND(G26<>\"\",H26>0,I26<>\"\",J26<>0,K26<>0),COUNT($B$11:B25)+1,\"\")","v":15},{"$f":"Orçamento!A26","v":"3.10"},"SINAPI","SINAPI  97663","2022-02-11",{"$f":"VLOOKUP($C26,Orçamento!A26:C284,3,FALSE)","v":"REMOÇÃO DE LOUÇAS, DE FORMA MANUAL, SEM REAPROVEITAMENTO. AF_12/2017"},{"$f":"IFERROR(VLOOKUP($C26,Orçamento!A26:E284,5,FALSE),0)","v":55},"UN",{"$f":"VLOOKUP($C26,Orçamento!A26:H285,8,FALSE)","v":12.72},{"$f":"VLOOKUP($C26,Orçamento!A26:I285,9,FALSE)","v":699.6},{"$f":"VLOOKUP($C26,Orçamento!A26:G285,7,FALSE)","v":0.22159999999999999},1.1122000000000001,null,"",null,""]
[{"$f":"'[1]Identificação-TCE'!$A$13","v":1},{"$f":"IF(AND(G27<>\"\",H27>0,I27<>\"\",J27<>0,K27<>0),COUNT($B$11:B26)+1,\"\")","v":16},{"$f":"Orçamento!A27","v":"3.11"},"SINAPI","SINAPI 95875","2022-02-11",{"$f":"VLOOKUP($C27,Orçamento!A27:C285,3,FALSE)","v":"TRANSPORTE COM CAMINHÃO BASCULANTE DE 10M3, EM VIA URBANA PAVIMENTADA, DMT ATÉ 30 KM (UNIDADE: M3XKM). AF_07/2020"},{"$f":"IFERROR(VLOOKUP($C27,Orçamento!A27:E285,5,FALSE),0)","v":2944.62},{"$f":"VLOOKUP($C27,Orçamento!A27:D285,4,FALSE)","v":"M3XKM"},{"$f":"VLOOKUP($C27,Orçamento!A27:H286,8,FALSE)","v":2},{"$f":"VLOOKUP($C27,Orçamento!A27:I286,9,FALSE)","v":5889.24},{"$f":"VLOOKUP($C27,Orçamento!A27:G286,7,FALSE)","v":0.22159999999999999},1.1122000000000001,null,"",null,""]
[{"$f":"'[1]Identificação-TCE'!$A$13","v":1},{"$f":"IF(AND(G28<>\"\",H28>0,I28<>\"\",J28<>0,K28<>0),COUNT($B$11:B27)+1,\"\")","v":17},{"$f":"Orçamento!A29","v":"4.1"},"SINAPI","SINAPI 103324","2022-02-11",{"$f":"VLOOKUP($C28,Orçamento!A29:C287,3,FALSE)","v":"ALVENARIA DE VEDAÇÃO DE BLOCOS CERÂMICOS FURADOS NA VERTICAL DE 14X19X39 CM (ESPESSURA 14 CM) E ARGAMASSA DE ASSENTAMENTO COM PREPARO EM BETONEIRA. AF_12/2021"},{"$f":"IFERROR(VLOOKUP($C28,Orçamento!A29:E287,5,FALSE),0)","v":373.38},{"$f":"VLOOKUP($C28,Orçamento!A29:D287,4,FALSE)","v":"M2"},{"$f":"VLOOKUP($C28,Orçamento!A29:H288,8,FALSE)","v":86.78},{"$f":"VLOOKUP($C28,Orçamento!A29:I288,9,FALSE)","v":32401.919999999998},{"$f":"VLOOKUP($C28,Orçamento!A29:G288,7,FALSE)","v":0.22159999999999999},1.1122000000000001,null,"",null,""]
[{"$f":"'[1]Identificação-TCE'!$A$13","v":1},{"$f":"IF(AND(G29<>\"\",H29>0,I29<>\"\",J29<>0,K29<>0),COUNT($B$11:B28)+1,\"\")","v":18},{"$f":"Orçamento!A30","v":"4.2"},"SINAPI","SINAPI 103326","2022-02-11",{"$f":"VLOOKUP($C29,Orçamento!A30:C288,3,FALSE)","v":"ALVENARIA DE VEDAÇÃO DE BLOCOS CERÂMICOS FURADOS NA VERTICAL DE 19X19X39 CM (ESPESSURA 19 CM) E ARGAMASSA DE ASSENTAMENTO COM PREPARO EM BETONEIRA. AF_12/2021"},{"$f":"IFERROR(VLOOKUP($C29,Orçamento!A30:E288,5,FALSE),0)","v":3.9},{"$f":"VLOOKUP($C29,Orçamento!A30:D288,4,FALSE)","v":"M2"},{"$f":"VLOOKUP($C29,Orçamento!A30:H289,8,FALSE)","v":105.58},{"$f":"VLOOKUP($C29,Orçamento!A30:I289,9,FALSE)","v":411.76},{"$f":"VLOOKUP($C29,Orçamento!A30:G289,7,FALSE)","v":0.22159999999999999},1.1122000000000001,null,"",null,""]
[{"$f":"'[1]Identificação-TCE'!$A$13","v":1},{"$f":"IF(AND(G30<>\"\",H30>0,I30<>\"\",J30<>0,K30<>0),COUNT($B$11:B29)+1,\"\")","v":19},{"$f":"Orçamento!A31","v":"4.3"},"SINAPI","SINAPI 96361","2022-02-11",{"$f":"VLOOKUP($C30,Orçamento!A31:C289,3,FALSE)","v":"PAREDE COM PLACAS DE GESSO ACARTONADO (DRYWALL), PARA USO INTERNO, COM DUAS FACES SIMPLES E ESTRUTURA METÁLICA COM GUIAS DUPLAS, COM VÃOS. AF_06/2017"},{"$f":"IFERROR(VLOOKUP($C30,Orçamento!A31:E289,5,FALSE),0)","v":114.08},{"$f":"VLOOKUP($C30,Orçamento!A31:D289,4,FALSE)","v":"M2"},{"$f":"VLOOKUP($C30,Orçamento!A31:H290,8,FALSE)","v":220.73},{"$f":"VLOOKUP($C30,Orçamento!A31:I290,9,FALSE)","v":25180.880000000001},{"$f":"VLOOKUP($C30,Orçamento!A31:G290,7,FALSE)","v":0.22159999999999999},1.1122000000000001,null,"",null,""]
[{"$f":"'[1]Identificação-TCE'!$A$13","v":1},{"$f":"IF(AND(G31<>\"\",H31>0,I31<>\"\",J31<>0,K31<>0),COUNT($B$11:B30)+1,\"\")","v":20},{"$f":"Orçamento!A32","v":"4.4"},"SINAPI","SINAPI 102257","2022-02-11",{"$f":"VLOOKUP($C31,Orçamento!A32:C290,3,FALSE)","v":"DIVISÓRIA SANITÁRIA, TIPO CABINE, EM PAINEL DE GRANILITE, ESP = 3CM, ASSENTADO COM ARGAMASSA COLANTE AC III-E, EXCLUSIVE FERRAGENS. AF_01/2021"},{"$f":"IFERROR(VLOOKUP($C31,Orçamento!A32:E290,5,FALSE),0)","v":11.34},{"$f":"VLOOKUP($C31,Orçamento!A32:D290,4,FALSE)","v":"M2"},{"$f":"VLOOKUP($C31,Orçamento!A32:H291,8,FALSE)","v":310.81},{"$f":"VLOOKUP($C31,Orçamento!A32:I291,9,FALSE)","v":3524.59},{"$f":"VLOOKUP($C31,Orçamento!A32:G291,7,FALSE)","v":0.22159999999999999},1.1122000000000001,null,"",null,""]
[{"$f":"'[1]Identificação-TCE'!$A$13","v":1},{"$f":"IF(AND(G32<>\"\",H32>0,I32<>\"\",J32<>0,K32<>0),COUNT($B$11:B31)+1,\"\")","v":21},{"$f":"Orçamento!A33","v":"4.5"},"ORSE","ORSE 00178","2022-02-11",{"$f":"VLOOKUP($C32,Orçamento!A33:C291,3,FALSE)","v":"FERRAGEM PARA DIVISÓRIA (VÃO PORTA) COMPOSTA DE 3 DOBRADIÇAS PALMELA E 1 FECHADURA TUBULAR LOCKWELL COM BOTÃO DE GIRO PARA TRAVAMENTO, REF: 41410N, OU SIMILAR"},{"$f":"IFERROR(VLOOKUP($C32,Orçamento!A33:E291,5,FALSE),0)","v":3},{"$f":"VLOOKUP($C32,Orçamento!A33:D291,4,FALSE)","v":"CJ"},{"$f":"VLOOKUP($C32,Orçamento!A33:H292,8,FALSE)","v":256.07},{"$f":"VLOOKUP($C32,Orçamento!A33:I292,9,FALSE)","v":768.21},{"$f":"VLOOKUP($C32,Orçamento!A33:G292,7,FALSE)","v":0.22159999999999999},1.1122000000000001,null,"",null,""]
[{"$f":"'[1]Identificação-TCE'!$A$13","v":1},{"$f":"IF(AND(G33<>\"\",H33>0,I33<>\"\",J33<>0,K33<>0),COUNT($B$11:B32)+1,\"\")","v":22},{"$f":"Orçamento!A35","v":"5.1"},"MERCADO","COT 01","2022-02-11",{"$f":"VLOOKUP($C33,Orçamento!A35:C293,3,FALSE)","v":"EA01"},{"$f":"IFERROR(VLOOKUP($C33,Orçamento!A35:E293,5,FALSE),0)","v":1},"UN",{"$f":"VLOOKUP($C33,Orçamento!A35:H294,8,FALSE)","v":1092.95},{"$f":"VLOOKUP($C33,Orçamento!A35:I294,9,FALSE)","v":1092.95},{"$f":"VLOOKUP($C33,Orçamento!A35:G294,7,FALSE)","v":0.13730000000000001},1.1122000000000001,null,"",null,""]
[{"$f":"'[1]Identificação-TCE'!$A$13","v":1},{"$f":"IF(AND(G34<>\"\",H34>0,I34<>\"\",J34<>0,K34<>0),COUNT($B$11:B33)+1,\"\")","v":23},{"$f":"Orçamento!A36","v":"5.2"},"MERCADO","COT 01","2022-02-11",{"$f":"VLOOKUP($C34,Orçamento!A36:C294,3,FALSE)","v":"EA03"},{"$f":"IFERROR(VLOOKUP($C34,Orçamento!A36:E294,5,FALSE),0)","v":3},"UN",{"$f":"VLOOKUP($C34,Orçamento!A36:H295,8,FALSE)","v":1990.28},{"$f":"VLOOKUP($C34,Orçamento!A36:I295,9,FALSE)","v":5970.84},{"$f":"VLOOKUP($C34,Orçamento!A36:G295,7,FALSE)","v":0.13730000000000001},1.1122000000000001,null,"",null,""]
[{"$f":"'[1]Identificação-TCE'!$A$13","v":1},{"$f":"IF(AND(G35<>\"\",H35>0,I35<>\"\",J35<>0,K35<>0),COUNT($B$11:B34)+1,\"\")","v":24},{"$f":"Orçamento!A37","v":"5.3"},"MERCADO","COT 01","2022-02-11",{"$f":"VLOOKUP($C35,Orçamento!A37:C295,3,FALSE)","v":"EA04"},{"$f":"IFERROR(VLOOKUP($C35,Orçamento!A37:E295,5,FALSE),0)","v":1},"UN",{"$f":"VLOOKUP($C35,Orçamento!A37:H296,8,FALSE)","v":2900.12},{"$f":"VLOOKUP($C35,Orçamento!A37:I296,9,FALSE)","v":2900.12},{"$f":"VLOOKUP($C35,Orçamento!A37:G296,7,FALSE)","v":0.13730000000000001},1.1122000000000001,null,"",null,""]
[{"$f":"'[1]Identificação-TCE'!$A$13","v":1},{"$f":"IF(AND(G36<>\"\",H36>0,I36<>\"\",J36<>0,K36<>0),COUNT($B$11:B35)+1,\"\")","v":25},{"$f":"Orçamento!A38","v":"5.4"},"MERCADO","COT 01","2022-02-11",{"$f":"VLOOKUP($C36,Orçamento!A38:C296,3,FALSE)","v":"EA05"},{"$f":"IFERROR(VLOOKUP($C36,Orçamento!A38:E296,5,FALSE),0)","v":5},"UN",{"$f":"VLOOKUP($C36,Orçamento!A38:H297,8,FALSE)","v":3070.71},{"$f":"VLOOKUP($C36,Orçamento!A38:I297,9,FALSE)","v":15353.55},{"$f":"VLOOKUP($C36,Orçamento!A38:G297,7,FALSE)","v":0.13730000000000001},1.1122000000000001,null,"",null,""]
[{"$f":"'[1]Identificação-TCE'!$A$13","v":1},{"$f":"IF(AND(G37<>\"\",H37>0,I37<>\"\",J37<>0,K37<>0),COUNT($B$11:B36)+1,\"\")","v":26},{"$f":"Orçamento!A39","v":"5.5"},"MERCADO","COT 01","2022-02-11",{"$f":"VLOOKUP($C37,Orçamento!A39:C297,3,FALSE)","v":"EA09"},{"$f":"IFERROR(VLOOKUP($C37,Orçamento!A39:E297,5,FALSE),0)","v":3},"UN",{"$f":"VLOOKUP($C37,Orçamento!A39:H298,8,FALSE)","v":5004.12},{"$f":"VLOOKUP($C37,Orçamento!A39:I298,9,FALSE)","v":15012.36},{"$f":"VLOOKUP($C37,Orçamento!A39:G298,7,FALSE)","v":0.13730000000000001},1.1122000000000001,null,"",null,""]
[{"$f":"'[1]Identificação-TCE'!$A$13","v":1},{"$f":"IF(AND(G38<>\"\",H38>0,I38<>\"\",J38<>0,K38<>0),COUNT($B$11:B37)+1,\"\")","v":27},{"$f":"Orçamento!A40","v":"5.6"},"MERCADO","COT 01","2022-02-11",{"$f":"VLOOKUP($C38,Orçamento!A40:C298,3,FALSE)","v":"EA11"},{"$f":"IFERROR(VLOOKUP($C38,Orçamento!A40:E298,5,FALSE),0)","v":4},"UN",{"$f":"VLOOKUP($C38,Orçamento!A40:H299,8,FALSE)","v":5459.04},{"$f":"VLOOKUP($C38,Orçamento!A40:I299,9,FALSE)","v":21836.16},{"$f":"VLOOKUP($C38,Orçamento!A40:G299,7,FALSE)","v":0.13730000000000001},1.1122000000000001,null,"",null,""]
[{"$f":"'[1]Identificação-TCE'!$A$13","v":1},{"$f":"IF(AND(G39<>\"\",H39>0,I39<>\"\",J39<>0,K39<>0),COUNT($B$11:B38)+1,\"\")","v":28},{"$f":"Orçamento!A41","v":"5.7"},"MERCADO","COT 01","2022-02-11",{"$f":"VLOOKUP($C39,Orçamento!A41:C299,3,FALSE)","v":"EA12"},{"$f":"IFERROR(VLOOKUP($C39,Orçamento!A41:E299,5,FALSE),0)","v":5},"UN",{"$f":"VLOOKUP($C39,Orçamento!A41:H300,8,FALSE)","v":10576.89},{"$f":"VLOOKUP($C39,Orçamento!A41:I300,9,FALSE)","v":52884.45},{"$f":"VLOOKUP($C39,Orçamento!A41:G300,7,FALSE)","v":0.13730000000000001},1.1122000000000001,null,"",null,""]
[{"$f":"'[1]Identificação-TCE'!$A$13","v":1},{"$f":"IF(AND(G40<>\"\",H40>0,I40<>\"\",J40<>0,K40<>0),COUNT($B$11:B39)+1,\"\")","v":29},{"$f":"Orçamento!A42","v":"5.8"},"MERCADO","COT 01","2022-02-11",{"$f":"VLOOKUP($C40,Orçamento!A42:C300,3,FALSE)","v":"EA13"},{"$f":"IFERROR(VLOOKUP($C40,Orçamento!A42:E300,5,FALSE),0)","v":2},"UN",{"$f":"VLOOKUP($C40,Orçamento!A42:H301,8,FALSE)","v":5629.64},{"$f":"VLOOKUP($C40,Orçamento!A42:I301,9,FALSE)","v":11259.28},{"$f":"VLOOKUP($C40,Orçamento!A42:G301,7,FALSE)","v":0.13730000000000001},1.1122000000000001,null,"",null,""]
[{"$f":"'[1]Identificação-TCE'!$A$13","v":1},{"$f":"IF(AND(G41<>\"\",H41>0,I41<>\"\",J41<>0,K41<>0),COUNT($B$11:B40)+1,\"\")","v":30},{"$f":"Orçamento!A43","v":"5.9"},"MERCADO","COT 01","2022-02-11",{"$f":"VLOOKUP($C41,Orçamento!A43:C301,3,FALSE)","v":"EA15"},{"$f":"IFERROR(VLOOKUP($C41,Orçamento!A43:E301,5,FALSE),0)","v":7},"UN",{"$f":"VLOOKUP($C41,Orçamento!A43:H302,8,FALSE)","v":5192.62},{"$f":"VLOOKUP($C41,Orçamento!A43:I302,9,FALSE)","v":36348.339999999997},{"$f":"VLOOKUP($C41,Orçamento!A43:G302,7,FALSE)","v":0.13730000000000001},1.1122000000000001,null,"",null,""]
[{"$f":"'[1]Identificação-TCE'!$A$13","v":1},{"$f":"IF(AND(G42<>\"\",H42>0,I42<>\"\",J42<>0,K42<>0),COUNT($B$11:B41)+1,\"\")","v":31},{"$f":"Orçamento!A44","v":"5.10"},"MERCADO","COT 01","2022-02-11",{"$f":"VLOOKUP($C42,Orçamento!A44:C302,3,FALSE)","v":"EA16"},{"$f":"IFERROR(VLOOKUP($C42,Orçamento!A44:E302,5,FALSE),0)","v":1},"UN",{"$f":"VLOOKUP($C42,Orçamento!A44:H303,8,FALSE)","v":15051.03},{"$f":"VLOOKUP($C42,Orçamento!A44:I303,9,FALSE)","v":15051.03},{"$f":"VLOOKUP($C42,Orçamento!A44:G303,7,FALSE)","v":0.13730000000000001},1.1122000000000001,null,"",null,""]
[{"$f":"'[1]Identificação-TCE'!$A$13","v":1},{"$f":"IF(AND(G43<>\"\",H43>0,I43<>\"\",J43<>0,K43<>0),COUNT($B$11:B42)+1,\"\")","v":32},{"$f":"Orçamento!A45","v":"5.11"},"MERCADO","COT 110","2022-02-11",{"$f":"VLOOKUP($C43,Orçamento!A45:C303,3,FALSE)","v":"EA18   "},{"$f":"IFERROR(VLOOKUP($C43,Orçamento!A45:E303,5,FALSE),0)","v":1},"UN",{"$f":"VLOOKUP($C43,Orçamento!A45:H304,8,FALSE)","v":23655.84},{"$f":"VLOOKUP($C43,Orçamento!A45:I304,9,FALSE)","v":23655.84},{"$f":"VLOOKUP($C43,Orçamento!A45:G304,7,FALSE)","v":0.13730000000000001},1.1122000000000001,null,"",null,""]
[{"$f":"'[1]Identificação-TCE'!$A$13","v":1},{"$f":"IF(AND(G44<>\"\",H44>0,I44<>\"\",J44<>0,K44<>0),COUNT($B$11:B43)+1,\"\")","v":33},{"$f":"Orçamento!A46","v":"5.12"},"CCU","CPUE 56","2022-02-11",{"$f":"VLOOKUP($C44,Orçamento!A46:C304,3,FALSE)","v":"PM01 - 1 FOLHA DE ABRIR 0,70 X 1,40 M"},{"$f":"IFERROR(VLOOKUP($C44,Orçamento!A46:E304,5,FALSE),0)","v":3},"UN",{"$f":"VLOOKUP($C44,Orçamento!A46:H305,8,FALSE)","v":1170},{"$f":"VLOOKUP($C44,Orçamento!A46:I305,9,FALSE)","v":3510},{"$f":"VLOOKUP($C44,Orçamento!A46:G305,7,FALSE)","v":0.22159999999999999},1.1122000000000001,null,"",null,""]
[{"$f":"'[1]Identificação-TCE'!$A$13","v":1},{"$f":"IF(AND(G45<>\"\",H45>0,I45<>\"\",J45<>0,K45<>0),COUNT($B$11:B44)+1,\"\")","v":34},{"$f":"Orçamento!A47","v":"5.13"},"SINAPI","SINAPI 100687","2022-02-11",{"$f":"VLOOKUP($C45,Orçamento!A47:C305,3,FALSE)","v":"KIT DE PORTA DE MADEIRA FRISADA, SEMI-OCA (LEVE OU MÉDIA), PADRÃO MÉDIO, 60X210CM, ESPESSURA DE 3,5CM, ITENS INCLUSOS: DOBRADIÇAS, MONTAGEM E INSTALAÇÃO DE BATENTE, FECHADURA COM EXECUÇÃO DO FURO - FORNECIMENTO E INSTALAÇÃO. AF_12/2019"},{"$f":"IFERROR(VLOOKUP($C45,Orçamento!A47:E305,5,FALSE),0)","v":4},"UN",{"$f":"VLOOKUP($C45,Orçamento!A47:H306,8,FALSE)","v":1306.0999999999999},{"$f":"VLOOKUP($C45,Orçamento!A47:I306,9,FALSE)","v":5224.3999999999996},{"$f":"VLOOKUP($C45,Orçamento!A47:G306,7,FALSE)","v":0.22159999999999999},1.1122000000000001,null,"",null,""]
[{"$f":"'[1]Identificação-TCE'!$A$13","v":1},{"$f":"IF(AND(G46<>\"\",H46>0,I46<>\"\",J46<>0,K46<>0),COUNT($B$11:B45)+1,\"\")","v":35},{"$f":"Orçamento!A48","v":"5.14"},"SINAPI","SINAPI 100689","2022-02-11",{"$f":"VLOOKUP($C46,Orçamento!A48:C306,3,FALSE)","v":"KIT DE PORTA DE MADEIRA FRISADA, SEMI-OCA (LEVE OU MÉDIA), PADRÃO MÉDIO, 80 X 210CM, ESPESSURA DE 3,5CM,ITENS INCLUSOS: DOBRADIÇAS, MONTAGEM E INSTALAÇÃO DE BATENTE, FECHADURA COM EXECUÇÃO DO FURO - FORNECIMENTO E INSTALAÇÃO. AF_12/2019"},{"$f":"IFERROR(VLOOKUP($C46,Orçamento!A48:E306,5,FALSE),0)","v":18},"UN",{"$f":"VLOOKUP($C46,Orçamento!A48:H307,8,FALSE)","v":1413.37},{"$f":"VLOOKUP($C46,Orçamento!A48:I307,9,FALSE)","v":25440.66},{"$f":"VLOOKUP($C46,Orçamento!A48:G307,7,FALSE)","v":0.22159999999999999},1.1122000000000001,null,"",null,""]
[{"$f":"'[1]Identificação-TCE'!$A$13","v":1},{"$f":"IF(AND(G47<>\"\",H47>0,I47<>\"\",J47<>0,K47<>0),COUNT($B$11:B46)+1,\"\")","v":36},{"$f":"Orçamento!A49","v":"5.15"},"CCU","CPUE 57","2022-02-11",{"$f":"VLOOKUP($C47,Orçamento!A49:C307,3,FALSE)","v":"PM04 - 1 FOLHA DE ABRIR 1,00x2,10 M"},{"$f":"IFERROR(VLOOKUP($C47,Orçamento!A49:E307,5,FALSE),0)","v":11},"UN",{"$f":"VLOOKUP($C47,Orçamento!A49:H308,8,FALSE)","v":1421.01},{"$f":"VLOOKUP($C47,Orçamento!A49:I308,9,FALSE)","v":15631.11},{"$f":"VLOOKUP($C47,Orçamento!A49:G308,7,FALSE)","v":0.22159999999999999},1.1122000000000001,null,"",null,""]
[{"$f":"'[1]Identificação-TCE'!$A$13","v":1},{"$f":"IF(AND(G48<>\"\",H48>0,I48<>\"\",J48<>0,K48<>0),COUNT($B$11:B47)+1,\"\")","v":37},{"$f":"Orçamento!A50","v":"5.16"},"CCU","CPUE 58","2022-02-11",{"$f":"VLOOKUP($C48,Orçamento!A50:C308,3,FALSE)","v":"PM06 - 2 FOLHAS DE ABRIR 1,60 X 2,10 M"},{"$f":"IFERROR(VLOOKUP($C48,Orçamento!A50:E308,5,FALSE),0)","v":2},"UN",{"$f":"VLOOKUP($C48,Orçamento!A50:H309,8,FALSE)","v":1678.48},{"$f":"VLOOKUP($C48,Orçamento!A50:I309,9,FALSE)","v":3356.96},{"$f":"VLOOKUP($C48,Orçamento!A50:G309,7,FALSE)","v":0.22159999999999999},1.1122000000000001,null,"",null,""]
[{"$f":"'[1]Identificação-TCE'!$A$13","v":1},{"$f":"IF(AND(G49<>\"\",H49>0,I49<>\"\",J49<>0,K49<>0),COUNT($B$11:B48)+1,\"\")","v":38},{"$f":"Orçamento!A51","v":"5.17"},"CCU","CPUE 59","2022-02-11",{"$f":"VLOOKUP($C49,Orçamento!A51:C309,3,FALSE)","v":"PM07 - 2 FOLHAS DE ABRIR 1,80 X 2,10 M"},{"$f":"IFERROR(VLOOKUP($C49,Orçamento!A51:E309,5,FALSE),0)","v":2},"UN",{"$f":"VLOOKUP($C49,Orçamento!A51:H310,8,FALSE)","v":1875.91},{"$f":"VLOOKUP($C49,Orçamento!A51:I310,9,FALSE)","v":3751.82},{"$f":"VLOOKUP($C49,Orçamento!A51:G310,7,FALSE)","v":0.22159999999999999},1.1122000000000001,null,"",null,""]
[{"$f":"'[1]Identificação-TCE'!$A$13","v":1},{"$f":"IF(AND(G50<>\"\",H50>0,I50<>\"\",J50<>0,K50<>0),COUNT($B$11:B49)+1,\"\")","v":39},{"$f":"Orçamento!A52","v":"5.18"},"CCU","CPUE 60","2022-02-11",{"$f":"VLOOKUP($C50,Orçamento!A52:C310,3,FALSE)","v":"PM08 - 2 FOHAS DE ABRIR 2,00 X 2,10 M"},{"$f":"IFERROR(VLOOKUP($C50,Orçamento!A52:E310,5,FALSE),0)","v":1},"UN",{"$f":"VLOOKUP($C50,Orçamento!A52:H311,8,FALSE)","v":1998.31},{"$f":"VLOOKUP($C50,Orçamento!A52:I311,9,FALSE)","v":1998.31},{"$f":"VLOOKUP($C50,Orçamento!A52:G311,7,FALSE)","v":0.22159999999999999},1.1122000000000001,null,"",null,""]
[{"$f":"'[1]Identificação-TCE'!$A$13","v":1},{"$f":"IF(AND(G51<>\"\",H51>0,I51<>\"\",J51<>0,K51<>0),COUNT($B$11:B50)+1,\"\")","v":40},{"$f":"Orçamento!A54","v":"6.1"},"CCU","CPUE 119","2022-02-11",{"$f":"VLOOKUP($C51,Orçamento!A54:C312,3,FALSE)","v":"IMPERMEABILIZAÇÃO DE SUPERFÍCIE COM EMULSÃO ASFÁLTICA, DUAS CAMADAS, COM APLICAÇÃO DE VÉU DE POLIÉSTER"},{"$f":"IFERROR(VLOOKUP($C51,Orçamento!A54:E312,5,FALSE),0)","v":40.36},{"$f":"VLOOKUP($C51,Orçamento!A54:D312,4,FALSE)","v":"M2"},{"$f":"VLOOKUP($C51,Orçamento!A54:H313,8,FALSE)","v":61.54},{"$f":"VLOOKUP($C51,Orçamento!A54:I313,9,FALSE)","v":2483.75},{"$f":"VLOOKUP($C51,Orçamento!A54:G313,7,FALSE)","v":0.22159999999999999},1.1122000000000001,null,"",null,""]
[{"$f":"'[1]Identificação-TCE'!$A$13","v":1},{"$f":"IF(AND(G52<>\"\",H52>0,I52<>\"\",J52<>0,K52<>0),COUNT($B$11:B51)+1,\"\")","v":41},{"$f":"Orçamento!A55","v":"6.2"},"SINAPI","SINAPI 101749","2022-02-11",{"$f":"VLOOKUP($C52,Orçamento!A55:C313,3,FALSE)","v":"PISO CIMENTADO, TRAÇO 1:3 (CIMENTO E AREIA), ACABAMENTO LISO, ESPESSURA 4,0 CM, PREPARO MECÂNICO DA ARGAMASSA. AF_09/2020"},{"$f":"IFERROR(VLOOKUP($C52,Orçamento!A55:E313,5,FALSE),0)","v":40.36},{"$f":"VLOOKUP($C52,Orçamento!A55:D313,4,FALSE)","v":"M2"},{"$f":"VLOOKUP($C52,Orçamento!A55:H314,8,FALSE)","v":57.34},{"$f":"VLOOKUP($C52,Orçamento!A55:I314,9,FALSE)","v":2314.2399999999998},{"$f":"VLOOKUP($C52,Orçamento!A55:G314,7,FALSE)","v":0.22159999999999999},1.1122000000000001,null,"",null,""]
[{"$f":"'[1]Identificação-TCE'!$A$13","v":1},{"$f":"IF(AND(G53<>\"\",H53>0,I53<>\"\",J53<>0,K53<>0),COUNT($B$11:B52)+1,\"\")","v":42},{"$f":"Orçamento!A56","v":"6.3"},"SINAPI","SINAPI 98567","2022-02-11",{"$f":"VLOOKUP($C53,Orçamento!A56:C314,3,FALSE)","v":"PROTEÇÃO MECÂNICA DE SUPERFÍCIE HORIZONTAL COM ARGAMASSA DE CIMENTO E AREIA, TRAÇO 1:3, E= 4CM. AF_06/2018"},{"$f":"IFERROR(VLOOKUP($C53,Orçamento!A56:E314,5,FALSE),0)","v":40.36},{"$f":"VLOOKUP($C53,Orçamento!A56:D314,4,FALSE)","v":"M2"},{"$f":"VLOOKUP($C53,Orçamento!A56:H315,8,FALSE)","v":69.2},{"$f":"VLOOKUP($C53,Orçamento!A56:I315,9,FALSE)","v":2792.91},{"$f":"VLOOKUP($C53,Orçamento!A56:G315,7,FALSE)","v":0.22159999999999999},1.1122000000000001,null,"",null,""]
[{"$f":"'[1]Identificação-TCE'!$A$13","v":1},{"$f":"IF(AND(G54<>\"\",H54>0,I54<>\"\",J54<>0,K54<>0),COUNT($B$11:B53)+1,\"\")","v":43},{"$f":"Orçamento!A57","v":"6.4"},"CCU","CPUE 36","2022-02-11",{"$f":"VLOOKUP($C54,Orçamento!A57:C315,3,FALSE)","v":"BASE DE DISTRIUBUIÇÃO DE CARGA SOBRE CONTRAPISO EXISTENTE, E=2CM"},{"$f":"IFERROR(VLOOKUP($C54,Orçamento!A57:E315,5,FALSE),0)","v":40.36},{"$f":"VLOOKUP($C54,Orçamento!A57:D315,4,FALSE)","v":"M2"},{"$f":"VLOOKUP($C54,Orçamento!A57:H316,8,FALSE)","v":147.22999999999999},{"$f":"VLOOKUP($C54,Orçamento!A57:I316,9,FALSE)","v":5942.2},{"$f":"VLOOKUP($C54,Orçamento!A57:G316,7,FALSE)","v":0.22159999999999999},1.1122000000000001,null,"",null,""]
[{"$f":"'[1]Identificação-TCE'!$A$13","v":1},{"$f":"IF(AND(G55<>\"\",H55>0,I55<>\"\",J55<>0,K55<>0),COUNT($B$11:B54)+1,\"\")","v":44},{"$f":"Orçamento!A58","v":"6.5"},"CCU","CPUE 35","2022-02-11",{"$f":"VLOOKUP($C55,Orçamento!A58:C316,3,FALSE)","v":"TRATAMENTO DE ESTRUTURAS DE CONCRETO ARMADO"},{"$f":"IFERROR(VLOOKUP($C55,Orçamento!A58:E316,5,FALSE),0)","v":24.95},{"$f":"VLOOKUP($C55,Orçamento!A58:D316,4,FALSE)","v":"M2"},{"$f":"VLOOKUP($C55,Orçamento!A58:H317,8,FALSE)","v":498.57},{"$f":"VLOOKUP($C55,Orçamento!A58:I317,9,FALSE)","v":12439.32},{"$f":"VLOOKUP($C55,Orçamento!A58:G317,7,FALSE)","v":0.22159999999999999},1.1122000000000001,null,"",null,""]
[{"$f":"'[1]Identificação-TCE'!$A$13","v":1},{"$f":"IF(AND(G56<>\"\",H56>0,I56<>\"\",J56<>0,K56<>0),COUNT($B$11:B55)+1,\"\")","v":45},{"$f":"Orçamento!A60","v":"7.1"},"SINAPI","SINAPI 87878","2022-02-11",{"$f":"VLOOKUP($C56,Orçamento!A60:C318,3,FALSE)","v":"CHAPISCO APLICADO EM ALVENARIAS E ESTRUTURAS DE CONCRETO INTERNAS, COM COLHER DE PEDREIRO. ARGAMASSA TRAÇO 1:3 COM PREPARO MANUAL. AF_06/2014"},{"$f":"IFERROR(VLOOKUP($C56,Orçamento!A60:E318,5,FALSE),0)","v":616.20000000000005},{"$f":"VLOOKUP($C56,Orçamento!A60:D318,4,FALSE)","v":"M2"},{"$f":"VLOOKUP($C56,Orçamento!A60:H319,8,FALSE)","v":5.0199999999999996},{"$f":"VLOOKUP($C56,Orçamento!A60:I319,9,FALSE)","v":3093.32},{"$f":"VLOOKUP($C56,Orçamento!A60:G319,7,FALSE)","v":0.22159999999999999},1.1122000000000001,null,"",null,""]
[{"$f":"'[1]Identificação-TCE'!$A$13","v":1},{"$f":"IF(AND(G57<>\"\",H57>0,I57<>\"\",J57<>0,K57<>0),COUNT($B$11:B56)+1,\"\")","v":46},{"$f":"Orçamento!A61","v":"7.2"},"SINAPI","SINAPI  87529","2022-02-11",{"$f":"VLOOKUP($C57,Orçamento!A61:C319,3,FALSE)","v":"MASSA ÚNICA, PARA RECEBIMENTO DE PINTURA EM ARGAMASSA TRAÇO 1:2:8, PREPARO MECÂNICO COM BETONEIRA 400L, APLICADA MANUALMENTE EM FACES INTERNAS DE PAREDES, ESPESSURA DE 20MM, COM EXECUÇÃO DE TALISCAS. AF_06/2014"},{"$f":"IFERROR(VLOOKUP($C57,Orçamento!A61:E319,5,FALSE),0)","v":616.20000000000005},{"$f":"VLOOKUP($C57,Orçamento!A61:D319,4,FALSE)","v":"M2"},{"$f":"VLOOKUP($C57,Orçamento!A61:H320,8,FALSE)","v":37.26},{"$f":"VLOOKUP($C57,Orçamento!A61:I320,9,FALSE)","v":22959.61},{"$f":"VLOOKUP($C57,Orçamento!A61:G320,7,FALSE)","v":0.22159999999999999},1.1122000000000001,null,"",null,""]
[{"$f":"'[1]Identificação-TCE'!$A$13","v":1},{"$f":"IF(AND(G58<>\"\",H58>0,I58<>\"\",J58<>0,K58<>0),COUNT($B$11:B57)+1,\"\")","v":47},{"$f":"Orçamento!A62","v":"7.3"},"SINAPI","SINAPI 87274","2022-02-11",{"$f":"VLOOKUP($C58,Orçamento!A62:C320,3,FALSE)","v":"REVESTIMENTO CERÂMICO PARA PAREDES INTERNAS COM PLACAS TIPO ESMALTADA EXTRA DE DIMENSÕES 33X45CM APLICADAS EM AMBIENTES DE ÁREA MENOR QUE 5M2 A MEIA ALTURA DAS PAREDES. AF_06/2014"},{"$f":"IFERROR(VLOOKUP($C58,Orçamento!A62:E320,5,FALSE),0)","v":757.83},{"$f":"VLOOKUP($C58,Orçamento!A62:D320,4,FALSE)","v":"M2"},{"$f":"VLOOKUP($C58,Orçamento!A62:H321,8,FALSE)","v":84.08},{"$f":"VLOOKUP($C58,Orçamento!A62:I321,9,FALSE)","v":63718.35},{"$f":"VLOOKUP($C58,Orçamento!A62:G321,7,FALSE)","v":0.22159999999999999},1.1122000000000001,null,"",null,""]
[{"$f":"'[1]Identificação-TCE'!$A$13","v":1},{"$f":"IF(AND(G59<>\"\",H59>0,I59<>\"\",J59<>0,K59<>0),COUNT($B$11:B58)+1,\"\")","v":48},{"$f":"Orçamento!A63","v":"7.4"},"SINAPI","SINAPI 39511","2022-02-11",{"$f":"VLOOKUP($C59,Orçamento!A63:C321,3,FALSE)","v":"FORRO DE FIBRA MINERAL EM PLACAS DE 625X625MM, E=15MM, BORDA RETA, COM PINTURA ANTIMOFO, APOIADO EM PERFIL DE AÇO GALVANIZADO COM 24MM DE BASE - INSTALADO"},{"$f":"IFERROR(VLOOKUP($C59,Orçamento!A63:E321,5,FALSE),0)","v":846.46},{"$f":"VLOOKUP($C59,Orçamento!A63:D321,4,FALSE)","v":"M2"},{"$f":"VLOOKUP($C59,Orçamento!A63:H322,8,FALSE)","v":131.99},{"$f":"VLOOKUP($C59,Orçamento!A63:I322,9,FALSE)","v":111724.26},{"$f":"VLOOKUP($C59,Orçamento!A63:G322,7,FALSE)","v":0.22159999999999999},1.1122000000000001,null,"",null,""]
[{"$f":"'[1]Identificação-TCE'!$A$13","v":1},{"$f":"IF(AND(G60<>\"\",H60>0,I60<>\"\",J60<>0,K60<>0),COUNT($B$11:B59)+1,\"\")","v":49},{"$f":"Orçamento!A64","v":"7.5"},"SINAPI","SINAPI 100717","2022-02-11",{"$f":"VLOOKUP($C60,Orçamento!A64:C322,3,FALSE)","v":"LIXAMENTO MANUAL EM SUPERFÍCIES METÁLICAS EM OBRA. AF_01/2020"},{"$f":"IFERROR(VLOOKUP($C60,Orçamento!A64:E322,5,FALSE),0)","v":172.56},{"$f":"VLOOKUP($C60,Orçamento!A64:D322,4,FALSE)","v":"M2"},{"$f":"VLOOKUP($C60,Orçamento!A64:H323,8,FALSE)","v":10.32},{"$f":"VLOOKUP($C60,Orçamento!A64:I323,9,FALSE)","v":1780.82},{"$f":"VLOOKUP($C60,Orçamento!A64:G323,7,FALSE)","v":0.22159999999999999},1.1122000000000001,null,"",null,""]
[{"$f":"'[1]Identificação-TCE'!$A$13","v":1},{"$f":"IF(AND(G61<>\"\",H61>0,I61<>\"\",J61<>0,K61<>0),COUNT($B$11:B60)+1,\"\")","v":50},{"$f":"Orçamento!A65","v":"7.6"},"SINAPI","SINAPI 100722","2022-02-11",{"$f":"VLOOKUP($C61,Orçamento!A65:C323,3,FALSE)","v":"PINTURA COM TINTA ALQUÍDICA DE FUNDO (TIPO ZARCÃO) APLICADA A ROLO OU PINCEL SOBRE SUPERFÍCIES METÁLICAS (EXCETO PERFIL) EXECUTADO EM OBRA (POR DEMÃO). AF_01/2020"},{"$f":"IFERROR(VLOOKUP($C61,Orçamento!A65:E323,5,FALSE),0)","v":172.56},{"$f":"VLOOKUP($C61,Orçamento!A65:D323,4,FALSE)","v":"M2"},{"$f":"VLOOKUP($C61,Orçamento!A65:H324,8,FALSE)","v":25.07},{"$f":"VLOOKUP($C61,Orçamento!A65:I324,9,FALSE)","v":4326.08},{"$f":"VLOOKUP($C61,Orçamento!A65:G324,7,FALSE)","v":0.22159999999999999},1.1122000000000001,null,"",null,""]
[{"$f":"'[1]Identificação-TCE'!$A$13","v":1},{"$f":"IF(AND(G62<>\"\",H62>0,I62<>\"\",J62<>0,K62<>0),COUNT($B$11:B61)+1,\"\")","v":51},{"$f":"Orçamento!A66","v":"7.7"},"SINAPI","SINAPI 100734","2022-02-11",{"$f":"VLOOKUP($C62,Orçamento!A66:C324,3,FALSE)","v":"PINTURA COM TINTA ACRÍLICA DE FUNDO APLICADA A ROLO OU PINCEL SOBRE SUPERFÍCIES METÁLICAS (EXCETO PERFIL) EXECUTADO EM OBRA (POR DEMÃO). AF_01/2020"},{"$f":"IFERROR(VLOOKUP($C62,Orçamento!A66:E324,5,FALSE),0)","v":172.56},{"$f":"VLOOKUP($C62,Orçamento!A66:D324,4,FALSE)","v":"M2"},{"$f":"VLOOKUP($C62,Orçamento!A66:H325,8,FALSE)","v":15.6},{"$f":"VLOOKUP($C62,Orçamento!A66:I325,9,FALSE)","v":2691.94},{"$f":"VLOOKUP($C62,Orçamento!A66:G325,7,FALSE)","v":0.22159999999999999},1.1122000000000001,null,"",null,""]
[{"$f":"'[1]Identificação-TCE'!$A$13","v":1},{"$f":"IF(AND(G63<>\"\",H63>0,I63<>\"\",J63<>0,K63<>0),COUNT($B$11:B62)+1,\"\")","v":52},{"$f":"Orçamento!A67","v":"7.8"},"SINAPI","SINAPI 102220","2022-02-11",{"$f":"VLOOKUP($C63,Orçamento!A67:C325,3,FALSE)","v":"PINTURA TINTA DE ACABAMENTO (PIGMENTADA) ESMALTE SINTÉTICO BRILHANTE EM MADEIRA, 2 DEMÃOS. AF_01/2021"},{"$f":"IFERROR(VLOOKUP($C63,Orçamento!A67:E325,5,FALSE),0)","v":242.55},{"$f":"VLOOKUP($C63,Orçamento!A67:D325,4,FALSE)","v":"M2"},{"$f":"VLOOKUP($C63,Orçamento!A67:H326,8,FALSE)","v":16.739999999999998},{"$f":"VLOOKUP($C63,Orçamento!A67:I326,9,FALSE)","v":4060.29},{"$f":"VLOOKUP($C63,Orçamento!A67:G326,7,FALSE)","v":0.22159999999999999},1.1122000000000001,null,"",null,""]
[{"$f":"'[1]Identificação-TCE'!$A$13","v":1},{"$f":"IF(AND(G64<>\"\",H64>0,I64<>\"\",J64<>0,K64<>0),COUNT($B$11:B63)+1,\"\")","v":53},{"$f":"Orçamento!A68","v":"7.9"},"SINAPI","SINAPI 88485","2022-02-11",{"$f":"VLOOKUP($C64,Orçamento!A68:C326,3,FALSE)","v":"APLICAÇÃO DE FUNDO SELADOR ACRÍLICO EM PAREDES, UMA DEMÃO. AF_06/2014"},{"$f":"IFERROR(VLOOKUP($C64,Orçamento!A68:E326,5,FALSE),0)","v":214.93},{"$f":"VLOOKUP($C64,Orçamento!A68:D326,4,FALSE)","v":"M2"},{"$f":"VLOOKUP($C64,Orçamento!A68:H327,8,FALSE)","v":2.81},{"$f":"VLOOKUP($C64,Orçamento!A68:I327,9,FALSE)","v":603.95000000000005},{"$f":"VLOOKUP($C64,Orçamento!A68:G327,7,FALSE)","v":0.22159999999999999},1.1122000000000001,null,"",null,""]
[{"$f":"'[1]Identificação-TCE'!$A$13","v":1},{"$f":"IF(AND(G65<>\"\",H65>0,I65<>\"\",J65<>0,K65<>0),COUNT($B$11:B64)+1,\"\")","v":54},{"$f":"Orçamento!A69","v":"7.10"},"SINAPI","SINAPI 88489","2022-02-11",{"$f":"VLOOKUP($C65,Orçamento!A69:C327,3,FALSE)","v":"APLICAÇÃO MANUAL DE PINTURA COM TINTA LÁTEX ACRÍLICA EM PAREDES, DUAS DEMÃOS. AF_06/2014"},{"$f":"IFERROR(VLOOKUP($C65,Orçamento!A69:E327,5,FALSE),0)","v":1765.7},{"$f":"VLOOKUP($C65,Orçamento!A69:D327,4,FALSE)","v":"M2"},{"$f":"VLOOKUP($C65,Orçamento!A69:H328,8,FALSE)","v":18.07},{"$f":"VLOOKUP($C65,Orçamento!A69:I328,9,FALSE)","v":31906.2},{"$f":"VLOOKUP($C65,Orçamento!A69:G328,7,FALSE)","v":0.22159999999999999},1.1122000000000001,null,"",null,""]
[{"$f":"'[1]Identificação-TCE'!$A$13","v":1},{"$f":"IF(AND(G66<>\"\",H66>0,I66<>\"\",J66<>0,K66<>0),COUNT($B$11:B65)+1,\"\")","v":55},{"$f":"Orçamento!A70","v":"7.11"},"SINAPI","SINAPI 88495","2022-02-11",{"$f":"VLOOKUP($C66,Orçamento!A70:C328,3,FALSE)","v":"APLICAÇÃO E LIXAMENTO DE MASSA LÁTEX EM PAREDES, UMA DEMÃO. AF_06/2014"},{"$f":"IFERROR(VLOOKUP($C66,Orçamento!A70:E328,5,FALSE),0)","v":384.46},{"$f":"VLOOKUP($C66,Orçamento!A70:D328,4,FALSE)","v":"M2"},{"$f":"VLOOKUP($C66,Orçamento!A70:H329,8,FALSE)","v":14.49},{"$f":"VLOOKUP($C66,Orçamento!A70:I329,9,FALSE)","v":5570.83},{"$f":"VLOOKUP($C66,Orçamento!A70:G329,7,FALSE)","v":0.22159999999999999},1.1122000000000001,null,"",null,""]
[{"$f":"'[1]Identificação-TCE'!$A$13","v":1},{"$f":"IF(AND(G67<>\"\",H67>0,I67<>\"\",J67<>0,K67<>0),COUNT($B$11:B66)+1,\"\")","v":56},{"$f":"Orçamento!A72","v":"8.1"},"SINAPI","SINAPI 6076","2022-02-11",{"$f":"VLOOKUP($C67,Orçamento!A72:C330,3,FALSE)","v":"SAIBRO PARA ARGAMASSA (COLETADO NO COMÉRCIO)"},{"$f":"IFERROR(VLOOKUP($C67,Orçamento!A72:E330,5,FALSE),0)","v":107.19},{"$f":"VLOOKUP($C67,Orçamento!A72:D330,4,FALSE)","v":"M3"},{"$f":"VLOOKUP($C67,Orçamento!A72:H331,8,FALSE)","v":73.81},{"$f":"VLOOKUP($C67,Orçamento!A72:I331,9,FALSE)","v":7911.69},{"$f":"VLOOKUP($C67,Orçamento!A72:G331,7,FALSE)","v":0.22159999999999999},1.1122000000000001,null,"",null,""]
[{"$f":"'[1]Identificação-TCE'!$A$13","v":1},{"$f":"IF(AND(G68<>\"\",H68>0,I68<>\"\",J68<>0,K68<>0),COUNT($B$11:B67)+1,\"\")","v":57},{"$f":"Orçamento!A73","v":"8.2"},"SINAPI","SINAPI 87620","2022-02-11",{"$f":"VLOOKUP($C68,Orçamento!A73:C331,3,FALSE)","v":"CONTRAPISO EM ARGAMASSA TRAÇO 1:4 (CIMENTO E AREIA), PREPARO MECÂNICO COM BETONEIRA 400L, APLICADO EM ÁREAS SECAS SOBRE LAJE, ADERIDO, ESPESSURA 2CM. AF_06/2014"},{"$f":"IFERROR(VLOOKUP($C68,Orçamento!A73:E331,5,FALSE),0)","v":975.2},{"$f":"VLOOKUP($C68,Orçamento!A73:D331,4,FALSE)","v":"M2"},{"$f":"VLOOKUP($C68,Orçamento!A73:H332,8,FALSE)","v":33.18},{"$f":"VLOOKUP($C68,Orçamento!A73:I332,9,FALSE)","v":32357.14},{"$f":"VLOOKUP($C68,Orçamento!A73:G332,7,FALSE)","v":0.22159999999999999},1.1122000000000001,null,"",null,""]
[{"$f":"'[1]Identificação-TCE'!$A$13","v":1},{"$f":"IF(AND(G69<>\"\",H69>0,I69<>\"\",J69<>0,K69<>0),COUNT($B$11:B68)+1,\"\")","v":58},{"$f":"Orçamento!A74","v":"8.3"},"CCU","CPUE 106","2022-02-11",{"$f":"VLOOKUP($C69,Orçamento!A74:C332,3,FALSE)","v":"CONTRAPISO DE CONCRETO ARMADO, E=6CM"},{"$f":"IFERROR(VLOOKUP($C69,Orçamento!A74:E332,5,FALSE),0)","v":214.38},{"$f":"VLOOKUP($C69,Orçamento!A74:D332,4,FALSE)","v":"M2"},{"$f":"VLOOKUP($C69,Orçamento!A74:H333,8,FALSE)","v":138.22},{"$f":"VLOOKUP($C69,Orçamento!A74:I333,9,FALSE)","v":29631.599999999999},{"$f":"VLOOKUP($C69,Orçamento!A74:G333,7,FALSE)","v":0.22159999999999999},1.1122000000000001,null,"",null,""]
[{"$f":"'[1]Identificação-TCE'!$A$13","v":1},{"$f":"IF(AND(G70<>\"\",H70>0,I70<>\"\",J70<>0,K70<>0),COUNT($B$11:B69)+1,\"\")","v":59},{"$f":"Orçamento!A75","v":"8.4"},"SINAPI","SINAPI 87262","2022-02-11",{"$f":"VLOOKUP($C70,Orçamento!A75:C333,3,FALSE)","v":"REVESTIMENTO CERÂMICO PARA PISO COM PLACAS TIPO PORCELANATO DE DIMENSÕES 60X60CM APLICADA EM AMBIENTES DE ÁREA ENTRE 5M2 E 10M2. AF_06/2014"},{"$f":"IFERROR(VLOOKUP($C70,Orçamento!A75:E333,5,FALSE),0)","v":451.99},{"$f":"VLOOKUP($C70,Orçamento!A75:D333,4,FALSE)","v":"M2"},{"$f":"VLOOKUP($C70,Orçamento!A75:H334,8,FALSE)","v":167.93},{"$f":"VLOOKUP($C70,Orçamento!A75:I334,9,FALSE)","v":75902.679999999993},{"$f":"VLOOKUP($C70,Orçamento!A75:G334,7,FALSE)","v":0.22159999999999999},1.1122000000000001,null,"",null,""]
[{"$f":"'[1]Identificação-TCE'!$A$13","v":1},{"$f":"IF(AND(G71<>\"\",H71>0,I71<>\"\",J71<>0,K71<>0),COUNT($B$11:B70)+1,\"\")","v":60},{"$f":"Orçamento!A76","v":"8.5"},"CCU","CPUE 114","2022-02-11",{"$f":"VLOOKUP($C71,Orçamento!A76:C334,3,FALSE)","v":"PISO DE PORCELANATO TÉCNICO 80X80CM - FORNECIMENTO E INSTALAÇÃO"},{"$f":"IFERROR(VLOOKUP($C71,Orçamento!A76:E334,5,FALSE),0)","v":487.82},{"$f":"VLOOKUP($C71,Orçamento!A76:D334,4,FALSE)","v":"M2"},{"$f":"VLOOKUP($C71,Orçamento!A76:H335,8,FALSE)","v":184.77},{"$f":"VLOOKUP($C71,Orçamento!A76:I335,9,FALSE)","v":90134.5},{"$f":"VLOOKUP($C71,Orçamento!A76:G335,7,FALSE)","v":0.22159999999999999},1.1122000000000001,null,"",null,""]
[{"$f":"'[1]Identificação-TCE'!$A$13","v":1},{"$f":"IF(AND(G72<>\"\",H72>0,I72<>\"\",J72<>0,K72<>0),COUNT($B$11:B71)+1,\"\")","v":61},{"$f":"Orçamento!A77","v":"8.6"},"SINAPI","SINAPI 101727","2022-02-11",{"$f":"VLOOKUP($C72,Orçamento!A77:C335,3,FALSE)","v":"PISO VINÍLICO SEMI FLEXÍVEL EM PLACAS, PADRÃO LISO, ESPESSURA 3,2MM, FIXADO COM COLA. AF_09/2020"},{"$f":"IFERROR(VLOOKUP($C72,Orçamento!A77:E335,5,FALSE),0)","v":192.91},{"$f":"VLOOKUP($C72,Orçamento!A77:D335,4,FALSE)","v":"M2"},{"$f":"VLOOKUP($C72,Orçamento!A77:H336,8,FALSE)","v":199.4},{"$f":"VLOOKUP($C72,Orçamento!A77:I336,9,FALSE)","v":38466.25},{"$f":"VLOOKUP($C72,Orçamento!A77:G336,7,FALSE)","v":0.22159999999999999},1.1122000000000001,null,"",null,""]
[{"$f":"'[1]Identificação-TCE'!$A$13","v":1},{"$f":"IF(AND(G73<>\"\",H73>0,I73<>\"\",J73<>0,K73<>0),COUNT($B$11:B72)+1,\"\")","v":62},{"$f":"Orçamento!A78","v":"8.7"},"SINAPI","SINAPI 98688","2022-02-11",{"$f":"VLOOKUP($C73,Orçamento!A78:C336,3,FALSE)","v":"RODAPÉ EM POLIESTIRENO, ALTURA 5CM. AF_09/2020"},{"$f":"IFERROR(VLOOKUP($C73,Orçamento!A78:E336,5,FALSE),0)","v":618.22},{"$f":"VLOOKUP($C73,Orçamento!A78:D336,4,FALSE)","v":"M"},{"$f":"VLOOKUP($C73,Orçamento!A78:H337,8,FALSE)","v":62.47},{"$f":"VLOOKUP($C73,Orçamento!A78:I337,9,FALSE)","v":38620.199999999997},{"$f":"VLOOKUP($C73,Orçamento!A78:G337,7,FALSE)","v":0.22159999999999999},1.1122000000000001,null,"",null,""]
[{"$f":"'[1]Identificação-TCE'!$A$13","v":1},{"$f":"IF(AND(G74<>\"\",H74>0,I74<>\"\",J74<>0,K74<>0),COUNT($B$11:B73)+1,\"\")","v":63},{"$f":"Orçamento!A79","v":"8.8"},"CCU","CPUE 113","2022-02-11",{"$f":"VLOOKUP($C74,Orçamento!A79:C337,3,FALSE)","v":"SOLEIRA EM BASALTO - FORNECIMENTO E INSTALAÇÃO"},{"$f":"IFERROR(VLOOKUP($C74,Orçamento!A79:E337,5,FALSE),0)","v":32.85},{"$f":"VLOOKUP($C74,Orçamento!A79:D337,4,FALSE)","v":"M"},{"$f":"VLOOKUP($C74,Orçamento!A79:H338,8,FALSE)","v":109.25},{"$f":"VLOOKUP($C74,Orçamento!A79:I338,9,FALSE)","v":3588.86},{"$f":"VLOOKUP($C74,Orçamento!A79:G338,7,FALSE)","v":0.22159999999999999},1.1122000000000001,null,"",null,""]
[{"$f":"'[1]Identificação-TCE'!$A$13","v":1},{"$f":"IF(AND(G75<>\"\",H75>0,I75<>\"\",J75<>0,K75<>0),COUNT($B$11:B74)+1,\"\")","v":64},{"$f":"Orçamento!A80","v":"8.9"},"CCU","CPUE 112","2022-02-11",{"$f":"VLOOKUP($C75,Orçamento!A80:C338,3,FALSE)","v":"PEITORIL DE BASALTO EM JANELAS - FORNECIMENTO E INSTALAÇÃO"},{"$f":"IFERROR(VLOOKUP($C75,Orçamento!A80:E338,5,FALSE),0)","v":75.05},{"$f":"VLOOKUP($C75,Orçamento!A80:D338,4,FALSE)","v":"M"},{"$f":"VLOOKUP($C75,Orçamento!A80:H339,8,FALSE)","v":121.53},{"$f":"VLOOKUP($C75,Orçamento!A80:I339,9,FALSE)","v":9120.83},{"$f":"VLOOKUP($C75,Orçamento!A80:G339,7,FALSE)","v":0.22159999999999999},1.1122000000000001,null,"",null,""]
[{"$f":"'[1]Identificação-TCE'!$A$13","v":1},{"$f":"IF(AND(G76<>\"\",H76>0,I76<>\"\",J76<>0,K76<>0),COUNT($B$11:B75)+1,\"\")","v":65},{"$f":"Orçamento!A82","v":"9.1"},"SINAPI","SINAPI 97634","2022-02-11",{"$f":"VLOOKUP($C76,Orçamento!A82:C340,3,FALSE)","v":"DEMOLIÇÃO DE REVESTIMENTO CERÂMICO, DE FORMA MECANIZADA COM MARTELETE, SEM REAPROVEITAMENTO. AF_12/2017"},{"$f":"IFERROR(VLOOKUP($C76,Orçamento!A82:E340,5,FALSE),0)","v":13.5},{"$f":"VLOOKUP($C76,Orçamento!A82:D340,4,FALSE)","v":"M2"},{"$f":"VLOOKUP($C76,Orçamento!A82:H341,8,FALSE)","v":13.71},{"$f":"VLOOKUP($C76,Orçamento!A82:I341,9,FALSE)","v":185.09},{"$f":"VLOOKUP($C76,Orçamento!A82:G341,7,FALSE)","v":0.22159999999999999},1.1122000000000001,null,"",null,""]
[{"$f":"'[1]Identificação-TCE'!$A$13","v":1},{"$f":"IF(AND(G77<>\"\",H77>0,I77<>\"\",J77<>0,K77<>0),COUNT($B$11:B76)+1,\"\")","v":66},{"$f":"Orçamento!A83","v":"9.2"},"CCU","CPUE 107","2022-02-11",{"$f":"VLOOKUP($C77,Orçamento!A83:C341,3,FALSE)","v":"PISO PODOTÁTIL ALERTA/DIRECIONAL 40X40CM"},{"$f":"IFERROR(VLOOKUP($C77,Orçamento!A83:E341,5,FALSE),0)","v":30},{"$f":"VLOOKUP($C77,Orçamento!A83:D341,4,FALSE)","v":"M"},{"$f":"VLOOKUP($C77,Orçamento!A83:H342,8,FALSE)","v":41.4},{"$f":"VLOOKUP($C77,Orçamento!A83:I342,9,FALSE)","v":1242},{"$f":"VLOOKUP($C77,Orçamento!A83:G342,7,FALSE)","v":0.22159999999999999},1.1122000000000001,null,"",null,""]
[{"$f":"'[1]Identificação-TCE'!$A$13","v":1},{"$f":"IF(AND(G78<>\"\",H78>0,I78<>\"\",J78<>0,K78<>0),COUNT($B$11:B77)+1,\"\")","v":67},{"$f":"Orçamento!A85","v":"10.1"},"CCU","CPUE 61","2022-02-11",{"$f":"VLOOKUP($C78,Orçamento!A85:C343,3,FALSE)","v":" QGBT - ARMÁRIO AUTO PORTANTE COM BASE SOLEIRA E OLHAIS DE IÇAMENTO COM PORTA INTERNA METÁLICA. 1600X700X350, DISJ. GERAL CX. MOLDADA 35KA/380V – 600 A 01PÇ MULTIMEDIDOR DIGITAL DE GRANDEZAS ELETRICAS DISJUNTORES PARCIAIS EM CX. MOLDADA 18KA/380V CFE. PROJETO.  COM INSTALAÇÃO."},{"$f":"IFERROR(VLOOKUP($C78,Orçamento!A85:E343,5,FALSE),0)","v":1},"UN",{"$f":"VLOOKUP($C78,Orçamento!A85:H344,8,FALSE)","v":34364.339999999997},{"$f":"VLOOKUP($C78,Orçamento!A85:I344,9,FALSE)","v":34364.339999999997},{"$f":"VLOOKUP($C78,Orçamento!A85:G344,7,FALSE)","v":0.22159999999999999},1.1122000000000001,null,"",null,""]
[{"$f":"'[1]Identificação-TCE'!$A$13","v":1},{"$f":"IF(AND(G79<>\"\",H79>0,I79<>\"\",J79<>0,K79<>0),COUNT($B$11:B78)+1,\"\")","v":68},{"$f":"Orçamento!A86","v":"10.2"},"CCU","CPUE 63","2022-02-11",{"$f":"VLOOKUP($C79,Orçamento!A86:C344,3,FALSE)","v":"CD-Q2 - QUADRO DE FORÇA DE SOBREPOR MONTADO EM CAIXA DE COMANDO COM DIMENSÕES MÍNIMAS DE 1800X500X150MM, 66 LUGARES. COM INSTALAÇÃO."},{"$f":"IFERROR(VLOOKUP($C79,Orçamento!A86:E344,5,FALSE),0)","v":1},"UN",{"$f":"VLOOKUP($C79,Orçamento!A86:H345,8,FALSE)","v":6804.32},{"$f":"VLOOKUP($C79,Orçamento!A86:I345,9,FALSE)","v":6804.32},{"$f":"VLOOKUP($C79,Orçamento!A86:G345,7,FALSE)","v":0.22159999999999999},1.1122000000000001,null,"",null,""]
[{"$f":"'[1]Identificação-TCE'!$A$13","v":1},{"$f":"IF(AND(G80<>\"\",H80>0,I80<>\"\",J80<>0,K80<>0),COUNT($B$11:B79)+1,\"\")","v":69},{"$f":"Orçamento!A87","v":"10.3"},"CCU","CPUE 64","2022-02-11",{"$f":"VLOOKUP($C80,Orçamento!A87:C345,3,FALSE)","v":"CD-Q3 - QUADRO DE FORÇA DE SOBREPOR MONTADO EM CAIXA DE COMANDO COM DIMENSÕES MÍNIMAS DE 1800X500X150MM, 66 LUGARES. COM INSTALAÇÃO."},{"$f":"IFERROR(VLOOKUP($C80,Orçamento!A87:E345,5,FALSE),0)","v":1},"UN",{"$f":"VLOOKUP($C80,Orçamento!A87:H346,8,FALSE)","v":6613.82},{"$f":"VLOOKUP($C80,Orçamento!A87:I346,9,FALSE)","v":6613.82},{"$f":"VLOOKUP($C80,Orçamento!A87:G346,7,FALSE)","v":0.22159999999999999},1.1122000000000001,null,"",null,""]
[{"$f":"'[1]Identificação-TCE'!$A$13","v":1},{"$f":"IF(AND(G81<>\"\",H81>0,I81<>\"\",J81<>0,K81<>0),COUNT($B$11:B80)+1,\"\")","v":70},{"$f":"Orçamento!A88","v":"10.4"},"CCU","CPUE 67","2022-02-11",{"$f":"VLOOKUP($C81,Orçamento!A88:C346,3,FALSE)","v":"QF EMERGENCIA - QUADRO DE FORÇA DE SOBREPOR MONTADO EM CAIXA DE COMANDO COM DIMENSÕES MÍNIMAS DE 800X500X150MM. COM INSTALAÇÃO."},{"$f":"IFERROR(VLOOKUP($C81,Orçamento!A88:E346,5,FALSE),0)","v":1},"UN",{"$f":"VLOOKUP($C81,Orçamento!A88:H347,8,FALSE)","v":3966.28},{"$f":"VLOOKUP($C81,Orçamento!A88:I347,9,FALSE)","v":3966.28},{"$f":"VLOOKUP($C81,Orçamento!A88:G347,7,FALSE)","v":0.22159999999999999},1.1122000000000001,null,"",null,""]
[{"$f":"'[1]Identificação-TCE'!$A$13","v":1},{"$f":"IF(AND(G82<>\"\",H82>0,I82<>\"\",J82<>0,K82<>0),COUNT($B$11:B81)+1,\"\")","v":71},{"$f":"Orçamento!A89","v":"10.5"},"SINAPI","SINAPI 92992","2022-02-11",{"$f":"VLOOKUP($C82,Orçamento!A89:C347,3,FALSE)","v":"CABO DE COBRE FLEXÍVEL ISOLADO, 95MM2, ANTI-CHAMA 0,6/1,0kV, PARA DISTRIBUIÇÃO - FORNECIMENTO E INSTALAÇÃO. AF_12/2015"},{"$f":"IFERROR(VLOOKUP($C82,Orçamento!A89:E347,5,FALSE),0)","v":440},{"$f":"VLOOKUP($C82,Orçamento!A89:D347,4,FALSE)","v":"M"},{"$f":"VLOOKUP($C82,Orçamento!A89:H348,8,FALSE)","v":124.04},{"$f":"VLOOKUP($C82,Orçamento!A89:I348,9,FALSE)","v":54577.599999999999},{"$f":"VLOOKUP($C82,Orçamento!A89:G348,7,FALSE)","v":0.22159999999999999},1.1122000000000001,null,"",null,""]
[{"$f":"'[1]Identificação-TCE'!$A$13","v":1},{"$f":"IF(AND(G83<>\"\",H83>0,I83<>\"\",J83<>0,K83<>0),COUNT($B$11:B82)+1,\"\")","v":72},{"$f":"Orçamento!A90","v":"10.6"},"SINAPI","SINAPI 92988","2022-02-11",{"$f":"VLOOKUP($C83,Orçamento!A90:C348,3,FALSE)","v":"CABO DE COBRE FLEXÍVEL ISOLADO, 50MM2, ANTI-CHAMA 0,6/1,0kV, PARA DISTRIBUIÇÃO - FORNECIMENTO E INSTALAÇÃO. AF_12/2015"},{"$f":"IFERROR(VLOOKUP($C83,Orçamento!A90:E348,5,FALSE),0)","v":110},{"$f":"VLOOKUP($C83,Orçamento!A90:D348,4,FALSE)","v":"M"},{"$f":"VLOOKUP($C83,Orçamento!A90:H349,8,FALSE)","v":68.209999999999994},{"$f":"VLOOKUP($C83,Orçamento!A90:I349,9,FALSE)","v":7503.1},{"$f":"VLOOKUP($C83,Orçamento!A90:G349,7,FALSE)","v":0.22159999999999999},1.1122000000000001,null,"",null,""]
[{"$f":"'[1]Identificação-TCE'!$A$13","v":1},{"$f":"IF(AND(G84<>\"\",H84>0,I84<>\"\",J84<>0,K84<>0),COUNT($B$11:B83)+1,\"\")","v":73},{"$f":"Orçamento!A91","v":"10.7"},"SINAPI","SINAPI 92986","2022-02-11",{"$f":"VLOOKUP($C84,Orçamento!A91:C349,3,FALSE)","v":"CABO DE COBRE FLEXÍVEL ISOLADO, 35MM2, ANTI-CHAMA 0,6/1,0kV, PARA DISTRIBUIÇÃO - FORNECIMENTO E INSTALAÇÃO. AF_12/2015"},{"$f":"IFERROR(VLOOKUP($C84,Orçamento!A91:E349,5,FALSE),0)","v":280},{"$f":"VLOOKUP($C84,Orçamento!A91:D349,4,FALSE)","v":"M"},{"$f":"VLOOKUP($C84,Orçamento!A91:H350,8,FALSE)","v":48.44},{"$f":"VLOOKUP($C84,Orçamento!A91:I350,9,FALSE)","v":13563.2},{"$f":"VLOOKUP($C84,Orçamento!A91:G350,7,FALSE)","v":0.22159999999999999},1.1122000000000001,null,"",null,""]
[{"$f":"'[1]Identificação-TCE'!$A$13","v":1},{"$f":"IF(AND(G85<>\"\",H85>0,I85<>\"\",J85<>0,K85<>0),COUNT($B$11:B84)+1,\"\")","v":74},{"$f":"Orçamento!A92","v":"10.8"},"SINAPI","SINAPI 92984","2022-02-11",{"$f":"VLOOKUP($C85,Orçamento!A92:C350,3,FALSE)","v":"CABO DE COBRE FLEXÍVEL ISOLADO, 25MM2, ANTI-CHAMA 0,6/1,0kV, PARA DISTRIBUIÇÃO - FORNECIMENTO E INSTALAÇÃO. AF_12/2015"},{"$f":"IFERROR(VLOOKUP($C85,Orçamento!A92:E350,5,FALSE),0)","v":620},{"$f":"VLOOKUP($C85,Orçamento!A92:D350,4,FALSE)","v":"M"},{"$f":"VLOOKUP($C85,Orçamento!A92:H351,8,FALSE)","v":35.659999999999997},{"$f":"VLOOKUP($C85,Orçamento!A92:I351,9,FALSE)","v":22109.200000000001},{"$f":"VLOOKUP($C85,Orçamento!A92:G351,7,FALSE)","v":0.22159999999999999},1.1122000000000001,null,"",null,""]
[{"$f":"'[1]Identificação-TCE'!$A$13","v":1},{"$f":"IF(AND(G86<>\"\",H86>0,I86<>\"\",J86<>0,K86<>0),COUNT($B$11:B85)+1,\"\")","v":75},{"$f":"Orçamento!A93","v":"10.9"},"SINAPI","SINAPI 92982","2022-02-11",{"$f":"VLOOKUP($C86,Orçamento!A93:C351,3,FALSE)","v":"CABO DE COBRE FLEXÍVEL ISOLADO, 16MM2, ANTI-CHAMA 0,6/1,0kV, PARA DISTRIBUIÇÃO - FORNECIMENTO E INSTALAÇÃO. AF_12/2015"},{"$f":"IFERROR(VLOOKUP($C86,Orçamento!A93:E351,5,FALSE),0)","v":250},{"$f":"VLOOKUP($C86,Orçamento!A93:D351,4,FALSE)","v":"M"},{"$f":"VLOOKUP($C86,Orçamento!A93:H352,8,FALSE)","v":22.33},{"$f":"VLOOKUP($C86,Orçamento!A93:I352,9,FALSE)","v":5582.5},{"$f":"VLOOKUP($C86,Orçamento!A93:G352,7,FALSE)","v":0.22159999999999999},1.1122000000000001,null,"",null,""]
[{"$f":"'[1]Identificação-TCE'!$A$13","v":1},{"$f":"IF(AND(G87<>\"\",H87>0,I87<>\"\",J87<>0,K87<>0),COUNT($B$11:B86)+1,\"\")","v":76},{"$f":"Orçamento!A94","v":"10.10"},"SINAPI","SINAPI 92980","2022-02-11",{"$f":"VLOOKUP($C87,Orçamento!A94:C352,3,FALSE)","v":"CABO DE COBRE FLEXÍVEL ISOLADO, 10MM2, ANTI-CHAMA 0,6/1,0kV, PARA DISTRIBUIÇÃO - FORNECIMENTO E INSTALAÇÃO. AF_12/2015"},{"$f":"IFERROR(VLOOKUP($C87,Orçamento!A94:E352,5,FALSE),0)","v":720},{"$f":"VLOOKUP($C87,Orçamento!A94:D352,4,FALSE)","v":"M"},{"$f":"VLOOKUP($C87,Orçamento!A94:H353,8,FALSE)","v":14.59},{"$f":"VLOOKUP($C87,Orçamento!A94:I353,9,FALSE)","v":10504.8},{"$f":"VLOOKUP($C87,Orçamento!A94:G353,7,FALSE)","v":0.22159999999999999},1.1122000000000001,null,"",null,""]
[{"$f":"'[1]Identificação-TCE'!$A$13","v":1},{"$f":"IF(AND(G88<>\"\",H88>0,I88<>\"\",J88<>0,K88<>0),COUNT($B$11:B87)+1,\"\")","v":77},{"$f":"Orçamento!A95","v":"10.11"},"CCU","CPUE 43","2022-02-11",{"$f":"VLOOKUP($C88,Orçamento!A95:C353,3,FALSE)","v":"LUMINÁRIA DE EMBUTIR - COMPLETA COM QUATRO LÂMPADAS TUBULARES LED T8 (4x9 - 10W), INSTALAÇÃO EM FORRO COM MODELAÇÃO DE 625X625MM, COM REFLETOR PARABÓLICO E ALETAS DE ALUMÍNIO ANODIZADO BRILHANTE DE ALTA REFLETÂNCIA E ALTA PUREZA 99,85%. SOQUETE TIPO PUSH-IN G-13 DE ENGATE RÁPIDO, ROTOR DE SEGURANÇA EM POLICARBONATO E CONTATOS EM BRONZE FOSFOROSO, COMPLETA. CERTIFICAÇÃO CE, GARANTIA MÍNIMA DE 2 ANOS"},{"$f":"IFERROR(VLOOKUP($C88,Orçamento!A95:E353,5,FALSE),0)","v":150},"UN",{"$f":"VLOOKUP($C88,Orçamento!A95:H354,8,FALSE)","v":553.02},{"$f":"VLOOKUP($C88,Orçamento!A95:I354,9,FALSE)","v":82953},{"$f":"VLOOKUP($C88,Orçamento!A95:G354,7,FALSE)","v":0.22159999999999999},1.1122000000000001,null,"",null,""]
[{"$f":"'[1]Identificação-TCE'!$A$13","v":1},{"$f":"IF(AND(G89<>\"\",H89>0,I89<>\"\",J89<>0,K89<>0),COUNT($B$11:B88)+1,\"\")","v":78},{"$f":"Orçamento!A96","v":"10.12"},"SINAPI","SINAPI 97585","2022-02-11",{"$f":"VLOOKUP($C89,Orçamento!A96:C354,3,FALSE)","v":"LUMINÁRIA TIPO CALHA, DE SOBREPOR, COM 2 LÂMPADAS TUBULARES FLUORESCENTES DE 18W, COM REATOR DE PARTIDA RÁPIDA - FORNECIMENTO E INSTALAÇÃO. AF_02/2020"},{"$f":"IFERROR(VLOOKUP($C89,Orçamento!A96:E354,5,FALSE),0)","v":23},"UN",{"$f":"VLOOKUP($C89,Orçamento!A96:H355,8,FALSE)","v":177.49},{"$f":"VLOOKUP($C89,Orçamento!A96:I355,9,FALSE)","v":4082.27},{"$f":"VLOOKUP($C89,Orçamento!A96:G355,7,FALSE)","v":0.22159999999999999},1.1122000000000001,null,"",null,""]
[{"$f":"'[1]Identificação-TCE'!$A$13","v":1},{"$f":"IF(AND(G90<>\"\",H90>0,I90<>\"\",J90<>0,K90<>0),COUNT($B$11:B89)+1,\"\")","v":79},{"$f":"Orçamento!A97","v":"10.13"},"CCU","CPUE 44","2022-02-11",{"$f":"VLOOKUP($C90,Orçamento!A97:C355,3,FALSE)","v":"LUMINÁRIA DE SOBREPOR - COMPLETA COM DUAS LÂMPADAS TUBULARES LED T8 (2X9W), INSTALAÇÃO EM FORRO DE GESSO, COM REFLETOR PARABÓLICO E ALETAS DE ALUMÍNIO ANODIZADO BRILHANTE DE ALTA REFLETÂNCIA E ALTA PUREZA 99,85%. SOQUE TIPO PUSH-IN G-13 DE ENGATE RÁPIDO, ROTOR DE SEGURANÇA EM POLICARBONATO E CONTATOS EM BRONZE FOSFOROSO. COMPLETA. CERTIFICAÇÃO CE. GARANTIA MÍNIMA 2 ANOS. "},{"$f":"IFERROR(VLOOKUP($C90,Orçamento!A97:E355,5,FALSE),0)","v":1},"UN",{"$f":"VLOOKUP($C90,Orçamento!A97:H356,8,FALSE)","v":216.11},{"$f":"VLOOKUP($C90,Orçamento!A97:I356,9,FALSE)","v":216.11},{"$f":"VLOOKUP($C90,Orçamento!A97:G356,7,FALSE)","v":0.22159999999999999},1.1122000000000001,null,"",null,""]
[{"$f":"'[1]Identificação-TCE'!$A$13","v":1},{"$f":"IF(AND(G91<>\"\",H91>0,I91<>\"\",J91<>0,K91<>0),COUNT($B$11:B90)+1,\"\")","v":80},{"$f":"Orçamento!A98","v":"10.14"},"CCU","CPUE 45","2022-02-11",{"$f":"VLOOKUP($C91,Orçamento!A98:C356,3,FALSE)","v":"Luminária arandela de Sobrepor - Lâmpada led 18 W "},{"$f":"IFERROR(VLOOKUP($C91,Orçamento!A98:E356,5,FALSE),0)","v":19},"UN",{"$f":"VLOOKUP($C91,Orçamento!A98:H357,8,FALSE)","v":171.32},{"$f":"VLOOKUP($C91,Orçamento!A98:I357,9,FALSE)","v":3255.08},{"$f":"VLOOKUP($C91,Orçamento!A98:G357,7,FALSE)","v":0.22159999999999999},1.1122000000000001,null,"",null,""]
[{"$f":"'[1]Identificação-TCE'!$A$13","v":1},{"$f":"IF(AND(G92<>\"\",H92>0,I92<>\"\",J92<>0,K92<>0),COUNT($B$11:B91)+1,\"\")","v":81},{"$f":"Orçamento!A99","v":"10.15"},"SINAPI","SINAPI 97595","2022-02-11",{"$f":"VLOOKUP($C92,Orçamento!A99:C357,3,FALSE)","v":"SENSOR DE PRESENÇA COM FOTOCÉLULA, FIXAÇÃO EM PAREDE - FORNECIMENTO E INSTALAÇÃO. AF_02/2020"},{"$f":"IFERROR(VLOOKUP($C92,Orçamento!A99:E357,5,FALSE),0)","v":2},"UN",{"$f":"VLOOKUP($C92,Orçamento!A99:H358,8,FALSE)","v":152.41},{"$f":"VLOOKUP($C92,Orçamento!A99:I358,9,FALSE)","v":304.82},{"$f":"VLOOKUP($C92,Orçamento!A99:G358,7,FALSE)","v":0.22159999999999999},1.1122000000000001,null,"",null,""]
[{"$f":"'[1]Identificação-TCE'!$A$13","v":1},{"$f":"IF(AND(G93<>\"\",H93>0,I93<>\"\",J93<>0,K93<>0),COUNT($B$11:B92)+1,\"\")","v":82},{"$f":"Orçamento!A100","v":"10.16"},"CCU","CPUE 71","2022-02-11",{"$f":"VLOOKUP($C93,Orçamento!A100:C358,3,FALSE)","v":"MÓDULO AUTÔNOMO DE ILUMINAÇÃO DE EMERGÊNCIA COM DIFUSOR LEITOSO, 500 LÚMENS, 115/220V, COM 80 LED'S. ALTO BRILHO, BATERIA 6V, 4,5Ah, AUTONOMIA DE 8 HORAS, GABINETE EM METAL, PINTURA EPÓXI. REF. TECHNOMASTER LM 0180 OU EQUIVALENTE"},{"$f":"IFERROR(VLOOKUP($C93,Orçamento!A100:E358,5,FALSE),0)","v":23},"UN",{"$f":"VLOOKUP($C93,Orçamento!A100:H359,8,FALSE)","v":184.36},{"$f":"VLOOKUP($C93,Orçamento!A100:I359,9,FALSE)","v":4240.28},{"$f":"VLOOKUP($C93,Orçamento!A100:G359,7,FALSE)","v":0.22159999999999999},1.1122000000000001,null,"",null,""]
[{"$f":"'[1]Identificação-TCE'!$A$13","v":1},{"$f":"IF(AND(G94<>\"\",H94>0,I94<>\"\",J94<>0,K94<>0),COUNT($B$11:B93)+1,\"\")","v":83},{"$f":"Orçamento!A101","v":"10.17"},"CCU","CPUE 72","2022-02-11",{"$f":"VLOOKUP($C94,Orçamento!A101:C359,3,FALSE)","v":"MÓDULO AUTÔNOMO DE EMERGÊNCIA (127/220V) COM 2 FAROLETES DE 32 LED'S CADA, COM BATERIA 12V - 7A COM AUTONOMIA DE 32 HORAS COM SUPORTE METÁLICO PARA FIXAÇÃO DA BATERIA. REF. TECHNOMASTER UN0232 OU EQUIVALENTE"},{"$f":"IFERROR(VLOOKUP($C94,Orçamento!A101:E359,5,FALSE),0)","v":1},"UN",{"$f":"VLOOKUP($C94,Orçamento!A101:H360,8,FALSE)","v":284.17},{"$f":"VLOOKUP($C94,Orçamento!A101:I360,9,FALSE)","v":284.17},{"$f":"VLOOKUP($C94,Orçamento!A101:G360,7,FALSE)","v":0.22159999999999999},1.1122000000000001,null,"",null,""]
[{"$f":"'[1]Identificação-TCE'!$A$13","v":1},{"$f":"IF(AND(G95<>\"\",H95>0,I95<>\"\",J95<>0,K95<>0),COUNT($B$11:B94)+1,\"\")","v":84},{"$f":"Orçamento!A102","v":"10.18"},"SINAPI","SINAPI 91953","2022-02-11",{"$f":"VLOOKUP($C95,Orçamento!A102:C360,3,FALSE)","v":"INTERRUPTOR SIMPLES (1 MÓDULO), 10A//250V, INCLUINDO SUPORTE E PLACA - FORNECIMENTO E INSTALAÇÃO. AF_12/2015"},{"$f":"IFERROR(VLOOKUP($C95,Orçamento!A102:E360,5,FALSE),0)","v":14},"UN",{"$f":"VLOOKUP($C95,Orçamento!A102:H361,8,FALSE)","v":29.56},{"$f":"VLOOKUP($C95,Orçamento!A102:I361,9,FALSE)","v":413.84},{"$f":"VLOOKUP($C95,Orçamento!A102:G361,7,FALSE)","v":0.22159999999999999},1.1122000000000001,null,"",null,""]
[{"$f":"'[1]Identificação-TCE'!$A$13","v":1},{"$f":"IF(AND(G96<>\"\",H96>0,I96<>\"\",J96<>0,K96<>0),COUNT($B$11:B95)+1,\"\")","v":85},{"$f":"Orçamento!A103","v":"10.19"},"SINAPI","SINAPI 91959","2022-02-11",{"$f":"VLOOKUP($C96,Orçamento!A103:C361,3,FALSE)","v":"INTERRUPTOR SIMPLES (2 MÓDULOS), 10A/250V, INCLUINDO SUPORTE E PLACA. FORNECIMENTO E INSTALAÇÃO. AF_12/2015"},{"$f":"IFERROR(VLOOKUP($C96,Orçamento!A103:E361,5,FALSE),0)","v":16},"UN",{"$f":"VLOOKUP($C96,Orçamento!A103:H362,8,FALSE)","v":46.81},{"$f":"VLOOKUP($C96,Orçamento!A103:I362,9,FALSE)","v":748.96},{"$f":"VLOOKUP($C96,Orçamento!A103:G362,7,FALSE)","v":0.22159999999999999},1.1122000000000001,null,"",null,""]
[{"$f":"'[1]Identificação-TCE'!$A$13","v":1},{"$f":"IF(AND(G97<>\"\",H97>0,I97<>\"\",J97<>0,K97<>0),COUNT($B$11:B96)+1,\"\")","v":86},{"$f":"Orçamento!A104","v":"10.20"},"SINAPI","SINAPI 91967","2022-02-11",{"$f":"VLOOKUP($C97,Orçamento!A104:C362,3,FALSE)","v":"INTERRUPTOR SIMPLES (3 MÓDULOS), 10A/250V, INCLUINDO SUPORTE E PLACA. FORNECIMENTO E INSTALAÇÃO. AF_12/2015"},{"$f":"IFERROR(VLOOKUP($C97,Orçamento!A104:E362,5,FALSE),0)","v":9},"UN",{"$f":"VLOOKUP($C97,Orçamento!A104:H363,8,FALSE)","v":64.09},{"$f":"VLOOKUP($C97,Orçamento!A104:I363,9,FALSE)","v":576.80999999999995},{"$f":"VLOOKUP($C97,Orçamento!A104:G363,7,FALSE)","v":0.22159999999999999},1.1122000000000001,null,"",null,""]
[{"$f":"'[1]Identificação-TCE'!$A$13","v":1},{"$f":"IF(AND(G98<>\"\",H98>0,I98<>\"\",J98<>0,K98<>0),COUNT($B$11:B97)+1,\"\")","v":87},{"$f":"Orçamento!A105","v":"10.21"},"SINAPI","SINAPI 91981","2022-02-11",{"$f":"VLOOKUP($C98,Orçamento!A105:C363,3,FALSE)","v":"INTERRUPTOR BIPOLAR, (1 MÓDULO), 10A/250V, INCLUINDO SUPORTE E PLACA. FORNECIMENTO E INSTALAÇÃO. AF_09/2017"},{"$f":"IFERROR(VLOOKUP($C98,Orçamento!A105:E363,5,FALSE),0)","v":10},"UN",{"$f":"VLOOKUP($C98,Orçamento!A105:H364,8,FALSE)","v":52.14},{"$f":"VLOOKUP($C98,Orçamento!A105:I364,9,FALSE)","v":521.4},{"$f":"VLOOKUP($C98,Orçamento!A105:G364,7,FALSE)","v":0.22159999999999999},1.1122000000000001,null,"",null,""]
[{"$f":"'[1]Identificação-TCE'!$A$13","v":1},{"$f":"IF(AND(G99<>\"\",H99>0,I99<>\"\",J99<>0,K99<>0),COUNT($B$11:B98)+1,\"\")","v":88},{"$f":"Orçamento!A106","v":"10.22"},"SINAPI","SINAPI 91979","2022-02-11",{"$f":"VLOOKUP($C99,Orçamento!A106:C364,3,FALSE)","v":"INTERRUPTOR INTERMEDIÁRIO (1 MÓDULO), 10A/250V, INCLUINDO SUPORTE E PLACA. FORNECIMENTO E INSTALAÇÃO. AF_09/2017"},{"$f":"IFERROR(VLOOKUP($C99,Orçamento!A106:E364,5,FALSE),0)","v":1},"UN",{"$f":"VLOOKUP($C99,Orçamento!A106:H365,8,FALSE)","v":53.73},{"$f":"VLOOKUP($C99,Orçamento!A106:I365,9,FALSE)","v":53.73},{"$f":"VLOOKUP($C99,Orçamento!A106:G365,7,FALSE)","v":0.22159999999999999},1.1122000000000001,null,"",null,""]
[{"$f":"'[1]Identificação-TCE'!$A$13","v":1},{"$f":"IF(AND(G100<>\"\",H100>0,I100<>\"\",J100<>0,K100<>0),COUNT($B$11:B99)+1,\"\")","v":89},{"$f":"Orçamento!A107","v":"10.23"},"SINAPI","SINAPI 91992","2022-02-11",{"$f":"VLOOKUP($C100,Orçamento!A107:C365,3,FALSE)","v":"TOMADA ALTA DE EMBUTIR (1 MÓDULO), 2P+T 10A, INCLUINDO SUPORTE E PLACA. FORNECIMENTO E INSTALAÇÃO. AF_12/2015"},{"$f":"IFERROR(VLOOKUP($C100,Orçamento!A107:E365,5,FALSE),0)","v":23},"UN",{"$f":"VLOOKUP($C100,Orçamento!A107:H366,8,FALSE)","v":44.39},{"$f":"VLOOKUP($C100,Orçamento!A107:I366,9,FALSE)","v":1020.97},{"$f":"VLOOKUP($C100,Orçamento!A107:G366,7,FALSE)","v":0.22159999999999999},1.1122000000000001,null,"",null,""]
[{"$f":"'[1]Identificação-TCE'!$A$13","v":1},{"$f":"IF(AND(G101<>\"\",H101>0,I101<>\"\",J101<>0,K101<>0),COUNT($B$11:B100)+1,\"\")","v":90},{"$f":"Orçamento!A108","v":"10.24"},"SINAPI","SINAPI 92004","2022-02-11",{"$f":"VLOOKUP($C101,Orçamento!A108:C366,3,FALSE)","v":"TOMADA MÉDIA DE EMBUTIR (2 MÓDULOS), 2P+T 10A, INCLUINDO SUPORTE E PLACA. FORNECIMENTO E INSTALAÇÃO. AF_12/2015"},{"$f":"IFERROR(VLOOKUP($C101,Orçamento!A108:E366,5,FALSE),0)","v":56},"UN",{"$f":"VLOOKUP($C101,Orçamento!A108:H367,8,FALSE)","v":57.59},{"$f":"VLOOKUP($C101,Orçamento!A108:I367,9,FALSE)","v":3225.04},{"$f":"VLOOKUP($C101,Orçamento!A108:G367,7,FALSE)","v":0.22159999999999999},1.1122000000000001,null,"",null,""]
[{"$f":"'[1]Identificação-TCE'!$A$13","v":1},{"$f":"IF(AND(G102<>\"\",H102>0,I102<>\"\",J102<>0,K102<>0),COUNT($B$11:B101)+1,\"\")","v":91},{"$f":"Orçamento!A109","v":"10.25"},"SINAPI","SINAPI 92005","2022-02-11",{"$f":"VLOOKUP($C102,Orçamento!A109:C367,3,FALSE)","v":"TOMADA MÉDIA DE EMBUTIR (2 MÓDULOS), 2P+T 20A, INCLUINDO SUPORTE E PLACA. FORNECIMENTO E INSTALAÇÃO. AF_12/2015"},{"$f":"IFERROR(VLOOKUP($C102,Orçamento!A109:E367,5,FALSE),0)","v":23},"UN",{"$f":"VLOOKUP($C102,Orçamento!A109:H368,8,FALSE)","v":63.3},{"$f":"VLOOKUP($C102,Orçamento!A109:I368,9,FALSE)","v":1455.9},{"$f":"VLOOKUP($C102,Orçamento!A109:G368,7,FALSE)","v":0.22159999999999999},1.1122000000000001,null,"",null,""]
[{"$f":"'[1]Identificação-TCE'!$A$13","v":1},{"$f":"IF(AND(G103<>\"\",H103>0,I103<>\"\",J103<>0,K103<>0),COUNT($B$11:B102)+1,\"\")","v":92},{"$f":"Orçamento!A110","v":"10.26"},"CCU","CPUE 47","2022-02-11",{"$f":"VLOOKUP($C103,Orçamento!A110:C368,3,FALSE)","v":"CABO DE COBRE PP CORDPLAST 3X1,5MM2 HF (NÃO HALOGENADO), 70ºC 450/750V. REF. AFITOX, AFUMEX OU EQUIVALENTE. (LIGAÇÃO PGDM, INTERFONE, FECHO SAA, ILUM. PÓRTICO, LIGAÇÃO LUMINÁRIAS, TOTEM, CUBO, SENSOR PRESENÇA)"},{"$f":"IFERROR(VLOOKUP($C103,Orçamento!A110:E368,5,FALSE),0)","v":97},{"$f":"VLOOKUP($C103,Orçamento!A110:D368,4,FALSE)","v":"M"},{"$f":"VLOOKUP($C103,Orçamento!A110:H369,8,FALSE)","v":10.32},{"$f":"VLOOKUP($C103,Orçamento!A110:I369,9,FALSE)","v":1001.04},{"$f":"VLOOKUP($C103,Orçamento!A110:G369,7,FALSE)","v":0.22159999999999999},1.1122000000000001,null,"",null,""]
[{"$f":"'[1]Identificação-TCE'!$A$13","v":1},{"$f":"IF(AND(G104<>\"\",H104>0,I104<>\"\",J104<>0,K104<>0),COUNT($B$11:B103)+1,\"\")","v":93},{"$f":"Orçamento!A111","v":"10.27"},"CCU","CPUE 110","2022-02-11",{"$f":"VLOOKUP($C104,Orçamento!A111:C369,3,FALSE)","v":"CONJUNTO PLUGS MACHO/FÊMEA 2P+T 10A/250V NBR 14136 (LIGAÇÃO LUMINÁRIAS)"},{"$f":"IFERROR(VLOOKUP($C104,Orçamento!A111:E369,5,FALSE),0)","v":193},{"$f":"VLOOKUP($C104,Orçamento!A111:D369,4,FALSE)","v":"CJ"},{"$f":"VLOOKUP($C104,Orçamento!A111:H370,8,FALSE)","v":22.95},{"$f":"VLOOKUP($C104,Orçamento!A111:I370,9,FALSE)","v":4429.3500000000004},{"$f":"VLOOKUP($C104,Orçamento!A111:G370,7,FALSE)","v":0.22159999999999999},1.1122000000000001,null,"",null,""]
[{"$f":"'[1]Identificação-TCE'!$A$13","v":1},{"$f":"IF(AND(G105<>\"\",H105>0,I105<>\"\",J105<>0,K105<>0),COUNT($B$11:B104)+1,\"\")","v":94},{"$f":"Orçamento!A112","v":"10.28"},"SINAPI","SINAPI 91926","2022-02-11",{"$f":"VLOOKUP($C105,Orçamento!A112:C370,3,FALSE)","v":"CABO DE COBRE FLEXÍVEL ISOLADO 2,5MM2, ANTI-CHAMA 450/750V, PARA CIRCUITOS TERMINAIS - FORNECIMENTO E INSTALAÇÃO. AF_12/2015"},{"$f":"IFERROR(VLOOKUP($C105,Orçamento!A112:E370,5,FALSE),0)","v":1920},{"$f":"VLOOKUP($C105,Orçamento!A112:D370,4,FALSE)","v":"M"},{"$f":"VLOOKUP($C105,Orçamento!A112:H371,8,FALSE)","v":5.01},{"$f":"VLOOKUP($C105,Orçamento!A112:I371,9,FALSE)","v":9619.2000000000007},{"$f":"VLOOKUP($C105,Orçamento!A112:G371,7,FALSE)","v":0.22159999999999999},1.1122000000000001,null,"",null,""]
[{"$f":"'[1]Identificação-TCE'!$A$13","v":1},{"$f":"IF(AND(G106<>\"\",H106>0,I106<>\"\",J106<>0,K106<>0),COUNT($B$11:B105)+1,\"\")","v":95},{"$f":"Orçamento!A113","v":"10.29"},"SINAPI","SINAPI 91928","2022-02-11",{"$f":"VLOOKUP($C106,Orçamento!A113:C371,3,FALSE)","v":"CABO DE COBRE FLEXÍVEL ISOLADO 4MM2, ANTI-CHAMA 450/750V, PARA CIRCUITOS TERMINAIS - FORNECIMENTO E INSTALAÇÃO. AF_12/2015"},{"$f":"IFERROR(VLOOKUP($C106,Orçamento!A113:E371,5,FALSE),0)","v":160},{"$f":"VLOOKUP($C106,Orçamento!A113:D371,4,FALSE)","v":"M"},{"$f":"VLOOKUP($C106,Orçamento!A113:H372,8,FALSE)","v":8.2899999999999991},{"$f":"VLOOKUP($C106,Orçamento!A113:I372,9,FALSE)","v":1326.4},{"$f":"VLOOKUP($C106,Orçamento!A113:G372,7,FALSE)","v":0.22159999999999999},1.1122000000000001,null,"",null,""]
[{"$f":"'[1]Identificação-TCE'!$A$13","v":1},{"$f":"IF(AND(G107<>\"\",H107>0,I107<>\"\",J107<>0,K107<>0),COUNT($B$11:B106)+1,\"\")","v":96},{"$f":"Orçamento!A114","v":"10.30"},"SINAPI","SINAPI 95745","2022-02-11",{"$f":"VLOOKUP($C107,Orçamento!A114:C372,3,FALSE)","v":"ELETRODUTO DE AÇO GALVANIZADO, CLASSE LEVE, DN 20MM (3/4\"), APARENTE, INSTALADO EM TETO - FORNECIMENTO E INSTALAÇÃO. AF_11/2016_P"},{"$f":"IFERROR(VLOOKUP($C107,Orçamento!A114:E372,5,FALSE),0)","v":150},{"$f":"VLOOKUP($C107,Orçamento!A114:D372,4,FALSE)","v":"M"},{"$f":"VLOOKUP($C107,Orçamento!A114:H373,8,FALSE)","v":41.11},{"$f":"VLOOKUP($C107,Orçamento!A114:I373,9,FALSE)","v":6166.5},{"$f":"VLOOKUP($C107,Orçamento!A114:G373,7,FALSE)","v":0.22159999999999999},1.1122000000000001,null,"",null,""]
[{"$f":"'[1]Identificação-TCE'!$A$13","v":1},{"$f":"IF(AND(G108<>\"\",H108>0,I108<>\"\",J108<>0,K108<>0),COUNT($B$11:B107)+1,\"\")","v":97},{"$f":"Orçamento!A115","v":"10.31"},"SINAPI","SINAPI 95746","2022-02-11",{"$f":"VLOOKUP($C108,Orçamento!A115:C373,3,FALSE)","v":"ELETRODUTO DE AÇO GALVANIZADO, CLASSE LEVE, DN 25MM (1\"), APARENTE, INSTALADO EM TETO - FORNECIMENTO E INSTALAÇÃO. AF_11/2016_P"},{"$f":"IFERROR(VLOOKUP($C108,Orçamento!A115:E373,5,FALSE),0)","v":560},{"$f":"VLOOKUP($C108,Orçamento!A115:D373,4,FALSE)","v":"M"},{"$f":"VLOOKUP($C108,Orçamento!A115:H374,8,FALSE)","v":51.83},{"$f":"VLOOKUP($C108,Orçamento!A115:I374,9,FALSE)","v":29024.799999999999},{"$f":"VLOOKUP($C108,Orçamento!A115:G374,7,FALSE)","v":0.22159999999999999},1.1122000000000001,null,"",null,""]
[{"$f":"'[1]Identificação-TCE'!$A$13","v":1},{"$f":"IF(AND(G109<>\"\",H109>0,I109<>\"\",J109<>0,K109<>0),COUNT($B$11:B108)+1,\"\")","v":98},{"$f":"Orçamento!A116","v":"10.32"},"CCU","CPUE 111","2022-02-11",{"$f":"VLOOKUP($C109,Orçamento!A116:C374,3,FALSE)","v":"ELETRODUTO DE AÇO GALVANIZADO, CLASSE SEMI PESADO, DN 50MM - FORNECIMENTO E INSTALAÇÃO"},{"$f":"IFERROR(VLOOKUP($C109,Orçamento!A116:E374,5,FALSE),0)","v":90},{"$f":"VLOOKUP($C109,Orçamento!A116:D374,4,FALSE)","v":"M"},{"$f":"VLOOKUP($C109,Orçamento!A116:H375,8,FALSE)","v":108.84},{"$f":"VLOOKUP($C109,Orçamento!A116:I375,9,FALSE)","v":9795.6},{"$f":"VLOOKUP($C109,Orçamento!A116:G375,7,FALSE)","v":0.22159999999999999},1.1122000000000001,null,"",null,""]
[{"$f":"'[1]Identificação-TCE'!$A$13","v":1},{"$f":"IF(AND(G110<>\"\",H110>0,I110<>\"\",J110<>0,K110<>0),COUNT($B$11:B109)+1,\"\")","v":99},{"$f":"Orçamento!A117","v":"10.33"},"CCU","CPUE 73","2022-02-11",{"$f":"VLOOKUP($C110,Orçamento!A117:C375,3,FALSE)","v":"BARRAMENTO DE EQUIPOTENCIALIZAÇÃO"},{"$f":"IFERROR(VLOOKUP($C110,Orçamento!A117:E375,5,FALSE),0)","v":1},"UN",{"$f":"VLOOKUP($C110,Orçamento!A117:H376,8,FALSE)","v":50.24},{"$f":"VLOOKUP($C110,Orçamento!A117:I376,9,FALSE)","v":50.24},{"$f":"VLOOKUP($C110,Orçamento!A117:G376,7,FALSE)","v":0.22159999999999999},1.1122000000000001,null,"",null,""]
[{"$f":"'[1]Identificação-TCE'!$A$13","v":1},{"$f":"IF(AND(G111<>\"\",H111>0,I111<>\"\",J111<>0,K111<>0),COUNT($B$11:B110)+1,\"\")","v":100},{"$f":"Orçamento!A118","v":"10.34"},"SINAPI","SINAPI 96977","2022-02-11",{"$f":"VLOOKUP($C111,Orçamento!A118:C376,3,FALSE)","v":"CORDOALHA DE COBRE NU, 50MM2, ENTERRADA, SEM ISOLADOR - FORNECIMENTO E INSTALAÇÃO. AF_12/2017"},{"$f":"IFERROR(VLOOKUP($C111,Orçamento!A118:E376,5,FALSE),0)","v":30},{"$f":"VLOOKUP($C111,Orçamento!A118:D376,4,FALSE)","v":"M"},{"$f":"VLOOKUP($C111,Orçamento!A118:H377,8,FALSE)","v":67.52},{"$f":"VLOOKUP($C111,Orçamento!A118:I377,9,FALSE)","v":2025.6},{"$f":"VLOOKUP($C111,Orçamento!A118:G377,7,FALSE)","v":0.22159999999999999},1.1122000000000001,null,"",null,""]
[{"$f":"'[1]Identificação-TCE'!$A$13","v":1},{"$f":"IF(AND(G112<>\"\",H112>0,I112<>\"\",J112<>0,K112<>0),COUNT($B$11:B111)+1,\"\")","v":101},{"$f":"Orçamento!A119","v":"10.35"},"SINAPI","SINAPI 96986","2022-02-11",{"$f":"VLOOKUP($C112,Orçamento!A119:C377,3,FALSE)","v":"HASTE DE ATERRAMENTO 3/4 PARA SPDA -FORNECIMENTO E INSTALAÇÃO. AF_12/2017"},{"$f":"IFERROR(VLOOKUP($C112,Orçamento!A119:E377,5,FALSE),0)","v":3},"UN",{"$f":"VLOOKUP($C112,Orçamento!A119:H378,8,FALSE)","v":171.62},{"$f":"VLOOKUP($C112,Orçamento!A119:I378,9,FALSE)","v":514.86},{"$f":"VLOOKUP($C112,Orçamento!A119:G378,7,FALSE)","v":0.22159999999999999},1.1122000000000001,null,"",null,""]
[{"$f":"'[1]Identificação-TCE'!$A$13","v":1},{"$f":"IF(AND(G113<>\"\",H113>0,I113<>\"\",J113<>0,K113<>0),COUNT($B$11:B112)+1,\"\")","v":102},{"$f":"Orçamento!A120","v":"10.36"},"ORSE","ORSE 00764","2022-02-11",{"$f":"VLOOKUP($C113,Orçamento!A120:C378,3,FALSE)","v":"Fornecimento e instalação de eletrocalha perfurada 300x100x3000mm"},{"$f":"IFERROR(VLOOKUP($C113,Orçamento!A120:E378,5,FALSE),0)","v":170},{"$f":"VLOOKUP($C113,Orçamento!A120:D378,4,FALSE)","v":"M"},{"$f":"VLOOKUP($C113,Orçamento!A120:H379,8,FALSE)","v":146.88999999999999},{"$f":"VLOOKUP($C113,Orçamento!A120:I379,9,FALSE)","v":24971.3},{"$f":"VLOOKUP($C113,Orçamento!A120:G379,7,FALSE)","v":0.22159999999999999},1.1122000000000001,null,"",null,""]
[{"$f":"'[1]Identificação-TCE'!$A$13","v":1},{"$f":"IF(AND(G114<>\"\",H114>0,I114<>\"\",J114<>0,K114<>0),COUNT($B$11:B113)+1,\"\")","v":103},{"$f":"Orçamento!A121","v":"10.37"},"ORSE","ORSE 12804","2022-02-11",{"$f":"VLOOKUP($C114,Orçamento!A121:C379,3,FALSE)","v":"Tampa de encaixe 300x3000mm, zincada, para eletrocalha metálica"},{"$f":"IFERROR(VLOOKUP($C114,Orçamento!A121:E379,5,FALSE),0)","v":57},"UN",{"$f":"VLOOKUP($C114,Orçamento!A121:H380,8,FALSE)","v":156.05000000000001},{"$f":"VLOOKUP($C114,Orçamento!A121:I380,9,FALSE)","v":8894.85},{"$f":"VLOOKUP($C114,Orçamento!A121:G380,7,FALSE)","v":0.22159999999999999},1.1122000000000001,null,"",null,""]
[{"$f":"'[1]Identificação-TCE'!$A$13","v":1},{"$f":"IF(AND(G115<>\"\",H115>0,I115<>\"\",J115<>0,K115<>0),COUNT($B$11:B114)+1,\"\")","v":104},{"$f":"Orçamento!A122","v":"10.38"},"ORSE","ORSE 09525","2022-02-11",{"$f":"VLOOKUP($C115,Orçamento!A122:C380,3,FALSE)","v":"Suporte horizontal 300x100mm para fixação de eletrocalha metálica"},{"$f":"IFERROR(VLOOKUP($C115,Orçamento!A122:E380,5,FALSE),0)","v":170},"UN",{"$f":"VLOOKUP($C115,Orçamento!A122:H381,8,FALSE)","v":16.11},{"$f":"VLOOKUP($C115,Orçamento!A122:I381,9,FALSE)","v":2738.7},{"$f":"VLOOKUP($C115,Orçamento!A122:G381,7,FALSE)","v":0.22159999999999999},1.1122000000000001,null,"",null,""]
[{"$f":"'[1]Identificação-TCE'!$A$13","v":1},{"$f":"IF(AND(G116<>\"\",H116>0,I116<>\"\",J116<>0,K116<>0),COUNT($B$11:B115)+1,\"\")","v":105},{"$f":"Orçamento!A123","v":"10.39"},"ORSE","ORSE 11923","2022-02-11",{"$f":"VLOOKUP($C116,Orçamento!A123:C381,3,FALSE)","v":"Fornecimento e instalação de curva vertical em PVC, para eletrocalha, 300x100mm"},{"$f":"IFERROR(VLOOKUP($C116,Orçamento!A123:E381,5,FALSE),0)","v":8},"UN",{"$f":"VLOOKUP($C116,Orçamento!A123:H382,8,FALSE)","v":151.86000000000001},{"$f":"VLOOKUP($C116,Orçamento!A123:I382,9,FALSE)","v":1214.8800000000001},{"$f":"VLOOKUP($C116,Orçamento!A123:G382,7,FALSE)","v":0.22159999999999999},1.1122000000000001,null,"",null,""]
[{"$f":"'[1]Identificação-TCE'!$A$13","v":1},{"$f":"IF(AND(G117<>\"\",H117>0,I117<>\"\",J117<>0,K117<>0),COUNT($B$11:B116)+1,\"\")","v":106},{"$f":"Orçamento!A124","v":"10.40"},"ORSE","ORSE 12803","2022-02-11",{"$f":"VLOOKUP($C117,Orçamento!A124:C382,3,FALSE)","v":"Emenda interna 300 x 100 mm com base lisa perfurada para eletrocalha metálica (ref. Mopa ou similar)"},{"$f":"IFERROR(VLOOKUP($C117,Orçamento!A124:E382,5,FALSE),0)","v":169},"UN",{"$f":"VLOOKUP($C117,Orçamento!A124:H383,8,FALSE)","v":30.1},{"$f":"VLOOKUP($C117,Orçamento!A124:I383,9,FALSE)","v":5086.8999999999996},{"$f":"VLOOKUP($C117,Orçamento!A124:G383,7,FALSE)","v":0.22159999999999999},1.1122000000000001,null,"",null,""]
[{"$f":"'[1]Identificação-TCE'!$A$13","v":1},{"$f":"IF(AND(G118<>\"\",H118>0,I118<>\"\",J118<>0,K118<>0),COUNT($B$11:B117)+1,\"\")","v":107},{"$f":"Orçamento!A125","v":"10.41"},"CCU","CPUE 74","2022-02-11",{"$f":"VLOOKUP($C118,Orçamento!A125:C383,3,FALSE)","v":"Perfilado 38x38mm chapa #18"},{"$f":"IFERROR(VLOOKUP($C118,Orçamento!A125:E383,5,FALSE),0)","v":440},{"$f":"VLOOKUP($C118,Orçamento!A125:D383,4,FALSE)","v":"M"},{"$f":"VLOOKUP($C118,Orçamento!A125:H384,8,FALSE)","v":42.8},{"$f":"VLOOKUP($C118,Orçamento!A125:I384,9,FALSE)","v":18832},{"$f":"VLOOKUP($C118,Orçamento!A125:G384,7,FALSE)","v":0.22159999999999999},1.1122000000000001,null,"",null,""]
[{"$f":"'[1]Identificação-TCE'!$A$13","v":1},{"$f":"IF(AND(G119<>\"\",H119>0,I119<>\"\",J119<>0,K119<>0),COUNT($B$11:B118)+1,\"\")","v":108},{"$f":"Orçamento!A126","v":"10.42"},"CCU","CPUE 75","2022-02-11",{"$f":"VLOOKUP($C119,Orçamento!A126:C384,3,FALSE)","v":"Suporte longo para perfilado 38x38MM"},{"$f":"IFERROR(VLOOKUP($C119,Orçamento!A126:E384,5,FALSE),0)","v":440},"UN",{"$f":"VLOOKUP($C119,Orçamento!A126:H385,8,FALSE)","v":1.89},{"$f":"VLOOKUP($C119,Orçamento!A126:I385,9,FALSE)","v":831.6},{"$f":"VLOOKUP($C119,Orçamento!A126:G385,7,FALSE)","v":0.22159999999999999},1.1122000000000001,null,"",null,""]
[{"$f":"'[1]Identificação-TCE'!$A$13","v":1},{"$f":"IF(AND(G120<>\"\",H120>0,I120<>\"\",J120<>0,K120<>0),COUNT($B$11:B119)+1,\"\")","v":109},{"$f":"Orçamento!A127","v":"10.43"},"CCU","CPUE 76","2022-02-11",{"$f":"VLOOKUP($C120,Orçamento!A127:C385,3,FALSE)","v":"Vergalhão rosca total 1/4\""},{"$f":"IFERROR(VLOOKUP($C120,Orçamento!A127:E385,5,FALSE),0)","v":450},{"$f":"VLOOKUP($C120,Orçamento!A127:D385,4,FALSE)","v":"M"},{"$f":"VLOOKUP($C120,Orçamento!A127:H386,8,FALSE)","v":24.72},{"$f":"VLOOKUP($C120,Orçamento!A127:I386,9,FALSE)","v":11124},{"$f":"VLOOKUP($C120,Orçamento!A127:G386,7,FALSE)","v":0.22159999999999999},1.1122000000000001,null,"",null,""]
[{"$f":"'[1]Identificação-TCE'!$A$13","v":1},{"$f":"IF(AND(G121<>\"\",H121>0,I121<>\"\",J121<>0,K121<>0),COUNT($B$11:B120)+1,\"\")","v":110},{"$f":"Orçamento!A128","v":"10.44"},"CCU","CPUE 77","2022-02-11",{"$f":"VLOOKUP($C121,Orçamento!A128:C386,3,FALSE)","v":"Chumbador rosca interna 1/4\""},{"$f":"IFERROR(VLOOKUP($C121,Orçamento!A128:E386,5,FALSE),0)","v":225},"UN",{"$f":"VLOOKUP($C121,Orçamento!A128:H387,8,FALSE)","v":34.659999999999997},{"$f":"VLOOKUP($C121,Orçamento!A128:I387,9,FALSE)","v":7798.5},{"$f":"VLOOKUP($C121,Orçamento!A128:G387,7,FALSE)","v":0.22159999999999999},1.1122000000000001,null,"",null,""]
[{"$f":"'[1]Identificação-TCE'!$A$13","v":1},{"$f":"IF(AND(G122<>\"\",H122>0,I122<>\"\",J122<>0,K122<>0),COUNT($B$11:B121)+1,\"\")","v":111},{"$f":"Orçamento!A129","v":"10.45"},"CCU","CPUE 78","2022-02-11",{"$f":"VLOOKUP($C122,Orçamento!A129:C387,3,FALSE)","v":"TRANSFORMADOR TRIFÁSICO A SECO, PN=225KVA, CLASSE 15KV - BT 220/127V - 60HZ, IP00."},{"$f":"IFERROR(VLOOKUP($C122,Orçamento!A129:E387,5,FALSE),0)","v":1},"UN",{"$f":"VLOOKUP($C122,Orçamento!A129:H388,8,FALSE)","v":34088.78},{"$f":"VLOOKUP($C122,Orçamento!A129:I388,9,FALSE)","v":34088.78},{"$f":"VLOOKUP($C122,Orçamento!A129:G388,7,FALSE)","v":0.22159999999999999},1.1122000000000001,null,"",null,""]
[{"$f":"'[1]Identificação-TCE'!$A$13","v":1},{"$f":"IF(AND(G123<>\"\",H123>0,I123<>\"\",J123<>0,K123<>0),COUNT($B$11:B122)+1,\"\")","v":112},{"$f":"Orçamento!A130","v":"10.46"},"CCU","CPUE 79","2022-02-11",{"$f":"VLOOKUP($C123,Orçamento!A130:C388,3,FALSE)","v":"CABO DE COBRE UNIPOLAR #35MM² BLINDADO, ISOLAÇÃO 12/20KV EPR - COBERTURA EM PVC"},{"$f":"IFERROR(VLOOKUP($C123,Orçamento!A130:E388,5,FALSE),0)","v":300},{"$f":"VLOOKUP($C123,Orçamento!A130:D388,4,FALSE)","v":"M"},{"$f":"VLOOKUP($C123,Orçamento!A130:H389,8,FALSE)","v":127.22},{"$f":"VLOOKUP($C123,Orçamento!A130:I389,9,FALSE)","v":38166},{"$f":"VLOOKUP($C123,Orçamento!A130:G389,7,FALSE)","v":0.22159999999999999},1.1122000000000001,null,"",null,""]
[{"$f":"'[1]Identificação-TCE'!$A$13","v":1},{"$f":"IF(AND(G124<>\"\",H124>0,I124<>\"\",J124<>0,K124<>0),COUNT($B$11:B123)+1,\"\")","v":113},{"$f":"Orçamento!A131","v":"10.47"},"CCU","CPUE 91","2022-02-11",{"$f":"VLOOKUP($C124,Orçamento!A131:C389,3,FALSE)","v":"TERMINAÇÃO TERMOCONTRÁTIL PARA CABO 35MM2, CLASSE 15kV (PARA USO EXTERNO)"},{"$f":"IFERROR(VLOOKUP($C124,Orçamento!A131:E389,5,FALSE),0)","v":3},"UN",{"$f":"VLOOKUP($C124,Orçamento!A131:H390,8,FALSE)","v":317.83999999999997},{"$f":"VLOOKUP($C124,Orçamento!A131:I390,9,FALSE)","v":953.52},{"$f":"VLOOKUP($C124,Orçamento!A131:G390,7,FALSE)","v":0.22159999999999999},1.1122000000000001,null,"",null,""]
[{"$f":"'[1]Identificação-TCE'!$A$13","v":1},{"$f":"IF(AND(G125<>\"\",H125>0,I125<>\"\",J125<>0,K125<>0),COUNT($B$11:B124)+1,\"\")","v":114},{"$f":"Orçamento!A132","v":"10.48"},"CCU","CPUE 85","2022-02-11",{"$f":"VLOOKUP($C125,Orçamento!A132:C390,3,FALSE)","v":"TERMINAÇÃO TERMOCONTRÁTIL PARA CABO 35MM2, CLASSE 15kV (PARA USO INTERNO)"},{"$f":"IFERROR(VLOOKUP($C125,Orçamento!A132:E390,5,FALSE),0)","v":3},"UN",{"$f":"VLOOKUP($C125,Orçamento!A132:H391,8,FALSE)","v":317.58999999999997},{"$f":"VLOOKUP($C125,Orçamento!A132:I391,9,FALSE)","v":952.77},{"$f":"VLOOKUP($C125,Orçamento!A132:G391,7,FALSE)","v":0.22159999999999999},1.1122000000000001,null,"",null,""]
[{"$f":"'[1]Identificação-TCE'!$A$13","v":1},{"$f":"IF(AND(G126<>\"\",H126>0,I126<>\"\",J126<>0,K126<>0),COUNT($B$11:B125)+1,\"\")","v":115},{"$f":"Orçamento!A133","v":"10.49"},"CCU","CPUE 50","2022-02-11",{"$f":"VLOOKUP($C126,Orçamento!A133:C391,3,FALSE)","v":"SECCIONADORA TRIPOLAR SECA 15KV-400A-TSI 95KV-COMANDO POR PUNHO"},{"$f":"IFERROR(VLOOKUP($C126,Orçamento!A133:E391,5,FALSE),0)","v":1},"UN",{"$f":"VLOOKUP($C126,Orçamento!A133:H392,8,FALSE)","v":1688.14},{"$f":"VLOOKUP($C126,Orçamento!A133:I392,9,FALSE)","v":1688.14},{"$f":"VLOOKUP($C126,Orçamento!A133:G392,7,FALSE)","v":0.22159999999999999},1.1122000000000001,null,"",null,""]
[{"$f":"'[1]Identificação-TCE'!$A$13","v":1},{"$f":"IF(AND(G127<>\"\",H127>0,I127<>\"\",J127<>0,K127<>0),COUNT($B$11:B126)+1,\"\")","v":116},{"$f":"Orçamento!A134","v":"10.50"},"CCU","CPUE 49","2022-02-11",{"$f":"VLOOKUP($C127,Orçamento!A134:C392,3,FALSE)","v":"SECCIONADORA TRIPOLAR FUSÍVEL 15KV-400A-TSI95KV-COMANDO POR PUNHO ABERTURA MÍNIMA 18CM-RUPTURA MÌNIMA 30KA-COM FUSÍVEL HH ABERTURA SOB CARGA"},{"$f":"IFERROR(VLOOKUP($C127,Orçamento!A134:E392,5,FALSE),0)","v":1},"UN",{"$f":"VLOOKUP($C127,Orçamento!A134:H393,8,FALSE)","v":3516.65},{"$f":"VLOOKUP($C127,Orçamento!A134:I393,9,FALSE)","v":3516.65},{"$f":"VLOOKUP($C127,Orçamento!A134:G393,7,FALSE)","v":0.22159999999999999},1.1122000000000001,null,"",null,""]
[{"$f":"'[1]Identificação-TCE'!$A$13","v":1},{"$f":"IF(AND(G128<>\"\",H128>0,I128<>\"\",J128<>0,K128<>0),COUNT($B$11:B127)+1,\"\")","v":117},{"$f":"Orçamento!A135","v":"10.51"},"CCU","CPUE 80","2022-02-11",{"$f":"VLOOKUP($C128,Orçamento!A135:C393,3,FALSE)","v":"PUNHO DE ACIONAMENTO DA SECCIONADORA C/ MICROINTERRUPTOR DO INTERTRAVAMENTO ELÉTRICO, DIRETAMENTE ATERRADO"},{"$f":"IFERROR(VLOOKUP($C128,Orçamento!A135:E393,5,FALSE),0)","v":1},"UN",{"$f":"VLOOKUP($C128,Orçamento!A135:H394,8,FALSE)","v":404.47},{"$f":"VLOOKUP($C128,Orçamento!A135:I394,9,FALSE)","v":404.47},{"$f":"VLOOKUP($C128,Orçamento!A135:G394,7,FALSE)","v":0.22159999999999999},1.1122000000000001,null,"",null,""]
[{"$f":"'[1]Identificação-TCE'!$A$13","v":1},{"$f":"IF(AND(G129<>\"\",H129>0,I129<>\"\",J129<>0,K129<>0),COUNT($B$11:B128)+1,\"\")","v":118},{"$f":"Orçamento!A136","v":"10.52"},"SINAPI","SINAPI 37558","2022-02-11",{"$f":"VLOOKUP($C129,Orçamento!A136:C394,3,FALSE)","v":"PLACA DE SINALIZAÇÃO DE SEGURANÇA CONTRA INCÊNDIO, FOTOLUMINISCENTE, RETANGULAR, 20X40CM EM PVC 2MM, ANTI-CHAMAS (SÍMBOLOS, CORES E PICTOGRAMAS CONFORME NBR 13434)"},{"$f":"IFERROR(VLOOKUP($C129,Orçamento!A136:E394,5,FALSE),0)","v":3},"UN",{"$f":"VLOOKUP($C129,Orçamento!A136:H395,8,FALSE)","v":45.5},{"$f":"VLOOKUP($C129,Orçamento!A136:I395,9,FALSE)","v":136.5},{"$f":"VLOOKUP($C129,Orçamento!A136:G395,7,FALSE)","v":0.22159999999999999},1.1122000000000001,null,"",null,""]
[{"$f":"'[1]Identificação-TCE'!$A$13","v":1},{"$f":"IF(AND(G130<>\"\",H130>0,I130<>\"\",J130<>0,K130<>0),COUNT($B$11:B129)+1,\"\")","v":119},{"$f":"Orçamento!A137","v":"10.53"},"CCU","CPUE 81","2022-02-11",{"$f":"VLOOKUP($C130,Orçamento!A137:C395,3,FALSE)","v":"QUADRO COM DIAGRAMA UNIFILAR DA SUBESTAÇÃO"},{"$f":"IFERROR(VLOOKUP($C130,Orçamento!A137:E395,5,FALSE),0)","v":1},"UN",{"$f":"VLOOKUP($C130,Orçamento!A137:H396,8,FALSE)","v":656.66},{"$f":"VLOOKUP($C130,Orçamento!A137:I396,9,FALSE)","v":656.66},{"$f":"VLOOKUP($C130,Orçamento!A137:G396,7,FALSE)","v":0.22159999999999999},1.1122000000000001,null,"",null,""]
[{"$f":"'[1]Identificação-TCE'!$A$13","v":1},{"$f":"IF(AND(G131<>\"\",H131>0,I131<>\"\",J131<>0,K131<>0),COUNT($B$11:B130)+1,\"\")","v":120},{"$f":"Orçamento!A138","v":"10.54"},"SINAPI","SINAPI 4796","2022-02-11",{"$f":"VLOOKUP($C131,Orçamento!A138:C396,3,FALSE)","v":"PISO DE BORRACHA FRISADO OU PASTILHADO, PRETO, EM PLACAS DE 50X50CM, E=7MM, PARA ARGAMASSA"},{"$f":"IFERROR(VLOOKUP($C131,Orçamento!A138:E396,5,FALSE),0)","v":0.25},{"$f":"VLOOKUP($C131,Orçamento!A138:D396,4,FALSE)","v":"M2"},{"$f":"VLOOKUP($C131,Orçamento!A138:H397,8,FALSE)","v":220.56},{"$f":"VLOOKUP($C131,Orçamento!A138:I397,9,FALSE)","v":55.14},{"$f":"VLOOKUP($C131,Orçamento!A138:G397,7,FALSE)","v":0.22159999999999999},1.1122000000000001,null,"",null,""]
[{"$f":"'[1]Identificação-TCE'!$A$13","v":1},{"$f":"IF(AND(G132<>\"\",H132>0,I132<>\"\",J132<>0,K132<>0),COUNT($B$11:B131)+1,\"\")","v":121},{"$f":"Orçamento!A140","v":"11.1"},"SINAPI","SINAPI 96635","2022-02-11",{"$f":"VLOOKUP($C132,Orçamento!A140:C398,3,FALSE)","v":"TUBO, PPR, DN 25, CLASSE PN 20, INSTALADO EM RAMAL OU SUB-RAMAL DE ÁGUA - FORNECIMENTO E INSTALAÇÃO. AF_06/2015"},{"$f":"IFERROR(VLOOKUP($C132,Orçamento!A140:E398,5,FALSE),0)","v":60},{"$f":"VLOOKUP($C132,Orçamento!A140:D398,4,FALSE)","v":"M"},{"$f":"VLOOKUP($C132,Orçamento!A140:H399,8,FALSE)","v":34.33},{"$f":"VLOOKUP($C132,Orçamento!A140:I399,9,FALSE)","v":2059.8000000000002},{"$f":"VLOOKUP($C132,Orçamento!A140:G399,7,FALSE)","v":0.22159999999999999},1.1122000000000001,null,"",null,""]
[{"$f":"'[1]Identificação-TCE'!$A$13","v":1},{"$f":"IF(AND(G133<>\"\",H133>0,I133<>\"\",J133<>0,K133<>0),COUNT($B$11:B132)+1,\"\")","v":122},{"$f":"Orçamento!A141","v":"11.2"},"SINAPI","SINAPI 89356","2022-02-11",{"$f":"VLOOKUP($C133,Orçamento!A141:C399,3,FALSE)","v":"TUBO, PVC, SOLDÁVEL, DN 25MM, INSTALADO EM RAMAL OU SUB-RAMAL DE ÁGUA - FORNECIMENTO E INSTALAÇÃO. AF_12/2014"},{"$f":"IFERROR(VLOOKUP($C133,Orçamento!A141:E399,5,FALSE),0)","v":157},{"$f":"VLOOKUP($C133,Orçamento!A141:D399,4,FALSE)","v":"M"},{"$f":"VLOOKUP($C133,Orçamento!A141:H400,8,FALSE)","v":26.18},{"$f":"VLOOKUP($C133,Orçamento!A141:I400,9,FALSE)","v":4110.26},{"$f":"VLOOKUP($C133,Orçamento!A141:G400,7,FALSE)","v":0.22159999999999999},1.1122000000000001,null,"",null,""]
[{"$f":"'[1]Identificação-TCE'!$A$13","v":1},{"$f":"IF(AND(G134<>\"\",H134>0,I134<>\"\",J134<>0,K134<>0),COUNT($B$11:B133)+1,\"\")","v":123},{"$f":"Orçamento!A142","v":"11.3"},"SINAPI","SINAPI 96645","2022-02-11",{"$f":"VLOOKUP($C134,Orçamento!A142:C400,3,FALSE)","v":"TUBO, PPR, DN 32, CLASSE PN 12, INSTALADO EM RAMAL DE DISTRIBUIÇÃO DE ÁGUA - FORNECIMENTO E INSTALAÇÃO. AF_06/2015"},{"$f":"IFERROR(VLOOKUP($C134,Orçamento!A142:E400,5,FALSE),0)","v":17},{"$f":"VLOOKUP($C134,Orçamento!A142:D400,4,FALSE)","v":"M"},{"$f":"VLOOKUP($C134,Orçamento!A142:H401,8,FALSE)","v":30.52},{"$f":"VLOOKUP($C134,Orçamento!A142:I401,9,FALSE)","v":518.84},{"$f":"VLOOKUP($C134,Orçamento!A142:G401,7,FALSE)","v":0.22159999999999999},1.1122000000000001,null,"",null,""]
[{"$f":"'[1]Identificação-TCE'!$A$13","v":1},{"$f":"IF(AND(G135<>\"\",H135>0,I135<>\"\",J135<>0,K135<>0),COUNT($B$11:B134)+1,\"\")","v":124},{"$f":"Orçamento!A143","v":"11.4"},"SINAPI","SINAPI 89357","2022-02-11",{"$f":"VLOOKUP($C135,Orçamento!A143:C401,3,FALSE)","v":"TUBO, PVC, SOLDÁVEL, DN 32MM, INSTALADO EM RAMAL OU SUB-RAMAL DE ÁGUA - FORNECIMENTO E INSTALAÇÃO. AF_12/2014"},{"$f":"IFERROR(VLOOKUP($C135,Orçamento!A143:E401,5,FALSE),0)","v":15},{"$f":"VLOOKUP($C135,Orçamento!A143:D401,4,FALSE)","v":"M"},{"$f":"VLOOKUP($C135,Orçamento!A143:H402,8,FALSE)","v":39.729999999999997},{"$f":"VLOOKUP($C135,Orçamento!A143:I402,9,FALSE)","v":595.95000000000005},{"$f":"VLOOKUP($C135,Orçamento!A143:G402,7,FALSE)","v":0.22159999999999999},1.1122000000000001,null,"",null,""]
[{"$f":"'[1]Identificação-TCE'!$A$13","v":1},{"$f":"IF(AND(G136<>\"\",H136>0,I136<>\"\",J136<>0,K136<>0),COUNT($B$11:B135)+1,\"\")","v":125},{"$f":"Orçamento!A144","v":"11.5"},"SINAPI","SINAPI 89448","2022-02-11",{"$f":"VLOOKUP($C136,Orçamento!A144:C402,3,FALSE)","v":"TUBO, PVC, SOLDÁVEL, DN 40MM, INSTALADO EM PRUMADA DE ÁGUA - FORNECIMENTO E INSTALAÇÃO. AF_12/2014"},{"$f":"IFERROR(VLOOKUP($C136,Orçamento!A144:E402,5,FALSE),0)","v":14},{"$f":"VLOOKUP($C136,Orçamento!A144:D402,4,FALSE)","v":"M"},{"$f":"VLOOKUP($C136,Orçamento!A144:H403,8,FALSE)","v":27.63},{"$f":"VLOOKUP($C136,Orçamento!A144:I403,9,FALSE)","v":386.82},{"$f":"VLOOKUP($C136,Orçamento!A144:G403,7,FALSE)","v":0.22159999999999999},1.1122000000000001,null,"",null,""]
[{"$f":"'[1]Identificação-TCE'!$A$13","v":1},{"$f":"IF(AND(G137<>\"\",H137>0,I137<>\"\",J137<>0,K137<>0),COUNT($B$11:B136)+1,\"\")","v":126},{"$f":"Orçamento!A145","v":"11.6"},"SINAPI","SINAPI 89711","2022-02-11",{"$f":"VLOOKUP($C137,Orçamento!A145:C403,3,FALSE)","v":"TUBO PVC SÉRIE NORMAL, ESGOTO PREDIAL, DN 40MM, FORNECIDO E INSTALADO EM RAMAL DE DESCARGA OU RAMAL DE ESGOTO SANITÁRIO. AF_12/2014"},{"$f":"IFERROR(VLOOKUP($C137,Orçamento!A145:E403,5,FALSE),0)","v":102},{"$f":"VLOOKUP($C137,Orçamento!A145:D403,4,FALSE)","v":"M"},{"$f":"VLOOKUP($C137,Orçamento!A145:H404,8,FALSE)","v":23.63},{"$f":"VLOOKUP($C137,Orçamento!A145:I404,9,FALSE)","v":2410.2600000000002},{"$f":"VLOOKUP($C137,Orçamento!A145:G404,7,FALSE)","v":0.22159999999999999},1.1122000000000001,null,"",null,""]
[{"$f":"'[1]Identificação-TCE'!$A$13","v":1},{"$f":"IF(AND(G138<>\"\",H138>0,I138<>\"\",J138<>0,K138<>0),COUNT($B$11:B137)+1,\"\")","v":127},{"$f":"Orçamento!A146","v":"11.7"},"SINAPI","SINAPI 89449","2022-02-11",{"$f":"VLOOKUP($C138,Orçamento!A146:C404,3,FALSE)","v":"TUBO, PVC, SOLDÁVEL, DN 50MM, INSTALADO EM PRUMADA DE ÁGUA - FORNECIMENTO E INSTALAÇÃO. AF_12/2014"},{"$f":"IFERROR(VLOOKUP($C138,Orçamento!A146:E404,5,FALSE),0)","v":40},{"$f":"VLOOKUP($C138,Orçamento!A146:D404,4,FALSE)","v":"M"},{"$f":"VLOOKUP($C138,Orçamento!A146:H405,8,FALSE)","v":31.74},{"$f":"VLOOKUP($C138,Orçamento!A146:I405,9,FALSE)","v":1269.5999999999999},{"$f":"VLOOKUP($C138,Orçamento!A146:G405,7,FALSE)","v":0.22159999999999999},1.1122000000000001,null,"",null,""]
[{"$f":"'[1]Identificação-TCE'!$A$13","v":1},{"$f":"IF(AND(G139<>\"\",H139>0,I139<>\"\",J139<>0,K139<>0),COUNT($B$11:B138)+1,\"\")","v":128},{"$f":"Orçamento!A147","v":"11.8"},"SINAPI","SINAPI 89712","2022-02-11",{"$f":"VLOOKUP($C139,Orçamento!A147:C405,3,FALSE)","v":"TUBO PVC SÉRIE NORMAL, ESGOTO PREDIAL, DN 50MM, FORNECIDO E INSTALADO EM RAMAL DE DESCARGA OU RAMAL DE ESGOTO SANITÁRIO. AF_12/2014"},{"$f":"IFERROR(VLOOKUP($C139,Orçamento!A147:E405,5,FALSE),0)","v":134},{"$f":"VLOOKUP($C139,Orçamento!A147:D405,4,FALSE)","v":"M"},{"$f":"VLOOKUP($C139,Orçamento!A147:H406,8,FALSE)","v":36.700000000000003},{"$f":"VLOOKUP($C139,Orçamento!A147:I406,9,FALSE)","v":4917.8},{"$f":"VLOOKUP($C139,Orçamento!A147:G406,7,FALSE)","v":0.22159999999999999},1.1122000000000001,null,"",null,""]
[{"$f":"'[1]Identificação-TCE'!$A$13","v":1},{"$f":"IF(AND(G140<>\"\",H140>0,I140<>\"\",J140<>0,K140<>0),COUNT($B$11:B139)+1,\"\")","v":129},{"$f":"Orçamento!A148","v":"11.9"},"SINAPI","SINAPI 89451","2022-02-11",{"$f":"VLOOKUP($C140,Orçamento!A148:C406,3,FALSE)","v":"TUBO, PVC, SOLDÁVEL, DN 75MM, INSTALADO EM PRUMADA DE ÁGUA - FORNECIMENTO E INSTALAÇÃO. AF_12/2014"},{"$f":"IFERROR(VLOOKUP($C140,Orçamento!A148:E406,5,FALSE),0)","v":155},{"$f":"VLOOKUP($C140,Orçamento!A148:D406,4,FALSE)","v":"M"},{"$f":"VLOOKUP($C140,Orçamento!A148:H407,8,FALSE)","v":87.76},{"$f":"VLOOKUP($C140,Orçamento!A148:I407,9,FALSE)","v":13602.8},{"$f":"VLOOKUP($C140,Orçamento!A148:G407,7,FALSE)","v":0.22159999999999999},1.1122000000000001,null,"",null,""]
[{"$f":"'[1]Identificação-TCE'!$A$13","v":1},{"$f":"IF(AND(G141<>\"\",H141>0,I141<>\"\",J141<>0,K141<>0),COUNT($B$11:B140)+1,\"\")","v":130},{"$f":"Orçamento!A149","v":"11.10"},"SINAPI","SINAPI 89713","2022-02-11",{"$f":"VLOOKUP($C141,Orçamento!A149:C407,3,FALSE)","v":"TUBO PVC SÉRIE NORMAL, ESGOTO PREDIAL, DN 75MM, FORNECIDO E INSTALADO EM RAMAL DE DESCARGA OU RAMAL DE ESGOTO SANITÁRIO. AF_12/2014"},{"$f":"IFERROR(VLOOKUP($C141,Orçamento!A149:E407,5,FALSE),0)","v":19},{"$f":"VLOOKUP($C141,Orçamento!A149:D407,4,FALSE)","v":"M"},{"$f":"VLOOKUP($C141,Orçamento!A149:H408,8,FALSE)","v":56.11},{"$f":"VLOOKUP($C141,Orçamento!A149:I408,9,FALSE)","v":1066.0899999999999},{"$f":"VLOOKUP($C141,Orçamento!A149:G408,7,FALSE)","v":0.22159999999999999},1.1122000000000001,null,"",null,""]
[{"$f":"'[1]Identificação-TCE'!$A$13","v":1},{"$f":"IF(AND(G142<>\"\",H142>0,I142<>\"\",J142<>0,K142<>0),COUNT($B$11:B141)+1,\"\")","v":131},{"$f":"Orçamento!A150","v":"11.11"},"SINAPI","SINAPI 89714","2022-02-11",{"$f":"VLOOKUP($C142,Orçamento!A150:C408,3,FALSE)","v":"TUBO PVC SÉRIE NORMAL, ESGOTO PREDIAL, DN 100MM, FORNECIDO E INSTALADO EM RAMAL DE DESCARGA OU RAMAL DE ESGOTO SANITÁRIO. AF_12/2014"},{"$f":"IFERROR(VLOOKUP($C142,Orçamento!A150:E408,5,FALSE),0)","v":43},{"$f":"VLOOKUP($C142,Orçamento!A150:D408,4,FALSE)","v":"M"},{"$f":"VLOOKUP($C142,Orçamento!A150:H409,8,FALSE)","v":71.180000000000007},{"$f":"VLOOKUP($C142,Orçamento!A150:I409,9,FALSE)","v":3060.74},{"$f":"VLOOKUP($C142,Orçamento!A150:G409,7,FALSE)","v":0.22159999999999999},1.1122000000000001,null,"",null,""]
[{"$f":"'[1]Identificação-TCE'!$A$13","v":1},{"$f":"IF(AND(G143<>\"\",H143>0,I143<>\"\",J143<>0,K143<>0),COUNT($B$11:B142)+1,\"\")","v":132},{"$f":"Orçamento!A151","v":"11.12"},"SINAPI","SINAPI 96650","2022-02-11",{"$f":"VLOOKUP($C143,Orçamento!A151:C409,3,FALSE)","v":"JOELHO 90 GRAUS, PPR, DN 25MM, CLASSE PN 25, INSTALADO EM RAMAL DE DISTRIBUIÇÃO - FORNECIMENTO E INSTALAÇÃO. AF_06/2015"},{"$f":"IFERROR(VLOOKUP($C143,Orçamento!A151:E409,5,FALSE),0)","v":62},"UN",{"$f":"VLOOKUP($C143,Orçamento!A151:H410,8,FALSE)","v":11.52},{"$f":"VLOOKUP($C143,Orçamento!A151:I410,9,FALSE)","v":714.24},{"$f":"VLOOKUP($C143,Orçamento!A151:G410,7,FALSE)","v":0.22159999999999999},1.1122000000000001,null,"",null,""]
[{"$f":"'[1]Identificação-TCE'!$A$13","v":1},{"$f":"IF(AND(G144<>\"\",H144>0,I144<>\"\",J144<>0,K144<>0),COUNT($B$11:B143)+1,\"\")","v":133},{"$f":"Orçamento!A152","v":"11.13"},"SINAPI","SINAPI 96665","2022-02-11",{"$f":"VLOOKUP($C144,Orçamento!A152:C410,3,FALSE)","v":"TÊ NORMAL, PPR, DN 25MM, CLASSE PN 25, INSTALADO EM RAMAL DE DISTRIBUIÇÃO DE ÁGUA - FORNECIMENTO E INSTALAÇÃO. AF_06/2015"},{"$f":"IFERROR(VLOOKUP($C144,Orçamento!A152:E410,5,FALSE),0)","v":13},"UN",{"$f":"VLOOKUP($C144,Orçamento!A152:H411,8,FALSE)","v":15.15},{"$f":"VLOOKUP($C144,Orçamento!A152:I411,9,FALSE)","v":196.95},{"$f":"VLOOKUP($C144,Orçamento!A152:G411,7,FALSE)","v":0.22159999999999999},1.1122000000000001,null,"",null,""]
[{"$f":"'[1]Identificação-TCE'!$A$13","v":1},{"$f":"IF(AND(G145<>\"\",H145>0,I145<>\"\",J145<>0,K145<>0),COUNT($B$11:B144)+1,\"\")","v":134},{"$f":"Orçamento!A153","v":"11.14"},"SINAPI","SINAPI 89408","2022-02-11",{"$f":"VLOOKUP($C145,Orçamento!A153:C411,3,FALSE)","v":"JOELHO 90 GRAUS, PVC, SOLDÁVEL, DN 25MM, INSTALADO EM RAMAL DE DISTRIBUIÇÃO DE ÁGUA - FORNECIMENTO E INSTALAÇÃO. AF_12/2014"},{"$f":"IFERROR(VLOOKUP($C145,Orçamento!A153:E411,5,FALSE),0)","v":113},"UN",{"$f":"VLOOKUP($C145,Orçamento!A153:H412,8,FALSE)","v":7.45},{"$f":"VLOOKUP($C145,Orçamento!A153:I412,9,FALSE)","v":841.85},{"$f":"VLOOKUP($C145,Orçamento!A153:G412,7,FALSE)","v":0.22159999999999999},1.1122000000000001,null,"",null,""]
[{"$f":"'[1]Identificação-TCE'!$A$13","v":1},{"$f":"IF(AND(G146<>\"\",H146>0,I146<>\"\",J146<>0,K146<>0),COUNT($B$11:B145)+1,\"\")","v":135},{"$f":"Orçamento!A154","v":"11.15"},"SINAPI","SINAPI 89395","2022-02-11",{"$f":"VLOOKUP($C146,Orçamento!A154:C412,3,FALSE)","v":"TÊ, PVC, SOLDÁVEL, DN 25MM, INSTALADO EM RAMAL OU SUB-RAMAL DE ÁGUA - FORNECIMENTO E INSTALAÇÃO. AF_12/2014"},{"$f":"IFERROR(VLOOKUP($C146,Orçamento!A154:E412,5,FALSE),0)","v":34},"UN",{"$f":"VLOOKUP($C146,Orçamento!A154:H413,8,FALSE)","v":14.74},{"$f":"VLOOKUP($C146,Orçamento!A154:I413,9,FALSE)","v":501.16},{"$f":"VLOOKUP($C146,Orçamento!A154:G413,7,FALSE)","v":0.22159999999999999},1.1122000000000001,null,"",null,""]
[{"$f":"'[1]Identificação-TCE'!$A$13","v":1},{"$f":"IF(AND(G147<>\"\",H147>0,I147<>\"\",J147<>0,K147<>0),COUNT($B$11:B146)+1,\"\")","v":136},{"$f":"Orçamento!A155","v":"11.16"},"SINAPI","SINAPI 96662","2022-02-11",{"$f":"VLOOKUP($C147,Orçamento!A155:C413,3,FALSE)","v":"BUCHA DE REDUÇÃO, PPR, 32X25, CLASSE PN 25, INSTALADO EM RAMAL DE DISTRIBUIÇÃO DE ÁGUA - FORNECIMENTO E INSTALAÇÃO. AF_06/2015"},{"$f":"IFERROR(VLOOKUP($C147,Orçamento!A155:E413,5,FALSE),0)","v":3},"UN",{"$f":"VLOOKUP($C147,Orçamento!A155:H414,8,FALSE)","v":15.04},{"$f":"VLOOKUP($C147,Orçamento!A155:I414,9,FALSE)","v":45.12},{"$f":"VLOOKUP($C147,Orçamento!A155:G414,7,FALSE)","v":0.22159999999999999},1.1122000000000001,null,"",null,""]
[{"$f":"'[1]Identificação-TCE'!$A$13","v":1},{"$f":"IF(AND(G148<>\"\",H148>0,I148<>\"\",J148<>0,K148<>0),COUNT($B$11:B147)+1,\"\")","v":137},{"$f":"Orçamento!A156","v":"11.17"},"SINAPI","SINAPI 89426","2022-02-11",{"$f":"VLOOKUP($C148,Orçamento!A156:C414,3,FALSE)","v":"LUVA DE REDUÇÃO, PVC, SOLDÁVEL, DN 32MMX25MM, INSTALADO EM RAMAL DE DISTRIBUIÇÃO DE ÁGUA - FORNECIMENTO E INSTALAÇÃO. AF_12/2014"},{"$f":"IFERROR(VLOOKUP($C148,Orçamento!A156:E414,5,FALSE),0)","v":3},"UN",{"$f":"VLOOKUP($C148,Orçamento!A156:H415,8,FALSE)","v":12.07},{"$f":"VLOOKUP($C148,Orçamento!A156:I415,9,FALSE)","v":36.21},{"$f":"VLOOKUP($C148,Orçamento!A156:G415,7,FALSE)","v":0.22159999999999999},1.1122000000000001,null,"",null,""]
[{"$f":"'[1]Identificação-TCE'!$A$13","v":1},{"$f":"IF(AND(G149<>\"\",H149>0,I149<>\"\",J149<>0,K149<>0),COUNT($B$11:B148)+1,\"\")","v":138},{"$f":"Orçamento!A157","v":"11.18"},"SINAPI","SINAPI 89413","2022-02-11",{"$f":"VLOOKUP($C149,Orçamento!A157:C415,3,FALSE)","v":"JOELHO 90 GRAUS, PVC, SOLDÁVEL, DN 32MM, INSTALADO EM RAMAL DE DISTRIBUIÇÃO DE ÁGUA - FORNECIMENTO E INSTALAÇÃO. AF_12/2014"},{"$f":"IFERROR(VLOOKUP($C149,Orçamento!A157:E415,5,FALSE),0)","v":20},"UN",{"$f":"VLOOKUP($C149,Orçamento!A157:H416,8,FALSE)","v":11.8},{"$f":"VLOOKUP($C149,Orçamento!A157:I416,9,FALSE)","v":236},{"$f":"VLOOKUP($C149,Orçamento!A157:G416,7,FALSE)","v":0.22159999999999999},1.1122000000000001,null,"",null,""]
[{"$f":"'[1]Identificação-TCE'!$A$13","v":1},{"$f":"IF(AND(G150<>\"\",H150>0,I150<>\"\",J150<>0,K150<>0),COUNT($B$11:B149)+1,\"\")","v":139},{"$f":"Orçamento!A158","v":"11.19"},"SINAPI","SINAPI 96686","2022-02-11",{"$f":"VLOOKUP($C150,Orçamento!A158:C416,3,FALSE)","v":"JOELHO 90 GRAUS, PPR, DN 32 MM, CLASSE PN 25, INSTALADO EM PRUMADA DE ÁGUA FORNECIMENTO E INSTALAÇÃO . AF_06/2015"},{"$f":"IFERROR(VLOOKUP($C150,Orçamento!A158:E416,5,FALSE),0)","v":16},"UN",{"$f":"VLOOKUP($C150,Orçamento!A158:H417,8,FALSE)","v":9.06},{"$f":"VLOOKUP($C150,Orçamento!A158:I417,9,FALSE)","v":144.96},{"$f":"VLOOKUP($C150,Orçamento!A158:G417,7,FALSE)","v":0.22159999999999999},1.1122000000000001,null,"",null,""]
[{"$f":"'[1]Identificação-TCE'!$A$13","v":1},{"$f":"IF(AND(G151<>\"\",H151>0,I151<>\"\",J151<>0,K151<>0),COUNT($B$11:B150)+1,\"\")","v":140},{"$f":"Orçamento!A159","v":"11.20"},"SINAPI","SINAPI 89497","2022-02-11",{"$f":"VLOOKUP($C151,Orçamento!A159:C417,3,FALSE)","v":"JOELHO 90 GRAUS, PVC, SOLDÁVEL, DN 40MM, INSTALADO EM PRUMADA DE ÁGUA - FORNECIMENTO E INSTALAÇÃO. AF_12/2014"},{"$f":"IFERROR(VLOOKUP($C151,Orçamento!A159:E417,5,FALSE),0)","v":14},"UN",{"$f":"VLOOKUP($C151,Orçamento!A159:H418,8,FALSE)","v":17.7},{"$f":"VLOOKUP($C151,Orçamento!A159:I418,9,FALSE)","v":247.8},{"$f":"VLOOKUP($C151,Orçamento!A159:G418,7,FALSE)","v":0.22159999999999999},1.1122000000000001,null,"",null,""]
[{"$f":"'[1]Identificação-TCE'!$A$13","v":1},{"$f":"IF(AND(G152<>\"\",H152>0,I152<>\"\",J152<>0,K152<>0),COUNT($B$11:B151)+1,\"\")","v":141},{"$f":"Orçamento!A160","v":"11.21"},"SINAPI","SINAPI 89724","2022-02-11",{"$f":"VLOOKUP($C152,Orçamento!A160:C418,3,FALSE)","v":"JOELHO 90 GRAUS, PVC, SERIE NORMAL, ESGOTO PREDIAL, DN 40MM, JUNTA SOLDÁVEL, FORNECIDO E INSTALADO EM RAMAL DE DESCARGA OU RAMAL DE ESGOTO SANITÁRIO. AF_12/2014"},{"$f":"IFERROR(VLOOKUP($C152,Orçamento!A160:E418,5,FALSE),0)","v":68},"UN",{"$f":"VLOOKUP($C152,Orçamento!A160:H419,8,FALSE)","v":13.39},{"$f":"VLOOKUP($C152,Orçamento!A160:I419,9,FALSE)","v":910.52},{"$f":"VLOOKUP($C152,Orçamento!A160:G419,7,FALSE)","v":0.22159999999999999},1.1122000000000001,null,"",null,""]
[{"$f":"'[1]Identificação-TCE'!$A$13","v":1},{"$f":"IF(AND(G153<>\"\",H153>0,I153<>\"\",J153<>0,K153<>0),COUNT($B$11:B152)+1,\"\")","v":142},{"$f":"Orçamento!A161","v":"11.22"},"SINAPI","SINAPI 89726","2022-02-11",{"$f":"VLOOKUP($C153,Orçamento!A161:C419,3,FALSE)","v":"JOELHO 45 GRAUS, PVC, SERIE NORMAL, ESGOTO PREDIAL, DN 40MM, JUNTA SOLDÁVEL, FORNECIDO E INSTALADO EM RAMAL DE DESCARGA OU RAMAL DE ESGOTO SANITÁRIO. AF_12/2014"},{"$f":"IFERROR(VLOOKUP($C153,Orçamento!A161:E419,5,FALSE),0)","v":80},"UN",{"$f":"VLOOKUP($C153,Orçamento!A161:H420,8,FALSE)","v":9.16},{"$f":"VLOOKUP($C153,Orçamento!A161:I420,9,FALSE)","v":732.8},{"$f":"VLOOKUP($C153,Orçamento!A161:G420,7,FALSE)","v":0.22159999999999999},1.1122000000000001,null,"",null,""]
[{"$f":"'[1]Identificação-TCE'!$A$13","v":1},{"$f":"IF(AND(G154<>\"\",H154>0,I154<>\"\",J154<>0,K154<>0),COUNT($B$11:B153)+1,\"\")","v":143},{"$f":"Orçamento!A162","v":"11.23"},"SINAPI","SINAPI 89783","2022-02-11",{"$f":"VLOOKUP($C154,Orçamento!A162:C420,3,FALSE)","v":"JUNÇÃO SIMPLES, PVC, SÉRIE NORMAL, ESGOTO PREDIAL, DN 40MM, JUNTA SOLDÁVEL, FORNECIDO E INSTALADO EM RAMAL DE DESCARGA OU RAMAL DE ESGOTO SANITÁRIO. AF_12/2014"},{"$f":"IFERROR(VLOOKUP($C154,Orçamento!A162:E420,5,FALSE),0)","v":28},"UN",{"$f":"VLOOKUP($C154,Orçamento!A162:H421,8,FALSE)","v":15.88},{"$f":"VLOOKUP($C154,Orçamento!A162:I421,9,FALSE)","v":444.64},{"$f":"VLOOKUP($C154,Orçamento!A162:G421,7,FALSE)","v":0.22159999999999999},1.1122000000000001,null,"",null,""]
[{"$f":"'[1]Identificação-TCE'!$A$13","v":1},{"$f":"IF(AND(G155<>\"\",H155>0,I155<>\"\",J155<>0,K155<>0),COUNT($B$11:B154)+1,\"\")","v":144},{"$f":"Orçamento!A163","v":"11.24"},"SINAPI","SINAPI 89501","2022-02-11",{"$f":"VLOOKUP($C155,Orçamento!A163:C421,3,FALSE)","v":"JOELHO 90 GRAUS, PVC, SOLDÁVEL, DN 50MM, INSTALADO EM PRUMADA DE ÁGUA - FORNECIMENTO E INSTALAÇÃO. AF_12/2014"},{"$f":"IFERROR(VLOOKUP($C155,Orçamento!A163:E421,5,FALSE),0)","v":35},"UN",{"$f":"VLOOKUP($C155,Orçamento!A163:H422,8,FALSE)","v":20.96},{"$f":"VLOOKUP($C155,Orçamento!A163:I422,9,FALSE)","v":733.6},{"$f":"VLOOKUP($C155,Orçamento!A163:G422,7,FALSE)","v":0.22159999999999999},1.1122000000000001,null,"",null,""]
[{"$f":"'[1]Identificação-TCE'!$A$13","v":1},{"$f":"IF(AND(G156<>\"\",H156>0,I156<>\"\",J156<>0,K156<>0),COUNT($B$11:B155)+1,\"\")","v":145},{"$f":"Orçamento!A164","v":"11.25"},"SINAPI","SINAPI 89732","2022-02-11",{"$f":"VLOOKUP($C156,Orçamento!A164:C422,3,FALSE)","v":"JOELHO 45 GRAUS, PVC, SÉRIE NORMAL, ESGOTO PREDIAL, DN 50MM, JUNTA ELÁSTICA, FORNECIDO E INSTALADO  EM RAMAL DE DESCARGA OU ESGOTO SANITÁRIO. AF_12/2014"},{"$f":"IFERROR(VLOOKUP($C156,Orçamento!A164:E422,5,FALSE),0)","v":59},"UN",{"$f":"VLOOKUP($C156,Orçamento!A164:H423,8,FALSE)","v":14.54},{"$f":"VLOOKUP($C156,Orçamento!A164:I423,9,FALSE)","v":857.86},{"$f":"VLOOKUP($C156,Orçamento!A164:G423,7,FALSE)","v":0.22159999999999999},1.1122000000000001,null,"",null,""]
[{"$f":"'[1]Identificação-TCE'!$A$13","v":1},{"$f":"IF(AND(G157<>\"\",H157>0,I157<>\"\",J157<>0,K157<>0),COUNT($B$11:B156)+1,\"\")","v":146},{"$f":"Orçamento!A165","v":"11.26"},"SINAPI","SINAPI 89731","2022-02-11",{"$f":"VLOOKUP($C157,Orçamento!A165:C423,3,FALSE)","v":"JOELHO 90 GRAUS, PVC, SÉRIE NORMAL, ESGOTO PREDIAL, DN 50M, JUNTA ELÁSTICA, FORNECIDO E INSTALADO EM REMAL DE DESCARGA OU RAMAL DE ESGOTO SANITÁRIO. AF_12/2014"},{"$f":"IFERROR(VLOOKUP($C157,Orçamento!A165:E423,5,FALSE),0)","v":50},"UN",{"$f":"VLOOKUP($C157,Orçamento!A165:H424,8,FALSE)","v":13.54},{"$f":"VLOOKUP($C157,Orçamento!A165:I424,9,FALSE)","v":677},{"$f":"VLOOKUP($C157,Orçamento!A165:G424,7,FALSE)","v":0.22159999999999999},1.1122000000000001,null,"",null,""]
[{"$f":"'[1]Identificação-TCE'!$A$13","v":1},{"$f":"IF(AND(G158<>\"\",H158>0,I158<>\"\",J158<>0,K158<>0),COUNT($B$11:B157)+1,\"\")","v":147},{"$f":"Orçamento!A166","v":"11.27"},"SINAPI","SINAPI 89625","2022-02-11",{"$f":"VLOOKUP($C158,Orçamento!A166:C424,3,FALSE)","v":"TÊ, PVC, SOLDÁVEL, DN 50MM, INSTALADO EM PRUMADA DE ÁGUA - FORNECIMENTO E INSTALAÇÃO. AF_12/2014"},{"$f":"IFERROR(VLOOKUP($C158,Orçamento!A166:E424,5,FALSE),0)","v":15},"UN",{"$f":"VLOOKUP($C158,Orçamento!A166:H425,8,FALSE)","v":33.950000000000003},{"$f":"VLOOKUP($C158,Orçamento!A166:I425,9,FALSE)","v":509.25},{"$f":"VLOOKUP($C158,Orçamento!A166:G425,7,FALSE)","v":0.22159999999999999},1.1122000000000001,null,"",null,""]
[{"$f":"'[1]Identificação-TCE'!$A$13","v":1},{"$f":"IF(AND(G159<>\"\",H159>0,I159<>\"\",J159<>0,K159<>0),COUNT($B$11:B158)+1,\"\")","v":148},{"$f":"Orçamento!A167","v":"11.28"},"SINAPI","SINAPI 89785","2022-02-11",{"$f":"VLOOKUP($C159,Orçamento!A167:C425,3,FALSE)","v":"JUNÇÃO SIMPLES, PVC, SÉRIE NORMAL, ESGOTO PREDIAL, DN 50X50MM, JUNTA ELÁSTICA, FORNECIDO E INSTALADO EM RAMAL DE DESCARGA OU RAMAL DE ESGOTO SANITÁRIO. AF_12/2014"},{"$f":"IFERROR(VLOOKUP($C159,Orçamento!A167:E425,5,FALSE),0)","v":31},"UN",{"$f":"VLOOKUP($C159,Orçamento!A167:H426,8,FALSE)","v":28.94},{"$f":"VLOOKUP($C159,Orçamento!A167:I426,9,FALSE)","v":897.14},{"$f":"VLOOKUP($C159,Orçamento!A167:G426,7,FALSE)","v":0.22159999999999999},1.1122000000000001,null,"",null,""]
[{"$f":"'[1]Identificação-TCE'!$A$13","v":1},{"$f":"IF(AND(G160<>\"\",H160>0,I160<>\"\",J160<>0,K160<>0),COUNT($B$11:B159)+1,\"\")","v":149},{"$f":"Orçamento!A168","v":"11.29"},"SINAPI","SINAPI 89630","2022-02-11",{"$f":"VLOOKUP($C160,Orçamento!A168:C426,3,FALSE)","v":"TÊ DE REDUÇÃO, PVC, SOLDÁVEL, DN 75MMX50MM, INSTALADO EM PRUMADA DE ÁGUA - FORNECIMENTO E INSTALAÇÃO. AF_12/2014"},{"$f":"IFERROR(VLOOKUP($C160,Orçamento!A168:E426,5,FALSE),0)","v":22},"UN",{"$f":"VLOOKUP($C160,Orçamento!A168:H427,8,FALSE)","v":126.73},{"$f":"VLOOKUP($C160,Orçamento!A168:I427,9,FALSE)","v":2788.06},{"$f":"VLOOKUP($C160,Orçamento!A168:G427,7,FALSE)","v":0.22159999999999999},1.1122000000000001,null,"",null,""]
[{"$f":"'[1]Identificação-TCE'!$A$13","v":1},{"$f":"IF(AND(G161<>\"\",H161>0,I161<>\"\",J161<>0,K161<>0),COUNT($B$11:B160)+1,\"\")","v":150},{"$f":"Orçamento!A169","v":"11.30"},"SINAPI","SINAPI 89665","2022-02-11",{"$f":"VLOOKUP($C161,Orçamento!A169:C427,3,FALSE)","v":"REDUÇÃO EXCÊNTRICA, PVC, SÉRIE R, ÁGUA PLUVIAL, DN 75X50MM, JUNTA ELÁSTICA, FORNECIDO E INSTALADO EM CONDUTORES VERTICAIS DE ÁGUAS PLUVIAIS. AF_12/2014"},{"$f":"IFERROR(VLOOKUP($C161,Orçamento!A169:E427,5,FALSE),0)","v":3},"UN",{"$f":"VLOOKUP($C161,Orçamento!A169:H428,8,FALSE)","v":19.190000000000001},{"$f":"VLOOKUP($C161,Orçamento!A169:I428,9,FALSE)","v":57.57},{"$f":"VLOOKUP($C161,Orçamento!A169:G428,7,FALSE)","v":0.22159999999999999},1.1122000000000001,null,"",null,""]
[{"$f":"'[1]Identificação-TCE'!$A$13","v":1},{"$f":"IF(AND(G162<>\"\",H162>0,I162<>\"\",J162<>0,K162<>0),COUNT($B$11:B161)+1,\"\")","v":151},{"$f":"Orçamento!A170","v":"11.31"},"SINAPI","SINAPI 94682","2022-02-11",{"$f":"VLOOKUP($C162,Orçamento!A170:C428,3,FALSE)","v":"JOELHO 90 GRAUS, PVC, SOLDÁVEL, DN 75MM, INSTALADO EM RESERVAÇÃO DE ÁGUA DE EDIFICAÇÃO QUE POSSUA RESERVATÓRIO DE FIBRA/FIBROCIMENTO - FORNECIMENTO E INSTALAÇÃO. AF_06/2016"},{"$f":"IFERROR(VLOOKUP($C162,Orçamento!A170:E428,5,FALSE),0)","v":24},"UN",{"$f":"VLOOKUP($C162,Orçamento!A170:H429,8,FALSE)","v":210.76},{"$f":"VLOOKUP($C162,Orçamento!A170:I429,9,FALSE)","v":5058.24},{"$f":"VLOOKUP($C162,Orçamento!A170:G429,7,FALSE)","v":0.22159999999999999},1.1122000000000001,null,"",null,""]
[{"$f":"'[1]Identificação-TCE'!$A$13","v":1},{"$f":"IF(AND(G163<>\"\",H163>0,I163<>\"\",J163<>0,K163<>0),COUNT($B$11:B162)+1,\"\")","v":152},{"$f":"Orçamento!A171","v":"11.32"},"SINAPI","SINAPI 89805","2022-02-11",{"$f":"VLOOKUP($C163,Orçamento!A171:C429,3,FALSE)","v":"JOELHO 90 GRAUS, PVC, SÉRIE NORMAL, ESGOTO PREDIAL, DN 75MM, JUNTA ELÁSTICA, FORNECIDO E INSTALADO EM PRUMADA DE ESGOTO SANITÁRIO OU VENTILAÇÃO. AF_12/2014"},{"$f":"IFERROR(VLOOKUP($C163,Orçamento!A171:E429,5,FALSE),0)","v":9},"UN",{"$f":"VLOOKUP($C163,Orçamento!A171:H430,8,FALSE)","v":19.170000000000002},{"$f":"VLOOKUP($C163,Orçamento!A171:I430,9,FALSE)","v":172.53},{"$f":"VLOOKUP($C163,Orçamento!A171:G430,7,FALSE)","v":0.22159999999999999},1.1122000000000001,null,"",null,""]
[{"$f":"'[1]Identificação-TCE'!$A$13","v":1},{"$f":"IF(AND(G164<>\"\",H164>0,I164<>\"\",J164<>0,K164<>0),COUNT($B$11:B163)+1,\"\")","v":153},{"$f":"Orçamento!A172","v":"11.33"},"SINAPI","SINAPI 94697","2022-02-11",{"$f":"VLOOKUP($C164,Orçamento!A172:C430,3,FALSE)","v":"TÊ, PVC, SOLDÁVEL, DN 75MM INSTALADO EM RESERVAÇÃO DE ÁGUA DE EDIFICAÇÃO QUE POSSUA RESERVATÓRIO DE FIBRA/FIBROCIMENTO - FORNECIMENTO E INSTALAÇÃO. AF_06/2016"},{"$f":"IFERROR(VLOOKUP($C164,Orçamento!A172:E430,5,FALSE),0)","v":13},"UN",{"$f":"VLOOKUP($C164,Orçamento!A172:H431,8,FALSE)","v":155.88999999999999},{"$f":"VLOOKUP($C164,Orçamento!A172:I431,9,FALSE)","v":2026.57},{"$f":"VLOOKUP($C164,Orçamento!A172:G431,7,FALSE)","v":0.22159999999999999},1.1122000000000001,null,"",null,""]
[{"$f":"'[1]Identificação-TCE'!$A$13","v":1},{"$f":"IF(AND(G165<>\"\",H165>0,I165<>\"\",J165<>0,K165<>0),COUNT($B$11:B164)+1,\"\")","v":154},{"$f":"Orçamento!A173","v":"11.34"},"SINAPI","SINAPI 89565","2022-02-11",{"$f":"VLOOKUP($C165,Orçamento!A173:C431,3,FALSE)","v":"JUNÇÃO SIMPLES, PVC, SÉRIE R, ÁGUA PLUVIAL, DN 75X75MM, JUNTA ELÁSTICA, FORNECIDO E INSTALADO EM RAMAL DE ENCAMINHAMENTO. AF_12/2014"},{"$f":"IFERROR(VLOOKUP($C165,Orçamento!A173:E431,5,FALSE),0)","v":10},"UN",{"$f":"VLOOKUP($C165,Orçamento!A173:H432,8,FALSE)","v":77.209999999999994},{"$f":"VLOOKUP($C165,Orçamento!A173:I432,9,FALSE)","v":772.1},{"$f":"VLOOKUP($C165,Orçamento!A173:G432,7,FALSE)","v":0.22159999999999999},1.1122000000000001,null,"",null,""]
[{"$f":"'[1]Identificação-TCE'!$A$13","v":1},{"$f":"IF(AND(G166<>\"\",H166>0,I166<>\"\",J166<>0,K166<>0),COUNT($B$11:B165)+1,\"\")","v":155},{"$f":"Orçamento!A174","v":"11.35"},"SINAPI","SINAPI 89566","2022-02-11",{"$f":"VLOOKUP($C166,Orçamento!A174:C432,3,FALSE)","v":"TÊ, PVC, SÉRIE R, ÁGUA PLUVIAL, DN 75MM, JUNTA ELÁSTICA - FORNECIDO E INSTALADO EM RAMAL DE ENCAMINHAMENTO. AF_12/2014"},{"$f":"IFERROR(VLOOKUP($C166,Orçamento!A174:E432,5,FALSE),0)","v":13},"UN",{"$f":"VLOOKUP($C166,Orçamento!A174:H433,8,FALSE)","v":65.650000000000006},{"$f":"VLOOKUP($C166,Orçamento!A174:I433,9,FALSE)","v":853.45},{"$f":"VLOOKUP($C166,Orçamento!A174:G433,7,FALSE)","v":0.22159999999999999},1.1122000000000001,null,"",null,""]
[{"$f":"'[1]Identificação-TCE'!$A$13","v":1},{"$f":"IF(AND(G167<>\"\",H167>0,I167<>\"\",J167<>0,K167<>0),COUNT($B$11:B166)+1,\"\")","v":156},{"$f":"Orçamento!A175","v":"11.36"},"SINAPI","SINAPI 89673","2022-02-11",{"$f":"VLOOKUP($C167,Orçamento!A175:C433,3,FALSE)","v":"REDUÇÃO EXCÊNTRICA, PVC, SERIE R, ÁGUA PLUVIAL, DN 100 X 75 MM, JUNTA ELÁSTICA, FORNECIDO E INSTALADO EM CONDUTORES VERTICAIS DE ÁGUAS PLUVIAIS. AF_12/2014"},{"$f":"IFERROR(VLOOKUP($C167,Orçamento!A175:E433,5,FALSE),0)","v":12},"UN",{"$f":"VLOOKUP($C167,Orçamento!A175:H434,8,FALSE)","v":39.21},{"$f":"VLOOKUP($C167,Orçamento!A175:I434,9,FALSE)","v":470.52},{"$f":"VLOOKUP($C167,Orçamento!A175:G434,7,FALSE)","v":0.22159999999999999},1.1122000000000001,null,"",null,""]
[{"$f":"'[1]Identificação-TCE'!$A$13","v":1},{"$f":"IF(AND(G168<>\"\",H168>0,I168<>\"\",J168<>0,K168<>0),COUNT($B$11:B167)+1,\"\")","v":157},{"$f":"Orçamento!A176","v":"11.37"},"SINAPI","SINAPI 89745","2022-02-11",{"$f":"VLOOKUP($C168,Orçamento!A176:C434,3,FALSE)","v":"CONECTOR, CPVC, SOLDÁVEL, DN 22MMX1/2, INSTALADO EM RAMAL DE DISTRIBUIÇÃO DE ÁGUA - FORNECIMENTO E INSTALAÇÃO. AF_12/2014"},{"$f":"IFERROR(VLOOKUP($C168,Orçamento!A176:E434,5,FALSE),0)","v":13},"UN",{"$f":"VLOOKUP($C168,Orçamento!A176:H435,8,FALSE)","v":41.17},{"$f":"VLOOKUP($C168,Orçamento!A176:I435,9,FALSE)","v":535.21},{"$f":"VLOOKUP($C168,Orçamento!A176:G435,7,FALSE)","v":0.22159999999999999},1.1122000000000001,null,"",null,""]
[{"$f":"'[1]Identificação-TCE'!$A$13","v":1},{"$f":"IF(AND(G169<>\"\",H169>0,I169<>\"\",J169<>0,K169<>0),COUNT($B$11:B168)+1,\"\")","v":158},{"$f":"Orçamento!A177","v":"11.38"},"SINAPI","SINAPI 89746","2022-02-11",{"$f":"VLOOKUP($C169,Orçamento!A177:C435,3,FALSE)","v":"JOELHO 45 GRAUS, PVC, SÉRIE NORMAL, ESGOTO PREDIAL, DN 100MM, JUNTA ELÁSTICA, FORNECIDO E INSTALADO  EM RAMAL DE DESCARGA OU ESGOTO SANITÁRIO. AF_12/2014"},{"$f":"IFERROR(VLOOKUP($C169,Orçamento!A177:E435,5,FALSE),0)","v":31},"UN",{"$f":"VLOOKUP($C169,Orçamento!A177:H436,8,FALSE)","v":31.52},{"$f":"VLOOKUP($C169,Orçamento!A177:I436,9,FALSE)","v":977.12},{"$f":"VLOOKUP($C169,Orçamento!A177:G436,7,FALSE)","v":0.22159999999999999},1.1122000000000001,null,"",null,""]
[{"$f":"'[1]Identificação-TCE'!$A$13","v":1},{"$f":"IF(AND(G170<>\"\",H170>0,I170<>\"\",J170<>0,K170<>0),COUNT($B$11:B169)+1,\"\")","v":159},{"$f":"Orçamento!A178","v":"11.39"},"SINAPI","SINAPI 89797","2022-02-11",{"$f":"VLOOKUP($C170,Orçamento!A178:C436,3,FALSE)","v":"JUNÇÃO SIMPLES, PVC, SÉRIE NORMAL, ESGOTO PREDIAL, DN 100X100MM, JUNTA ELÁSTICA, FORNECIDO E INSTALADO EM RAMAL DE DESCARGA OU RAMAL DE ESGOTO SANITÁRIO. AF_12/2014"},{"$f":"IFERROR(VLOOKUP($C170,Orçamento!A178:E436,5,FALSE),0)","v":22},"UN",{"$f":"VLOOKUP($C170,Orçamento!A178:H437,8,FALSE)","v":63.12},{"$f":"VLOOKUP($C170,Orçamento!A178:I437,9,FALSE)","v":1388.64},{"$f":"VLOOKUP($C170,Orçamento!A178:G437,7,FALSE)","v":0.22159999999999999},1.1122000000000001,null,"",null,""]
[{"$f":"'[1]Identificação-TCE'!$A$13","v":1},{"$f":"IF(AND(G171<>\"\",H171>0,I171<>\"\",J171<>0,K171<>0),COUNT($B$11:B170)+1,\"\")","v":160},{"$f":"Orçamento!A179","v":"11.40"},"SINAPI","SINAPI 89709","2022-02-11",{"$f":"VLOOKUP($C171,Orçamento!A179:C437,3,FALSE)","v":"RALO SIFONADO, PVC, DN 100X40MM, JUNTA SOLDÁVEL, FORNECIDO E INSTALADO EM RAMAL DE DESCARGA OU EM RAMAL DE ESGOTO SANITÁRIO. AF_12/2014"},{"$f":"IFERROR(VLOOKUP($C171,Orçamento!A179:E437,5,FALSE),0)","v":17},"UN",{"$f":"VLOOKUP($C171,Orçamento!A179:H438,8,FALSE)","v":22.05},{"$f":"VLOOKUP($C171,Orçamento!A179:I438,9,FALSE)","v":374.85},{"$f":"VLOOKUP($C171,Orçamento!A179:G438,7,FALSE)","v":0.22159999999999999},1.1122000000000001,null,"",null,""]
[{"$f":"'[1]Identificação-TCE'!$A$13","v":1},{"$f":"IF(AND(G172<>\"\",H172>0,I172<>\"\",J172<>0,K172<>0),COUNT($B$11:B171)+1,\"\")","v":161},{"$f":"Orçamento!A180","v":"11.41"},"SINAPI","SINAPI 98110","2022-02-11",{"$f":"VLOOKUP($C172,Orçamento!A180:C438,3,FALSE)","v":"CAIXA DE GORDURA PEQUENA (CAPACIDADE: 19L), CIRCULAR, EM PVC, DIÂMETRO INTERNO  = 0,3M. AF_12/2020"},{"$f":"IFERROR(VLOOKUP($C172,Orçamento!A180:E438,5,FALSE),0)","v":3},"UN",{"$f":"VLOOKUP($C172,Orçamento!A180:H439,8,FALSE)","v":567.4},{"$f":"VLOOKUP($C172,Orçamento!A180:I439,9,FALSE)","v":1702.2},{"$f":"VLOOKUP($C172,Orçamento!A180:G439,7,FALSE)","v":0.22159999999999999},1.1122000000000001,null,"",null,""]
[{"$f":"'[1]Identificação-TCE'!$A$13","v":1},{"$f":"IF(AND(G173<>\"\",H173>0,I173<>\"\",J173<>0,K173<>0),COUNT($B$11:B172)+1,\"\")","v":162},{"$f":"Orçamento!A181","v":"11.42"},"SINAPI","SINAPI 89354","2022-02-11",{"$f":"VLOOKUP($C173,Orçamento!A181:C439,3,FALSE)","v":"MISTURADOR MONOCOMANDO PARA CHUVEIRO, BASE BRUTA E ACABAMENTO CROMADO - FORNECIDO E INSTALADO EM RAMAL DE ÁGUA. AF_12/2014"},{"$f":"IFERROR(VLOOKUP($C173,Orçamento!A181:E439,5,FALSE),0)","v":16},"UN",{"$f":"VLOOKUP($C173,Orçamento!A181:H440,8,FALSE)","v":952.15},{"$f":"VLOOKUP($C173,Orçamento!A181:I440,9,FALSE)","v":15234.4},{"$f":"VLOOKUP($C173,Orçamento!A181:G440,7,FALSE)","v":0.22159999999999999},1.1122000000000001,null,"",null,""]
[{"$f":"'[1]Identificação-TCE'!$A$13","v":1},{"$f":"IF(AND(G174<>\"\",H174>0,I174<>\"\",J174<>0,K174<>0),COUNT($B$11:B173)+1,\"\")","v":163},{"$f":"Orçamento!A182","v":"11.43"},"SINAPI","SINAPI 89491","2022-02-11",{"$f":"VLOOKUP($C174,Orçamento!A182:C440,3,FALSE)","v":"CAIXA SIFONADA, PVC, DN 150X185X75MM, FORNECIDA E INSTALADA EM RAMAIS DE ENCAMINHAMENTO DE ÁGUA PLUVIAL. AF_12/2014"},{"$f":"IFERROR(VLOOKUP($C174,Orçamento!A182:E440,5,FALSE),0)","v":16},"UN",{"$f":"VLOOKUP($C174,Orçamento!A182:H441,8,FALSE)","v":118.3},{"$f":"VLOOKUP($C174,Orçamento!A182:I441,9,FALSE)","v":1892.8},{"$f":"VLOOKUP($C174,Orçamento!A182:G441,7,FALSE)","v":0.22159999999999999},1.1122000000000001,null,"",null,""]
[{"$f":"'[1]Identificação-TCE'!$A$13","v":1},{"$f":"IF(AND(G175<>\"\",H175>0,I175<>\"\",J175<>0,K175<>0),COUNT($B$11:B174)+1,\"\")","v":164},{"$f":"Orçamento!A183","v":"11.44"},"SINAPI","SINAPI 99635","2022-02-11",{"$f":"VLOOKUP($C175,Orçamento!A183:C441,3,FALSE)","v":"VÁLVULA DE DESCARGA METÁLICA, BASE 1 1/2\", ACABAMENTO METÁLICO CROMADO - FORNECIMENTO E INSTALAÇÃO. AF_01/2019"},{"$f":"IFERROR(VLOOKUP($C175,Orçamento!A183:E441,5,FALSE),0)","v":12},"UN",{"$f":"VLOOKUP($C175,Orçamento!A183:H442,8,FALSE)","v":369.2},{"$f":"VLOOKUP($C175,Orçamento!A183:I442,9,FALSE)","v":4430.3999999999996},{"$f":"VLOOKUP($C175,Orçamento!A183:G442,7,FALSE)","v":0.22159999999999999},1.1122000000000001,null,"",null,""]
[{"$f":"'[1]Identificação-TCE'!$A$13","v":1},{"$f":"IF(AND(G176<>\"\",H176>0,I176<>\"\",J176<>0,K176<>0),COUNT($B$11:B175)+1,\"\")","v":165},{"$f":"Orçamento!A184","v":"11.45"},"SINAPI","SINAPI 94489","2022-02-11",{"$f":"VLOOKUP($C176,Orçamento!A184:C442,3,FALSE)","v":"REGISTRO DE ESFERA, PVC, SOLDÁVEL, DN 25MM, INSTALADO EM RESERVAÇÃO DE ÁGUA DE EDIFIAÇÃO QUE POSSUA RESERVATÓRIO DE FIBRA/FIBROCIMENTO - FORNECIMENTO E INSTALAÇÃO. AF_06/2016"},{"$f":"IFERROR(VLOOKUP($C176,Orçamento!A184:E442,5,FALSE),0)","v":5},"UN",{"$f":"VLOOKUP($C176,Orçamento!A184:H443,8,FALSE)","v":43.02},{"$f":"VLOOKUP($C176,Orçamento!A184:I443,9,FALSE)","v":215.1},{"$f":"VLOOKUP($C176,Orçamento!A184:G443,7,FALSE)","v":0.22159999999999999},1.1122000000000001,null,"",null,""]
[{"$f":"'[1]Identificação-TCE'!$A$13","v":1},{"$f":"IF(AND(G177<>\"\",H177>0,I177<>\"\",J177<>0,K177<>0),COUNT($B$11:B176)+1,\"\")","v":166},{"$f":"Orçamento!A185","v":"11.46"},"SINAPI","SINAPI 94490","2022-02-11",{"$f":"VLOOKUP($C177,Orçamento!A185:C443,3,FALSE)","v":"REGISTRO DE ESFERA, PVC, SOLDÁVEL, DN 32MM, INSTALADO EM RESERVAÇÃO DE ÁGUA DE EDIFIAÇÃO QUE POSSUA RESERVATÓRIO DE FIBRA/FIBROCIMENTO - FORNECIMENTO E INSTALAÇÃO. AF_06/2016"},{"$f":"IFERROR(VLOOKUP($C177,Orçamento!A185:E443,5,FALSE),0)","v":5},"UN",{"$f":"VLOOKUP($C177,Orçamento!A185:H444,8,FALSE)","v":64.709999999999994},{"$f":"VLOOKUP($C177,Orçamento!A185:I444,9,FALSE)","v":323.55},{"$f":"VLOOKUP($C177,Orçamento!A185:G444,7,FALSE)","v":0.22159999999999999},1.1122000000000001,null,"",null,""]
[{"$f":"'[1]Identificação-TCE'!$A$13","v":1},{"$f":"IF(AND(G178<>\"\",H178>0,I178<>\"\",J178<>0,K178<>0),COUNT($B$11:B177)+1,\"\")","v":167},{"$f":"Orçamento!A186","v":"11.47"},"SINAPI","SINAPI 94493","2022-02-11",{"$f":"VLOOKUP($C178,Orçamento!A186:C444,3,FALSE)","v":"REGISTRO DE ESFERA, PVC, SOLDÁVEL, DN 60MM, INSTALADO EM RESERVAÇÃO DE ÁGUA DE EDIFICAÇÃO QUE POSSUA RESERVATÓRIO DE FIBRA/FIBROCIMENTO - FORNECIMENTO E INSTALAÇÃO. AF_06/2016"},{"$f":"IFERROR(VLOOKUP($C178,Orçamento!A186:E444,5,FALSE),0)","v":2},"UN",{"$f":"VLOOKUP($C178,Orçamento!A186:H445,8,FALSE)","v":166.47},{"$f":"VLOOKUP($C178,Orçamento!A186:I445,9,FALSE)","v":332.94},{"$f":"VLOOKUP($C178,Orçamento!A186:G445,7,FALSE)","v":0.22159999999999999},1.1122000000000001,null,"",null,""]
[{"$f":"'[1]Identificação-TCE'!$A$13","v":1},{"$f":"IF(AND(G179<>\"\",H179>0,I179<>\"\",J179<>0,K179<>0),COUNT($B$11:B178)+1,\"\")","v":168},{"$f":"Orçamento!A187","v":"11.48"},"CCU","CPUE 82","2022-02-11",{"$f":"VLOOKUP($C179,Orçamento!A187:C445,3,FALSE)","v":"CALDEIRA MURAL GLP, POTÊNCIA NOMINAL 69,0KW, VAZÃO 42,5 L/MINM COM CHAMINÉ INCLUSA"},{"$f":"IFERROR(VLOOKUP($C179,Orçamento!A187:E445,5,FALSE),0)","v":2},"UN",{"$f":"VLOOKUP($C179,Orçamento!A187:H446,8,FALSE)","v":14284.71},{"$f":"VLOOKUP($C179,Orçamento!A187:I446,9,FALSE)","v":28569.42},{"$f":"VLOOKUP($C179,Orçamento!A187:G446,7,FALSE)","v":0.22159999999999999},1.1122000000000001,null,"",null,""]
[{"$f":"'[1]Identificação-TCE'!$A$13","v":1},{"$f":"IF(AND(G180<>\"\",H180>0,I180<>\"\",J180<>0,K180<>0),COUNT($B$11:B179)+1,\"\")","v":169},{"$f":"Orçamento!A188","v":"11.49"},"CCU","CPUE 83","2022-02-11",{"$f":"VLOOKUP($C180,Orçamento!A188:C446,3,FALSE)","v":"RESERVATÓRIO DE ÁGUA QUENTE 300 LITROS"},{"$f":"IFERROR(VLOOKUP($C180,Orçamento!A188:E446,5,FALSE),0)","v":2},"UN",{"$f":"VLOOKUP($C180,Orçamento!A188:H447,8,FALSE)","v":3987.89},{"$f":"VLOOKUP($C180,Orçamento!A188:I447,9,FALSE)","v":7975.78},{"$f":"VLOOKUP($C180,Orçamento!A188:G447,7,FALSE)","v":0.22159999999999999},1.1122000000000001,null,"",null,""]
[{"$f":"'[1]Identificação-TCE'!$A$13","v":1},{"$f":"IF(AND(G181<>\"\",H181>0,I181<>\"\",J181<>0,K181<>0),COUNT($B$11:B180)+1,\"\")","v":170},{"$f":"Orçamento!A189","v":"11.50"},"SINAPI","SINAPI 94482","2022-02-11",{"$f":"VLOOKUP($C181,Orçamento!A189:C447,3,FALSE)","v":"CONJUNTO HIDRÁULICO PARA INSTALAÇÃO DE BOMBA EM AÇO ROSCÁVEL, DN SUCÇÃO 40 (1 1/2\") E DN RECALQUE 32 (1 1/4\"), PARA EDIFICAÇÃO ENTRE 4 E 8 PAVIMENTOS - FORNECIMENTO E INSTALAÇÃO. AF_06/2016"},{"$f":"IFERROR(VLOOKUP($C181,Orçamento!A189:E447,5,FALSE),0)","v":2},"UN",{"$f":"VLOOKUP($C181,Orçamento!A189:H448,8,FALSE)","v":1755.48},{"$f":"VLOOKUP($C181,Orçamento!A189:I448,9,FALSE)","v":3510.96},{"$f":"VLOOKUP($C181,Orçamento!A189:G448,7,FALSE)","v":0.22159999999999999},1.1122000000000001,null,"",null,""]
[{"$f":"'[1]Identificação-TCE'!$A$13","v":1},{"$f":"IF(AND(G182<>\"\",H182>0,I182<>\"\",J182<>0,K182<>0),COUNT($B$11:B181)+1,\"\")","v":171},{"$f":"Orçamento!A190","v":"11.51"},"CCU","CPUE 84","2022-02-11",{"$f":"VLOOKUP($C182,Orçamento!A190:C448,3,FALSE)","v":"VÁLVULA QUEBRA VÁCUO 32MM "},{"$f":"IFERROR(VLOOKUP($C182,Orçamento!A190:E448,5,FALSE),0)","v":2},"UN",{"$f":"VLOOKUP($C182,Orçamento!A190:H449,8,FALSE)","v":374.57},{"$f":"VLOOKUP($C182,Orçamento!A190:I449,9,FALSE)","v":749.14},{"$f":"VLOOKUP($C182,Orçamento!A190:G449,7,FALSE)","v":0.22159999999999999},1.1122000000000001,null,"",null,""]
[{"$f":"'[1]Identificação-TCE'!$A$13","v":1},{"$f":"IF(AND(G183<>\"\",H183>0,I183<>\"\",J183<>0,K183<>0),COUNT($B$11:B182)+1,\"\")","v":172},{"$f":"Orçamento!A191","v":"11.52"},"SINAPI","SINAPI 94490","2022-02-11",{"$f":"VLOOKUP($C183,Orçamento!A191:C449,3,FALSE)","v":"REGISTRO DE ESFERA, PVC SOLDÁVEL, DN 32MM, INSTALADO EM RESERVAÇÃO DE ÁGUA DE EDIFICAÇÃO QUE POSSUA RESERVATÓRIO DE FIBRA/FIBROCIMENTO - FORNECIMENTO E INSTALAÇÃO. AF_06/2016"},{"$f":"IFERROR(VLOOKUP($C183,Orçamento!A191:E449,5,FALSE),0)","v":2},"UN",{"$f":"VLOOKUP($C183,Orçamento!A191:H450,8,FALSE)","v":64.709999999999994},{"$f":"VLOOKUP($C183,Orçamento!A191:I450,9,FALSE)","v":129.41999999999999},{"$f":"VLOOKUP($C183,Orçamento!A191:G450,7,FALSE)","v":0.22159999999999999},1.1122000000000001,null,"",null,""]
[{"$f":"'[1]Identificação-TCE'!$A$13","v":1},{"$f":"IF(AND(G184<>\"\",H184>0,I184<>\"\",J184<>0,K184<>0),COUNT($B$11:B183)+1,\"\")","v":173},{"$f":"Orçamento!A192","v":"11.53"},"SINAPI","SINAPI 101882","2022-02-11",{"$f":"VLOOKUP($C184,Orçamento!A192:C450,3,FALSE)","v":"QUADRO DE DISTRIBUIÇÃO DE ENERGIA EM CHAPA DE AÇO GALVANIZADO, DE EMBUTIR, COM BARRAMENTO TRIFÁSICO, PARA 30 DISJUNTORES DIN 225A - FORNECIMENTO E INSTALAÇÃO. AF_10/2020"},{"$f":"IFERROR(VLOOKUP($C184,Orçamento!A192:E450,5,FALSE),0)","v":2},"UN",{"$f":"VLOOKUP($C184,Orçamento!A192:H451,8,FALSE)","v":2007.81},{"$f":"VLOOKUP($C184,Orçamento!A192:I451,9,FALSE)","v":4015.62},{"$f":"VLOOKUP($C184,Orçamento!A192:G451,7,FALSE)","v":0.22159999999999999},1.1122000000000001,null,"",null,""]
[{"$f":"'[1]Identificação-TCE'!$A$13","v":1},{"$f":"IF(AND(G185<>\"\",H185>0,I185<>\"\",J185<>0,K185<>0),COUNT($B$11:B184)+1,\"\")","v":174},{"$f":"Orçamento!A193","v":"11.54"},"SINAPI","SINAPI 91855","2022-02-11",{"$f":"VLOOKUP($C185,Orçamento!A193:C451,3,FALSE)","v":"ELETRODUTO FLEXÍVEL CORRUGADO REFORÇADO, PVC, DN 25MM (3/4'), PARA CIRCUITOS TERMINAIS, INSTALADO EM PAREDE - FORNECIMENTO E INSTALAÇÃO. AF_12/2015"},{"$f":"IFERROR(VLOOKUP($C185,Orçamento!A193:E451,5,FALSE),0)","v":2},{"$f":"VLOOKUP($C185,Orçamento!A193:D451,4,FALSE)","v":"M"},{"$f":"VLOOKUP($C185,Orçamento!A193:H452,8,FALSE)","v":11.85},{"$f":"VLOOKUP($C185,Orçamento!A193:I452,9,FALSE)","v":23.7},{"$f":"VLOOKUP($C185,Orçamento!A193:G452,7,FALSE)","v":0.22159999999999999},1.1122000000000001,null,"",null,""]
[{"$f":"'[1]Identificação-TCE'!$A$13","v":1},{"$f":"IF(AND(G186<>\"\",H186>0,I186<>\"\",J186<>0,K186<>0),COUNT($B$11:B185)+1,\"\")","v":175},{"$f":"Orçamento!A194","v":"11.55"},"SINAPI","SINAPI 91863","2022-02-11",{"$f":"VLOOKUP($C186,Orçamento!A194:C452,3,FALSE)","v":"ELETRODUTO RÍGIDO ROSCÁVEL, PVC, DN 25MM (3/4\"), PARA CIRCUITOS TERMINAIS, INSTALADO EM FORRO - FORNECIMENTO E INSTALAÇÃO. AF_12/2015"},{"$f":"IFERROR(VLOOKUP($C186,Orçamento!A194:E452,5,FALSE),0)","v":6},{"$f":"VLOOKUP($C186,Orçamento!A194:D452,4,FALSE)","v":"M"},{"$f":"VLOOKUP($C186,Orçamento!A194:H453,8,FALSE)","v":13.14},{"$f":"VLOOKUP($C186,Orçamento!A194:I453,9,FALSE)","v":78.84},{"$f":"VLOOKUP($C186,Orçamento!A194:G453,7,FALSE)","v":0.22159999999999999},1.1122000000000001,null,"",null,""]
[{"$f":"'[1]Identificação-TCE'!$A$13","v":1},{"$f":"IF(AND(G187<>\"\",H187>0,I187<>\"\",J187<>0,K187<>0),COUNT($B$11:B186)+1,\"\")","v":176},{"$f":"Orçamento!A195","v":"11.56"},"SINAPI","SINAPI 95804","2022-02-11",{"$f":"VLOOKUP($C187,Orçamento!A195:C453,3,FALSE)","v":"CONDULETE DE PVC, TIPO B, PARA ELETRODUTO DE PVC SOLDÁVEL DN 20MM (1/2\"), APARENTE - FORNECIMENTO E INSTALAÇÃO. AF_11/2016"},{"$f":"IFERROR(VLOOKUP($C187,Orçamento!A195:E453,5,FALSE),0)","v":12},"UN",{"$f":"VLOOKUP($C187,Orçamento!A195:H454,8,FALSE)","v":30.63},{"$f":"VLOOKUP($C187,Orçamento!A195:I454,9,FALSE)","v":367.56},{"$f":"VLOOKUP($C187,Orçamento!A195:G454,7,FALSE)","v":0.22159999999999999},1.1122000000000001,null,"",null,""]
[{"$f":"'[1]Identificação-TCE'!$A$13","v":1},{"$f":"IF(AND(G188<>\"\",H188>0,I188<>\"\",J188<>0,K188<>0),COUNT($B$11:B187)+1,\"\")","v":177},{"$f":"Orçamento!A196","v":"11.57"},"SINAPI","SINAPI 86901","2022-02-11",{"$f":"VLOOKUP($C188,Orçamento!A196:C454,3,FALSE)","v":"CUBA DE EMBUTIR OVAL EM LOUÇA BRANCA, 35X50CM OU EQUIVALENTE - FORNECIMENTO E INSTALAÇÃO. AF_11/2016"},{"$f":"IFERROR(VLOOKUP($C188,Orçamento!A196:E454,5,FALSE),0)","v":18},"UN",{"$f":"VLOOKUP($C188,Orçamento!A196:H455,8,FALSE)","v":157.16},{"$f":"VLOOKUP($C188,Orçamento!A196:I455,9,FALSE)","v":2828.88},{"$f":"VLOOKUP($C188,Orçamento!A196:G455,7,FALSE)","v":0.22159999999999999},1.1122000000000001,null,"",null,""]
[{"$f":"'[1]Identificação-TCE'!$A$13","v":1},{"$f":"IF(AND(G189<>\"\",H189>0,I189<>\"\",J189<>0,K189<>0),COUNT($B$11:B188)+1,\"\")","v":178},{"$f":"Orçamento!A197","v":"11.58"},"SINAPI","SINAPI 95469","2022-02-11",{"$f":"VLOOKUP($C189,Orçamento!A197:C455,3,FALSE)","v":"VASO SANITÁRIO SIFONADO CONVENCIONAL COM LOUÇA BRANCA - FORNECIMENTO E INSTALAÇÃO. AF_01/2020"},{"$f":"IFERROR(VLOOKUP($C189,Orçamento!A197:E455,5,FALSE),0)","v":7},"UN",{"$f":"VLOOKUP($C189,Orçamento!A197:H456,8,FALSE)","v":317.91000000000003},{"$f":"VLOOKUP($C189,Orçamento!A197:I456,9,FALSE)","v":2225.37},{"$f":"VLOOKUP($C189,Orçamento!A197:G456,7,FALSE)","v":0.22159999999999999},1.1122000000000001,null,"",null,""]
[{"$f":"'[1]Identificação-TCE'!$A$13","v":1},{"$f":"IF(AND(G190<>\"\",H190>0,I190<>\"\",J190<>0,K190<>0),COUNT($B$11:B189)+1,\"\")","v":179},{"$f":"Orçamento!A198","v":"11.59"},"SINAPI","SINAPI 95470","2022-02-11",{"$f":"VLOOKUP($C190,Orçamento!A198:C456,3,FALSE)","v":"VASO SANITARIO SIFONADO CONVENCIONAL COM LOUÇA BRANCA, INCLUSO CONJUNTO DE LIGAÇÃO PARA BACIA SANITÁRIA AJUSTÁVEL - FORNECIMENTO E INSTALAÇÃO. AF_10/2016"},{"$f":"IFERROR(VLOOKUP($C190,Orçamento!A198:E456,5,FALSE),0)","v":7},"UN",{"$f":"VLOOKUP($C190,Orçamento!A198:H457,8,FALSE)","v":329.8},{"$f":"VLOOKUP($C190,Orçamento!A198:I457,9,FALSE)","v":2308.6},{"$f":"VLOOKUP($C190,Orçamento!A198:G457,7,FALSE)","v":0.22159999999999999},1.1122000000000001,null,"",null,""]
[{"$f":"'[1]Identificação-TCE'!$A$13","v":1},{"$f":"IF(AND(G191<>\"\",H191>0,I191<>\"\",J191<>0,K191<>0),COUNT($B$11:B190)+1,\"\")","v":180},{"$f":"Orçamento!A199","v":"11.60"},"SINAPI","SINAPI 100858","2022-02-11",{"$f":"VLOOKUP($C191,Orçamento!A199:C457,3,FALSE)","v":"MICTÓRIO SIFONADO LOUÇA BRANCA, PADRÃO MÉDIO - FORNECIMENTO E INSTALAÇÃO. AF_01/2020"},{"$f":"IFERROR(VLOOKUP($C191,Orçamento!A199:E457,5,FALSE),0)","v":2},"UN",{"$f":"VLOOKUP($C191,Orçamento!A199:H458,8,FALSE)","v":741.98},{"$f":"VLOOKUP($C191,Orçamento!A199:I458,9,FALSE)","v":1483.96},{"$f":"VLOOKUP($C191,Orçamento!A199:G458,7,FALSE)","v":0.22159999999999999},1.1122000000000001,null,"",null,""]
[{"$f":"'[1]Identificação-TCE'!$A$13","v":1},{"$f":"IF(AND(G192<>\"\",H192>0,I192<>\"\",J192<>0,K192<>0),COUNT($B$11:B191)+1,\"\")","v":181},{"$f":"Orçamento!A200","v":"11.61"},"SINAPI","SINAPI 100849","2022-02-11",{"$f":"VLOOKUP($C192,Orçamento!A200:C458,3,FALSE)","v":"ASSENTO SANITÁRIO CONVENCIONAL - FORNECIMENTO E INSTALAÇÃO"},{"$f":"IFERROR(VLOOKUP($C192,Orçamento!A200:E458,5,FALSE),0)","v":14},"UN",{"$f":"VLOOKUP($C192,Orçamento!A200:H459,8,FALSE)","v":60.88},{"$f":"VLOOKUP($C192,Orçamento!A200:I459,9,FALSE)","v":852.32},{"$f":"VLOOKUP($C192,Orçamento!A200:G459,7,FALSE)","v":0.22159999999999999},1.1122000000000001,null,"",null,""]
[{"$f":"'[1]Identificação-TCE'!$A$13","v":1},{"$f":"IF(AND(G193<>\"\",H193>0,I193<>\"\",J193<>0,K193<>0),COUNT($B$11:B192)+1,\"\")","v":182},{"$f":"Orçamento!A201","v":"11.62"},"CCU","CPUE 39","2022-02-11",{"$f":"VLOOKUP($C193,Orçamento!A201:C459,3,FALSE)","v":"TORNEIRA PARA SANITÁRIO PNE AUTOMÁTICA"},{"$f":"IFERROR(VLOOKUP($C193,Orçamento!A201:E459,5,FALSE),0)","v":19},"UN",{"$f":"VLOOKUP($C193,Orçamento!A201:H460,8,FALSE)","v":286.43},{"$f":"VLOOKUP($C193,Orçamento!A201:I460,9,FALSE)","v":5442.17},{"$f":"VLOOKUP($C193,Orçamento!A201:G460,7,FALSE)","v":0.22159999999999999},1.1122000000000001,null,"",null,""]
[{"$f":"'[1]Identificação-TCE'!$A$13","v":1},{"$f":"IF(AND(G194<>\"\",H194>0,I194<>\"\",J194<>0,K194<>0),COUNT($B$11:B193)+1,\"\")","v":183},{"$f":"Orçamento!A202","v":"11.63"},"CCU","CPUE 86","2022-02-11",{"$f":"VLOOKUP($C194,Orçamento!A202:C460,3,FALSE)","v":"PORTA PAPEL HIGIÊNICO EM ROLO - DISPENSER EM PLÁSTICO"},{"$f":"IFERROR(VLOOKUP($C194,Orçamento!A202:E460,5,FALSE),0)","v":14},"UN",{"$f":"VLOOKUP($C194,Orçamento!A202:H461,8,FALSE)","v":63.5},{"$f":"VLOOKUP($C194,Orçamento!A202:I461,9,FALSE)","v":889},{"$f":"VLOOKUP($C194,Orçamento!A202:G461,7,FALSE)","v":0.22159999999999999},1.1122000000000001,null,"",null,""]
[{"$f":"'[1]Identificação-TCE'!$A$13","v":1},{"$f":"IF(AND(G195<>\"\",H195>0,I195<>\"\",J195<>0,K195<>0),COUNT($B$11:B194)+1,\"\")","v":184},{"$f":"Orçamento!A203","v":"11.64"},"SINAPI","SINAPI 100855","2022-02-11",{"$f":"VLOOKUP($C195,Orçamento!A203:C461,3,FALSE)","v":"SABONETEIRA DE PAREDE EM PLASTICO ABS COM ACABAMENTO CROMADO E ACRILICO, INCLUSO FIXAÇÃO. AF_01/2020"},{"$f":"IFERROR(VLOOKUP($C195,Orçamento!A203:E461,5,FALSE),0)","v":13},"UN",{"$f":"VLOOKUP($C195,Orçamento!A203:H462,8,FALSE)","v":83.06},{"$f":"VLOOKUP($C195,Orçamento!A203:I462,9,FALSE)","v":1079.78},{"$f":"VLOOKUP($C195,Orçamento!A203:G462,7,FALSE)","v":0.22159999999999999},1.1122000000000001,null,"",null,""]
[{"$f":"'[1]Identificação-TCE'!$A$13","v":1},{"$f":"IF(AND(G196<>\"\",H196>0,I196<>\"\",J196<>0,K196<>0),COUNT($B$11:B195)+1,\"\")","v":185},{"$f":"Orçamento!A204","v":"11.65"},"CCU","CPUE 87","2022-02-11",{"$f":"VLOOKUP($C196,Orçamento!A204:C462,3,FALSE)","v":"MEIA SABONETEIRA PARA CHUVEIRO"},{"$f":"IFERROR(VLOOKUP($C196,Orçamento!A204:E462,5,FALSE),0)","v":16},"UN",{"$f":"VLOOKUP($C196,Orçamento!A204:H463,8,FALSE)","v":82.94},{"$f":"VLOOKUP($C196,Orçamento!A204:I463,9,FALSE)","v":1327.04},{"$f":"VLOOKUP($C196,Orçamento!A204:G463,7,FALSE)","v":0.22159999999999999},1.1122000000000001,null,"",null,""]
[{"$f":"'[1]Identificação-TCE'!$A$13","v":1},{"$f":"IF(AND(G197<>\"\",H197>0,I197<>\"\",J197<>0,K197<>0),COUNT($B$11:B196)+1,\"\")","v":186},{"$f":"Orçamento!A205","v":"11.66"},"CCU","CPUE 88","2022-02-11",{"$f":"VLOOKUP($C197,Orçamento!A205:C463,3,FALSE)","v":"TOALHEIRO DISPENSER PARA TOALHA DE PAPEL, EM PLÁSTICO"},{"$f":"IFERROR(VLOOKUP($C197,Orçamento!A205:E463,5,FALSE),0)","v":14},"UN",{"$f":"VLOOKUP($C197,Orçamento!A205:H464,8,FALSE)","v":63.5},{"$f":"VLOOKUP($C197,Orçamento!A205:I464,9,FALSE)","v":889},{"$f":"VLOOKUP($C197,Orçamento!A205:G464,7,FALSE)","v":0.22159999999999999},1.1122000000000001,null,"",null,""]
[{"$f":"'[1]Identificação-TCE'!$A$13","v":1},{"$f":"IF(AND(G198<>\"\",H198>0,I198<>\"\",J198<>0,K198<>0),COUNT($B$11:B197)+1,\"\")","v":187},{"$f":"Orçamento!A206","v":"11.67"},"CCU","CPUE 89","2022-02-11",{"$f":"VLOOKUP($C198,Orçamento!A206:C464,3,FALSE)","v":"CHUVEIRO AQUECEDOR A GÁS"},{"$f":"IFERROR(VLOOKUP($C198,Orçamento!A206:E464,5,FALSE),0)","v":16},"UN",{"$f":"VLOOKUP($C198,Orçamento!A206:H465,8,FALSE)","v":325.73},{"$f":"VLOOKUP($C198,Orçamento!A206:I465,9,FALSE)","v":5211.68},{"$f":"VLOOKUP($C198,Orçamento!A206:G465,7,FALSE)","v":0.22159999999999999},1.1122000000000001,null,"",null,""]
[{"$f":"'[1]Identificação-TCE'!$A$13","v":1},{"$f":"IF(AND(G199<>\"\",H199>0,I199<>\"\",J199<>0,K199<>0),COUNT($B$11:B198)+1,\"\")","v":188},{"$f":"Orçamento!A207","v":"11.68"},"CCU","CPUE 90","2022-02-11",{"$f":"VLOOKUP($C199,Orçamento!A207:C465,3,FALSE)","v":"BATEDOR DE AÇO POLIDO"},{"$f":"IFERROR(VLOOKUP($C199,Orçamento!A207:E465,5,FALSE),0)","v":14},"UN",{"$f":"VLOOKUP($C199,Orçamento!A207:H466,8,FALSE)","v":381.09},{"$f":"VLOOKUP($C199,Orçamento!A207:I466,9,FALSE)","v":5335.26},{"$f":"VLOOKUP($C199,Orçamento!A207:G466,7,FALSE)","v":0.22159999999999999},1.1122000000000001,null,"",null,""]
[{"$f":"'[1]Identificação-TCE'!$A$13","v":1},{"$f":"IF(AND(G200<>\"\",H200>0,I200<>\"\",J200<>0,K200<>0),COUNT($B$11:B199)+1,\"\")","v":189},{"$f":"Orçamento!A208","v":"11.69"},"SINAPI","SINAPI 100875","2022-02-11",{"$f":"VLOOKUP($C200,Orçamento!A208:C466,3,FALSE)","v":"BANCO ARTICULADO, EM AÇO INOX, PARA PCD, FIXADO NA PAREDE - FORNECIMENTO E INSTALAÇÃO. AF_01/2020"},{"$f":"IFERROR(VLOOKUP($C200,Orçamento!A208:E466,5,FALSE),0)","v":10},"UN",{"$f":"VLOOKUP($C200,Orçamento!A208:H467,8,FALSE)","v":1635.03},{"$f":"VLOOKUP($C200,Orçamento!A208:I467,9,FALSE)","v":16350.3},{"$f":"VLOOKUP($C200,Orçamento!A208:G467,7,FALSE)","v":0.22159999999999999},1.1122000000000001,null,"",null,""]
[{"$f":"'[1]Identificação-TCE'!$A$13","v":1},{"$f":"IF(AND(G201<>\"\",H201>0,I201<>\"\",J201<>0,K201<>0),COUNT($B$11:B200)+1,\"\")","v":190},{"$f":"Orçamento!A209","v":"11.70"},"CCU","CPUE 115","2022-02-11",{"$f":"VLOOKUP($C201,Orçamento!A209:C467,3,FALSE)","v":"BANCOS EM \"L\""},{"$f":"IFERROR(VLOOKUP($C201,Orçamento!A209:E467,5,FALSE),0)","v":14.44},{"$f":"VLOOKUP($C201,Orçamento!A209:D467,4,FALSE)","v":"M"},{"$f":"VLOOKUP($C201,Orçamento!A209:H468,8,FALSE)","v":738.36},{"$f":"VLOOKUP($C201,Orçamento!A209:I468,9,FALSE)","v":10661.92},{"$f":"VLOOKUP($C201,Orçamento!A209:G468,7,FALSE)","v":0.22159999999999999},1.1122000000000001,null,"",null,""]
[{"$f":"'[1]Identificação-TCE'!$A$13","v":1},{"$f":"IF(AND(G202<>\"\",H202>0,I202<>\"\",J202<>0,K202<>0),COUNT($B$11:B201)+1,\"\")","v":191},{"$f":"Orçamento!A210","v":"11.71"},"CCU","CPUE 92","2022-02-11",{"$f":"VLOOKUP($C202,Orçamento!A210:C468,3,FALSE)","v":"ESPELHO PRATA LAMINADO 60X80CM"},{"$f":"IFERROR(VLOOKUP($C202,Orçamento!A210:E468,5,FALSE),0)","v":8.64},{"$f":"VLOOKUP($C202,Orçamento!A210:D468,4,FALSE)","v":"M2"},{"$f":"VLOOKUP($C202,Orçamento!A210:H469,8,FALSE)","v":226.49},{"$f":"VLOOKUP($C202,Orçamento!A210:I469,9,FALSE)","v":1956.87},{"$f":"VLOOKUP($C202,Orçamento!A210:G469,7,FALSE)","v":0.22159999999999999},1.1122000000000001,null,"",null,""]
[{"$f":"'[1]Identificação-TCE'!$A$13","v":1},{"$f":"IF(AND(G203<>\"\",H203>0,I203<>\"\",J203<>0,K203<>0),COUNT($B$11:B202)+1,\"\")","v":192},{"$f":"Orçamento!A211","v":"11.72"},"SINAPI","SINAPI 86889","2022-02-11",{"$f":"VLOOKUP($C203,Orçamento!A211:C469,3,FALSE)","v":"BANCADA DE GRANITO CINZA POLIDO, DE 1,50X0,60M, PARA PIA DE COZINHA - FORNECIMENTO E INSTALAÇÃO. AF_01/2020"},{"$f":"IFERROR(VLOOKUP($C203,Orçamento!A211:E469,5,FALSE),0)","v":5},"UN",{"$f":"VLOOKUP($C203,Orçamento!A211:H470,8,FALSE)","v":790.77},{"$f":"VLOOKUP($C203,Orçamento!A211:I470,9,FALSE)","v":3953.85},{"$f":"VLOOKUP($C203,Orçamento!A211:G470,7,FALSE)","v":0.22159999999999999},1.1122000000000001,null,"",null,""]
[{"$f":"'[1]Identificação-TCE'!$A$13","v":1},{"$f":"IF(AND(G204<>\"\",H204>0,I204<>\"\",J204<>0,K204<>0),COUNT($B$11:B203)+1,\"\")","v":193},{"$f":"Orçamento!A212","v":"11.73"},"SINAPI","SINAPI 100874","2022-02-11",{"$f":"VLOOKUP($C204,Orçamento!A212:C470,3,FALSE)","v":"PUXADOR PARA PCD, FIXADO NA PORTA - FORNECIMENTO E INSTALAÇÃO. AF_01/2020"},{"$f":"IFERROR(VLOOKUP($C204,Orçamento!A212:E470,5,FALSE),0)","v":7},"UN",{"$f":"VLOOKUP($C204,Orçamento!A212:H471,8,FALSE)","v":437.08},{"$f":"VLOOKUP($C204,Orçamento!A212:I471,9,FALSE)","v":3059.56},{"$f":"VLOOKUP($C204,Orçamento!A212:G471,7,FALSE)","v":0.22159999999999999},1.1122000000000001,null,"",null,""]
[{"$f":"'[1]Identificação-TCE'!$A$13","v":1},{"$f":"IF(AND(G205<>\"\",H205>0,I205<>\"\",J205<>0,K205<>0),COUNT($B$11:B204)+1,\"\")","v":194},{"$f":"Orçamento!A213","v":"11.74"},"CCU","CPUE 117","2022-02-11",{"$f":"VLOOKUP($C205,Orçamento!A213:C471,3,FALSE)","v":"BARRA DE APOIO RETA, EM AÇO INOX POLIDO, COMPRIMENTO 40CM, FIXADO NA PAREDE - FORNECIMENTO E INSTALAÇÃO. AF_01/2020"},{"$f":"IFERROR(VLOOKUP($C205,Orçamento!A213:E471,5,FALSE),0)","v":14},"UN",{"$f":"VLOOKUP($C205,Orçamento!A213:H472,8,FALSE)","v":354.92},{"$f":"VLOOKUP($C205,Orçamento!A213:I472,9,FALSE)","v":4968.88},{"$f":"VLOOKUP($C205,Orçamento!A213:G472,7,FALSE)","v":0.22159999999999999},1.1122000000000001,null,"",null,""]
[{"$f":"'[1]Identificação-TCE'!$A$13","v":1},{"$f":"IF(AND(G206<>\"\",H206>0,I206<>\"\",J206<>0,K206<>0),COUNT($B$11:B205)+1,\"\")","v":195},{"$f":"Orçamento!A214","v":"11.75"},"SINAPI","SINAPI 100867","2022-02-11",{"$f":"VLOOKUP($C206,Orçamento!A214:C472,3,FALSE)","v":"BARRA DE APOIO RETA, EM AÇO INOX POLIDO, COMPRIMENTO 70CM, FIXADO NA PAREDE - FORNECIMENTO E INSTALAÇÃO. AF_01/2020"},{"$f":"IFERROR(VLOOKUP($C206,Orçamento!A214:E472,5,FALSE),0)","v":75},"UN",{"$f":"VLOOKUP($C206,Orçamento!A214:H473,8,FALSE)","v":467.75},{"$f":"VLOOKUP($C206,Orçamento!A214:I473,9,FALSE)","v":35081.25},{"$f":"VLOOKUP($C206,Orçamento!A214:G473,7,FALSE)","v":0.22159999999999999},1.1122000000000001,null,"",null,""]
[{"$f":"'[1]Identificação-TCE'!$A$13","v":1},{"$f":"IF(AND(G207<>\"\",H207>0,I207<>\"\",J207<>0,K207<>0),COUNT($B$11:B206)+1,\"\")","v":196},{"$f":"Orçamento!A215","v":"11.76"},"SINAPI","SINAPI 100868","2022-02-11",{"$f":"VLOOKUP($C207,Orçamento!A215:C473,3,FALSE)","v":"BARRA DE APOIO RETA, EM AÇO INOX POLIDO, COMPRIMENTO 80CM, FIXADA NA PAREDE - FORNECIMENTO E INSTALAÇÃO. AF_01/2020"},{"$f":"IFERROR(VLOOKUP($C207,Orçamento!A215:E473,5,FALSE),0)","v":14},"UN",{"$f":"VLOOKUP($C207,Orçamento!A215:H474,8,FALSE)","v":488.15},{"$f":"VLOOKUP($C207,Orçamento!A215:I474,9,FALSE)","v":6834.1},{"$f":"VLOOKUP($C207,Orçamento!A215:G474,7,FALSE)","v":0.22159999999999999},1.1122000000000001,null,"",null,""]
[{"$f":"'[1]Identificação-TCE'!$A$13","v":1},{"$f":"IF(AND(G208<>\"\",H208>0,I208<>\"\",J208<>0,K208<>0),COUNT($B$11:B207)+1,\"\")","v":197},{"$f":"Orçamento!A217","v":"12.1"},"SINAPI","SINAPI 92648","2022-02-11",{"$f":"VLOOKUP($C208,Orçamento!A217:C475,3,FALSE)","v":"TUBO DE AÇO PRETO SEM COSTURA, CONEXÃO SOLDADA, DN 40 (1 1/2\"), INSTALADO EM REDE DE ALIMENTAÇÃO PARA SPRINKLER - FORNECIMENTO E INSTALAÇÃO. AF_10/2020"},{"$f":"IFERROR(VLOOKUP($C208,Orçamento!A217:E475,5,FALSE),0)","v":3},{"$f":"VLOOKUP($C208,Orçamento!A217:D475,4,FALSE)","v":"M"},{"$f":"VLOOKUP($C208,Orçamento!A217:H476,8,FALSE)","v":96.45},{"$f":"VLOOKUP($C208,Orçamento!A217:I476,9,FALSE)","v":289.35000000000002},{"$f":"VLOOKUP($C208,Orçamento!A217:G476,7,FALSE)","v":0.22159999999999999},1.1122000000000001,null,"",null,""]
[{"$f":"'[1]Identificação-TCE'!$A$13","v":1},{"$f":"IF(AND(G209<>\"\",H209>0,I209<>\"\",J209<>0,K209<>0),COUNT($B$11:B208)+1,\"\")","v":198},{"$f":"Orçamento!A218","v":"12.2"},"SINAPI","SINAPI 92339","2022-02-11",{"$f":"VLOOKUP($C209,Orçamento!A218:C476,3,FALSE)","v":"TUBO DE AÇO PRETO SEM COSTURA, CONEXÃO SOLDADA, DN 65 (2 1/2\"), INSTALADO EM PRUMADAS - FORNECIMENTO E INSTALAÇÃO. AF_10/2020"},{"$f":"IFERROR(VLOOKUP($C209,Orçamento!A218:E476,5,FALSE),0)","v":135},{"$f":"VLOOKUP($C209,Orçamento!A218:D476,4,FALSE)","v":"M"},{"$f":"VLOOKUP($C209,Orçamento!A218:H477,8,FALSE)","v":204.89},{"$f":"VLOOKUP($C209,Orçamento!A218:I477,9,FALSE)","v":27660.15},{"$f":"VLOOKUP($C209,Orçamento!A218:G477,7,FALSE)","v":0.22159999999999999},1.1122000000000001,null,"",null,""]
[{"$f":"'[1]Identificação-TCE'!$A$13","v":1},{"$f":"IF(AND(G210<>\"\",H210>0,I210<>\"\",J210<>0,K210<>0),COUNT($B$11:B209)+1,\"\")","v":199},{"$f":"Orçamento!A219","v":"12.3"},"SINAPI","SINAPI 97483","2022-02-11",{"$f":"VLOOKUP($C210,Orçamento!A219:C477,3,FALSE)","v":"CURVA 45 GRAUS, EM AÇO, CONEXÃO SOLDADA DN 40 (1 1/2\"), INSTALADO EM REDE DE ALIMENTAÇÃO DE HIDRANTE - FORNECIMENTO E INSTALAÇÃO. AF_10/2020"},{"$f":"IFERROR(VLOOKUP($C210,Orçamento!A219:E477,5,FALSE),0)","v":3},"UN",{"$f":"VLOOKUP($C210,Orçamento!A219:H478,8,FALSE)","v":228.15},{"$f":"VLOOKUP($C210,Orçamento!A219:I478,9,FALSE)","v":684.45},{"$f":"VLOOKUP($C210,Orçamento!A219:G478,7,FALSE)","v":0.22159999999999999},1.1122000000000001,null,"",null,""]
[{"$f":"'[1]Identificação-TCE'!$A$13","v":1},{"$f":"IF(AND(G211<>\"\",H211>0,I211<>\"\",J211<>0,K211<>0),COUNT($B$11:B210)+1,\"\")","v":200},{"$f":"Orçamento!A220","v":"12.4"},"SINAPI","SINAPI 97435","2022-02-11",{"$f":"VLOOKUP($C211,Orçamento!A220:C478,3,FALSE)","v":"CURVA 45 GRAUS, EM AÇO, CONEXÃO RANHURADA, DN 65 (2 1/2\"), INSTALADO EM PRUMADAS - FORNECIMENTO E INSTALAÇÃO. AF_10/2020"},{"$f":"IFERROR(VLOOKUP($C211,Orçamento!A220:E478,5,FALSE),0)","v":6},"UN",{"$f":"VLOOKUP($C211,Orçamento!A220:H479,8,FALSE)","v":159.66},{"$f":"VLOOKUP($C211,Orçamento!A220:I479,9,FALSE)","v":957.96},{"$f":"VLOOKUP($C211,Orçamento!A220:G479,7,FALSE)","v":0.22159999999999999},1.1122000000000001,null,"",null,""]
[{"$f":"'[1]Identificação-TCE'!$A$13","v":1},{"$f":"IF(AND(G212<>\"\",H212>0,I212<>\"\",J212<>0,K212<>0),COUNT($B$11:B211)+1,\"\")","v":201},{"$f":"Orçamento!A221","v":"12.5"},"SINAPI","SINAPI 97436","2022-02-11",{"$f":"VLOOKUP($C212,Orçamento!A221:C479,3,FALSE)","v":"CURVA 90 GRAUS, EM AÇO, CONEXÃO RANHURADA, DN 65 (2 1/2\"), INSTALADO EM PRUMADAS - FORNECIMENTO E INSTALAÇÃO. AF_10/2020"},{"$f":"IFERROR(VLOOKUP($C212,Orçamento!A221:E479,5,FALSE),0)","v":9},"UN",{"$f":"VLOOKUP($C212,Orçamento!A221:H480,8,FALSE)","v":165.21},{"$f":"VLOOKUP($C212,Orçamento!A221:I480,9,FALSE)","v":1486.89},{"$f":"VLOOKUP($C212,Orçamento!A221:G480,7,FALSE)","v":0.22159999999999999},1.1122000000000001,null,"",null,""]
[{"$f":"'[1]Identificação-TCE'!$A$13","v":1},{"$f":"IF(AND(G213<>\"\",H213>0,I213<>\"\",J213<>0,K213<>0),COUNT($B$11:B212)+1,\"\")","v":202},{"$f":"Orçamento!A222","v":"12.6"},"SINAPI","SINAPI 97440","2022-02-11",{"$f":"VLOOKUP($C213,Orçamento!A222:C480,3,FALSE)","v":"TÊ EM AÇO, CONEXÃO RANHURADA, DN 65 (2 1/2\"), I NSTALADO EM PRUMADAS - FORNECIMENTO E INSTALAÇÃO. AF_10/2020"},{"$f":"IFERROR(VLOOKUP($C213,Orçamento!A222:E480,5,FALSE),0)","v":3},"UN",{"$f":"VLOOKUP($C213,Orçamento!A222:H481,8,FALSE)","v":251.99},{"$f":"VLOOKUP($C213,Orçamento!A222:I481,9,FALSE)","v":755.97},{"$f":"VLOOKUP($C213,Orçamento!A222:G481,7,FALSE)","v":0.22159999999999999},1.1122000000000001,null,"",null,""]
[{"$f":"'[1]Identificação-TCE'!$A$13","v":1},{"$f":"IF(AND(G214<>\"\",H214>0,I214<>\"\",J214<>0,K214<>0),COUNT($B$11:B213)+1,\"\")","v":203},{"$f":"Orçamento!A223","v":"12.7"},"SINAPI","SINAPI 97475","2022-02-11",{"$f":"VLOOKUP($C214,Orçamento!A223:C481,3,FALSE)","v":"LUVA COM REDUÇÃO, EM AÇO, CONEXÃO SOLDADA, DN 65X50MM (2 1/2\"X2\"), INSTALADO EM REDE DE ALIMENTAÇÃO PARA HIDRANTE - FORNECIMENTO E INSTALAÇÃO.AF_10/2020"},{"$f":"IFERROR(VLOOKUP($C214,Orçamento!A223:E481,5,FALSE),0)","v":3},"UN",{"$f":"VLOOKUP($C214,Orçamento!A223:H482,8,FALSE)","v":451.19},{"$f":"VLOOKUP($C214,Orçamento!A223:I482,9,FALSE)","v":1353.57},{"$f":"VLOOKUP($C214,Orçamento!A223:G482,7,FALSE)","v":0.22159999999999999},1.1122000000000001,null,"",null,""]
[{"$f":"'[1]Identificação-TCE'!$A$13","v":1},{"$f":"IF(AND(G215<>\"\",H215>0,I215<>\"\",J215<>0,K215<>0),COUNT($B$11:B214)+1,\"\")","v":204},{"$f":"Orçamento!A224","v":"12.8"},"SINAPI","SINAPI 95252","2022-02-11",{"$f":"VLOOKUP($C215,Orçamento!A224:C482,3,FALSE)","v":"VÁLVULA DE ESFERA BRUTA, BRONZE, ROSCÁVEL, 1 1/2\", INSTALADO EM RESERVAÇÃO DE ÁGUA DE EDIFICAÇÃO QUE POSSUA RESERVATÓRIO DE FIBRA/FIBROCIMENTO - FORNECIMENTO E INSTALAÇÃO. AF_06/2016"},{"$f":"IFERROR(VLOOKUP($C215,Orçamento!A224:E482,5,FALSE),0)","v":3},"UN",{"$f":"VLOOKUP($C215,Orçamento!A224:H483,8,FALSE)","v":215.78},{"$f":"VLOOKUP($C215,Orçamento!A224:I483,9,FALSE)","v":647.34},{"$f":"VLOOKUP($C215,Orçamento!A224:G483,7,FALSE)","v":0.22159999999999999},1.1122000000000001,null,"",null,""]
[{"$f":"'[1]Identificação-TCE'!$A$13","v":1},{"$f":"IF(AND(G216<>\"\",H216>0,I216<>\"\",J216<>0,K216<>0),COUNT($B$11:B215)+1,\"\")","v":205},{"$f":"Orçamento!A225","v":"12.9"},"SINAPI","SINAPI 94499","2022-02-11",{"$f":"VLOOKUP($C216,Orçamento!A225:C483,3,FALSE)","v":"REGISTRO DE GAVETA BRUTO, LATÃO, ROSCÁVEL, 2 1/2\", INSTALADO EM RESERVAÇÃO DE ÁGUA DE EDIFICAÇÃO QUE POSSUA RESERVATÓRIO DE FIBRA/FIBROCIMENTO - FORNECIMENTO E INSTALAÇÃO. AF_06/2016"},{"$f":"IFERROR(VLOOKUP($C216,Orçamento!A225:E483,5,FALSE),0)","v":3},"UN",{"$f":"VLOOKUP($C216,Orçamento!A225:H484,8,FALSE)","v":422.38},{"$f":"VLOOKUP($C216,Orçamento!A225:I484,9,FALSE)","v":1267.1400000000001},{"$f":"VLOOKUP($C216,Orçamento!A225:G484,7,FALSE)","v":0.22159999999999999},1.1122000000000001,null,"",null,""]
[{"$f":"'[1]Identificação-TCE'!$A$13","v":1},{"$f":"IF(AND(G217<>\"\",H217>0,I217<>\"\",J217<>0,K217<>0),COUNT($B$11:B216)+1,\"\")","v":206},{"$f":"Orçamento!A226","v":"12.10"},"CCU","CPUE 93","2022-02-11",{"$f":"VLOOKUP($C217,Orçamento!A226:C484,3,FALSE)","v":"ADAPTADOR ROSCA 25MM"},{"$f":"IFERROR(VLOOKUP($C217,Orçamento!A226:E484,5,FALSE),0)","v":3},"UN",{"$f":"VLOOKUP($C217,Orçamento!A226:H485,8,FALSE)","v":8.32},{"$f":"VLOOKUP($C217,Orçamento!A226:I485,9,FALSE)","v":24.96},{"$f":"VLOOKUP($C217,Orçamento!A226:G485,7,FALSE)","v":0.22159999999999999},1.1122000000000001,null,"",null,""]
[{"$f":"'[1]Identificação-TCE'!$A$13","v":1},{"$f":"IF(AND(G218<>\"\",H218>0,I218<>\"\",J218<>0,K218<>0),COUNT($B$11:B217)+1,\"\")","v":207},{"$f":"Orçamento!A227","v":"12.11"},"CCU","CPUE 94","2022-02-11",{"$f":"VLOOKUP($C218,Orçamento!A227:C485,3,FALSE)","v":"MANGOTINHO 25MM EM CARRETEL COM 30M"},{"$f":"IFERROR(VLOOKUP($C218,Orçamento!A227:E485,5,FALSE),0)","v":3},"UN",{"$f":"VLOOKUP($C218,Orçamento!A227:H486,8,FALSE)","v":3682.12},{"$f":"VLOOKUP($C218,Orçamento!A227:I486,9,FALSE)","v":11046.36},{"$f":"VLOOKUP($C218,Orçamento!A227:G486,7,FALSE)","v":0.22159999999999999},1.1122000000000001,null,"",null,""]
[{"$f":"'[1]Identificação-TCE'!$A$13","v":1},{"$f":"IF(AND(G219<>\"\",H219>0,I219<>\"\",J219<>0,K219<>0),COUNT($B$11:B218)+1,\"\")","v":208},{"$f":"Orçamento!A228","v":"12.12"},"CCU","CPUE 95","2022-02-11",{"$f":"VLOOKUP($C219,Orçamento!A228:C486,3,FALSE)","v":"ESGUICHO NEBLINA 25MM"},{"$f":"IFERROR(VLOOKUP($C219,Orçamento!A228:E486,5,FALSE),0)","v":3},"UN",{"$f":"VLOOKUP($C219,Orçamento!A228:H487,8,FALSE)","v":413.03},{"$f":"VLOOKUP($C219,Orçamento!A228:I487,9,FALSE)","v":1239.0899999999999},{"$f":"VLOOKUP($C219,Orçamento!A228:G487,7,FALSE)","v":0.22159999999999999},1.1122000000000001,null,"",null,""]
[{"$f":"'[1]Identificação-TCE'!$A$13","v":1},{"$f":"IF(AND(G220<>\"\",H220>0,I220<>\"\",J220<>0,K220<>0),COUNT($B$11:B219)+1,\"\")","v":209},{"$f":"Orçamento!A229","v":"12.13"},"CCU","CPUE 96","2022-02-11",{"$f":"VLOOKUP($C220,Orçamento!A229:C487,3,FALSE)","v":"TOMADA STORZ 40MM"},{"$f":"IFERROR(VLOOKUP($C220,Orçamento!A229:E487,5,FALSE),0)","v":3},"UN",{"$f":"VLOOKUP($C220,Orçamento!A229:H488,8,FALSE)","v":274.75},{"$f":"VLOOKUP($C220,Orçamento!A229:I488,9,FALSE)","v":824.25},{"$f":"VLOOKUP($C220,Orçamento!A229:G488,7,FALSE)","v":0.22159999999999999},1.1122000000000001,null,"",null,""]
[{"$f":"'[1]Identificação-TCE'!$A$13","v":1},{"$f":"IF(AND(G221<>\"\",H221>0,I221<>\"\",J221<>0,K221<>0),COUNT($B$11:B220)+1,\"\")","v":210},{"$f":"Orçamento!A230","v":"12.14"},"CCU","CPUE 97","2022-02-11",{"$f":"VLOOKUP($C221,Orçamento!A230:C488,3,FALSE)","v":"CHAVE DE UNIÕES"},{"$f":"IFERROR(VLOOKUP($C221,Orçamento!A230:E488,5,FALSE),0)","v":3},"UN",{"$f":"VLOOKUP($C221,Orçamento!A230:H489,8,FALSE)","v":31.06},{"$f":"VLOOKUP($C221,Orçamento!A230:I489,9,FALSE)","v":93.18},{"$f":"VLOOKUP($C221,Orçamento!A230:G489,7,FALSE)","v":0.22159999999999999},1.1122000000000001,null,"",null,""]
[{"$f":"'[1]Identificação-TCE'!$A$13","v":1},{"$f":"IF(AND(G222<>\"\",H222>0,I222<>\"\",J222<>0,K222<>0),COUNT($B$11:B221)+1,\"\")","v":211},{"$f":"Orçamento!A231","v":"12.15"},"CCU","CPUE 98","2022-02-11",{"$f":"VLOOKUP($C222,Orçamento!A231:C489,3,FALSE)","v":"CAIXA PARA CARRETEL DE MANGOTINHO DE 50M"},{"$f":"IFERROR(VLOOKUP($C222,Orçamento!A231:E489,5,FALSE),0)","v":3},"UN",{"$f":"VLOOKUP($C222,Orçamento!A231:H490,8,FALSE)","v":615.26},{"$f":"VLOOKUP($C222,Orçamento!A231:I490,9,FALSE)","v":1845.78},{"$f":"VLOOKUP($C222,Orçamento!A231:G490,7,FALSE)","v":0.22159999999999999},1.1122000000000001,null,"",null,""]
[{"$f":"'[1]Identificação-TCE'!$A$13","v":1},{"$f":"IF(AND(G223<>\"\",H223>0,I223<>\"\",J223<>0,K223<>0),COUNT($B$11:B222)+1,\"\")","v":212},{"$f":"Orçamento!A232","v":"12.16"},"SINAPI","SINAPI 96765","2022-02-11",{"$f":"VLOOKUP($C223,Orçamento!A232:C490,3,FALSE)","v":"ABRIGO PARA HIDRANTE, 90X60X17CM, COM REGISTRO GLOBO ANGULAR 45 GRAUS 2 1/2\", ADAPTADOR STORZ DE 2 1/2\", MANGUEIRA DE INCÊNDIO 20M, REDUÇÃO 2 1/2\" X 1 1/2\" E ESGUICHO EM LATÃO 1 1/2\" - FORNECIMENTO E INSTALAÇÃO. AF_10/2020"},{"$f":"IFERROR(VLOOKUP($C223,Orçamento!A232:E490,5,FALSE),0)","v":3},"UN",{"$f":"VLOOKUP($C223,Orçamento!A232:H491,8,FALSE)","v":1850.77},{"$f":"VLOOKUP($C223,Orçamento!A232:I491,9,FALSE)","v":5552.31},{"$f":"VLOOKUP($C223,Orçamento!A232:G491,7,FALSE)","v":0.22159999999999999},1.1122000000000001,null,"",null,""]
[{"$f":"'[1]Identificação-TCE'!$A$13","v":1},{"$f":"IF(AND(G224<>\"\",H224>0,I224<>\"\",J224<>0,K224<>0),COUNT($B$11:B223)+1,\"\")","v":213},{"$f":"Orçamento!A233","v":"12.17"},"SINAPI","SINAPI 101905","2022-02-11",{"$f":"VLOOKUP($C224,Orçamento!A233:C491,3,FALSE)","v":"EXTINTOR DE INCÊNDIO PORTÁTIL COM CARGA DE ÁGUA PRESSURIZADA DE 10 L, CLASSE A - FORNECIMENTO E INSTALAÇÃO. AF_10/2020_P"},{"$f":"IFERROR(VLOOKUP($C224,Orçamento!A233:E491,5,FALSE),0)","v":3},"UN",{"$f":"VLOOKUP($C224,Orçamento!A233:H492,8,FALSE)","v":291.82},{"$f":"VLOOKUP($C224,Orçamento!A233:I492,9,FALSE)","v":875.46},{"$f":"VLOOKUP($C224,Orçamento!A233:G492,7,FALSE)","v":0.22159999999999999},1.1122000000000001,null,"",null,""]
[{"$f":"'[1]Identificação-TCE'!$A$13","v":1},{"$f":"IF(AND(G225<>\"\",H225>0,I225<>\"\",J225<>0,K225<>0),COUNT($B$11:B224)+1,\"\")","v":214},{"$f":"Orçamento!A234","v":"12.18"},"SINAPI","SINAPI 37556","2022-02-11",{"$f":"VLOOKUP($C225,Orçamento!A234:C492,3,FALSE)","v":"PLACA DE SINALIZAÇÃO DE SEGURANÇA CONTRA INCÊNDIO, FOTOLUMINISCENTE, QUADRADA, 20X20CM EM PVC 2MM, ANTI-CHAMAS (SÍMBOLOS, CORES E PICTOGRAMAS CONFORME NBR 13434)"},{"$f":"IFERROR(VLOOKUP($C225,Orçamento!A234:E492,5,FALSE),0)","v":68},"UN",{"$f":"VLOOKUP($C225,Orçamento!A234:H493,8,FALSE)","v":28.23},{"$f":"VLOOKUP($C225,Orçamento!A234:I493,9,FALSE)","v":1919.64},{"$f":"VLOOKUP($C225,Orçamento!A234:G493,7,FALSE)","v":0.22159999999999999},1.1122000000000001,null,"",null,""]
[{"$f":"'[1]Identificação-TCE'!$A$13","v":1},{"$f":"IF(AND(G226<>\"\",H226>0,I226<>\"\",J226<>0,K226<>0),COUNT($B$11:B225)+1,\"\")","v":215},{"$f":"Orçamento!A235","v":"12.19"},"SINAPI","SINAPI 101908","2022-02-11",{"$f":"VLOOKUP($C226,Orçamento!A235:C493,3,FALSE)","v":"EXTINTOR DE INCÊNDIO PORTÁTIL COM CARGA DE PQS DE 4 KG, CLASSE BC - FORNECIMENTO E INSTALAÇÃO. AF_10/2020_P"},{"$f":"IFERROR(VLOOKUP($C226,Orçamento!A235:E493,5,FALSE),0)","v":12},"UN",{"$f":"VLOOKUP($C226,Orçamento!A235:H494,8,FALSE)","v":282.97000000000003},{"$f":"VLOOKUP($C226,Orçamento!A235:I494,9,FALSE)","v":3395.64},{"$f":"VLOOKUP($C226,Orçamento!A235:G494,7,FALSE)","v":0.22159999999999999},1.1122000000000001,null,"",null,""]
[{"$f":"'[1]Identificação-TCE'!$A$13","v":1},{"$f":"IF(AND(G227<>\"\",H227>0,I227<>\"\",J227<>0,K227<>0),COUNT($B$11:B226)+1,\"\")","v":216},{"$f":"Orçamento!A236","v":"12.20"},"CCU","CPUE 99","2022-02-11",{"$f":"VLOOKUP($C227,Orçamento!A236:C494,3,FALSE)","v":"SUPORTE PARA FIXAÇÃO DE EXTINTOR EM PAREDE, COM BUCHA E PARAFUSO"},{"$f":"IFERROR(VLOOKUP($C227,Orçamento!A236:E494,5,FALSE),0)","v":10},"UN",{"$f":"VLOOKUP($C227,Orçamento!A236:H495,8,FALSE)","v":22.57},{"$f":"VLOOKUP($C227,Orçamento!A236:I495,9,FALSE)","v":225.7},{"$f":"VLOOKUP($C227,Orçamento!A236:G495,7,FALSE)","v":0.22159999999999999},1.1122000000000001,null,"",null,""]
[{"$f":"'[1]Identificação-TCE'!$A$13","v":1},{"$f":"IF(AND(G228<>\"\",H228>0,I228<>\"\",J228<>0,K228<>0),COUNT($B$11:B227)+1,\"\")","v":217},{"$f":"Orçamento!A237","v":"12.21"},"CCU","CPUE 100","2022-02-11",{"$f":"VLOOKUP($C228,Orçamento!A237:C495,3,FALSE)","v":"ACIONADOR MANUAL DE INCÊNDIO"},{"$f":"IFERROR(VLOOKUP($C228,Orçamento!A237:E495,5,FALSE),0)","v":3},"UN",{"$f":"VLOOKUP($C228,Orçamento!A237:H496,8,FALSE)","v":88.04},{"$f":"VLOOKUP($C228,Orçamento!A237:I496,9,FALSE)","v":264.12},{"$f":"VLOOKUP($C228,Orçamento!A237:G496,7,FALSE)","v":0.22159999999999999},1.1122000000000001,null,"",null,""]
[{"$f":"'[1]Identificação-TCE'!$A$13","v":1},{"$f":"IF(AND(G229<>\"\",H229>0,I229<>\"\",J229<>0,K229<>0),COUNT($B$11:B228)+1,\"\")","v":218},{"$f":"Orçamento!A238","v":"12.22"},"SINAPI","SINAPI 99839","2022-02-11",{"$f":"VLOOKUP($C229,Orçamento!A238:C496,3,FALSE)","v":"GUARDA-CORPO DE AÇO GALVANIZADO DE 1,10M DE ALTURA, MONTANTES TUBULARES DE 1 1/2\" ESPAÇADOS DE 1,20M, TRAVESSA SUPERIOR DE 2\", GRADIL FORMADO POR BARRAS CHATAS EM FERRO DE 32X4,8MM, FIXADO COM CHUMBADOR MECÂNICO. AF_04/2019_P"},{"$f":"IFERROR(VLOOKUP($C229,Orçamento!A238:E496,5,FALSE),0)","v":105},{"$f":"VLOOKUP($C229,Orçamento!A238:D496,4,FALSE)","v":"M"},{"$f":"VLOOKUP($C229,Orçamento!A238:H497,8,FALSE)","v":607.91999999999996},{"$f":"VLOOKUP($C229,Orçamento!A238:I497,9,FALSE)","v":63831.6},{"$f":"VLOOKUP($C229,Orçamento!A238:G497,7,FALSE)","v":0.22159999999999999},1.1122000000000001,null,"",null,""]
[{"$f":"'[1]Identificação-TCE'!$A$13","v":1},{"$f":"IF(AND(G230<>\"\",H230>0,I230<>\"\",J230<>0,K230<>0),COUNT($B$11:B229)+1,\"\")","v":219},{"$f":"Orçamento!A239","v":"12.23"},"SINAPI","SINAPI 99855","2022-02-11",{"$f":"VLOOKUP($C230,Orçamento!A239:C497,3,FALSE)","v":"CORRIMÃO SIMPLES, DIÂMETRO EXTERNO = 1 1/2\", EM AÇO GALVANIZADO. AF_04/2019_P"},{"$f":"IFERROR(VLOOKUP($C230,Orçamento!A239:E497,5,FALSE),0)","v":40},{"$f":"VLOOKUP($C230,Orçamento!A239:D497,4,FALSE)","v":"M"},{"$f":"VLOOKUP($C230,Orçamento!A239:H498,8,FALSE)","v":143.12},{"$f":"VLOOKUP($C230,Orçamento!A239:I498,9,FALSE)","v":5724.8},{"$f":"VLOOKUP($C230,Orçamento!A239:G498,7,FALSE)","v":0.22159999999999999},1.1122000000000001,null,"",null,""]
[{"$f":"'[1]Identificação-TCE'!$A$13","v":1},{"$f":"IF(AND(G231<>\"\",H231>0,I231<>\"\",J231<>0,K231<>0),COUNT($B$11:B230)+1,\"\")","v":220},{"$f":"Orçamento!A240","v":"12.24"},"CCU","CPUE 118","2022-02-11",{"$f":"VLOOKUP($C231,Orçamento!A240:C498,3,FALSE)","v":"CONJUNTO DE MOTOBOMBAS PARA HIDRANTE"},{"$f":"IFERROR(VLOOKUP($C231,Orçamento!A240:E498,5,FALSE),0)","v":1},"UN",{"$f":"VLOOKUP($C231,Orçamento!A240:H499,8,FALSE)","v":25130.560000000001},{"$f":"VLOOKUP($C231,Orçamento!A240:I499,9,FALSE)","v":25130.560000000001},{"$f":"VLOOKUP($C231,Orçamento!A240:G499,7,FALSE)","v":0.22159999999999999},1.1122000000000001,null,"",null,""]
[{"$f":"'[1]Identificação-TCE'!$A$13","v":1},{"$f":"IF(AND(G232<>\"\",H232>0,I232<>\"\",J232<>0,K232<>0),COUNT($B$11:B231)+1,\"\")","v":221},{"$f":"Orçamento!A242","v":"13.1"},"SINAPI","SINAPI 92690","2022-02-11",{"$f":"VLOOKUP($C232,Orçamento!A242:C500,3,FALSE)","v":"TUBO DE AÇO PRETO SEM COSTURA, CLASSE MÉDIA, CONEXÃO SOLDADA, DN 20 (3/4\"), INSTALADO EM RAMAIS E SUB-RAMAIS DE GÁS - FORNECIMENTO E INSTALAÇÃO. AF_10/2020"},{"$f":"IFERROR(VLOOKUP($C232,Orçamento!A242:E500,5,FALSE),0)","v":150},{"$f":"VLOOKUP($C232,Orçamento!A242:D500,4,FALSE)","v":"M"},{"$f":"VLOOKUP($C232,Orçamento!A242:H501,8,FALSE)","v":68.209999999999994},{"$f":"VLOOKUP($C232,Orçamento!A242:I501,9,FALSE)","v":10231.5},{"$f":"VLOOKUP($C232,Orçamento!A242:G501,7,FALSE)","v":0.22159999999999999},1.1122000000000001,null,"",null,""]
[{"$f":"'[1]Identificação-TCE'!$A$13","v":1},{"$f":"IF(AND(G233<>\"\",H233>0,I233<>\"\",J233<>0,K233<>0),COUNT($B$11:B232)+1,\"\")","v":222},{"$f":"Orçamento!A243","v":"13.2"},"SINAPI","SINAPI 97549","2022-02-11",{"$f":"VLOOKUP($C233,Orçamento!A243:C501,3,FALSE)","v":"CURVA 90 GRAUS, EM AÇO, CONEXÃO SOLDADA, DN 20 (3/4\"), INSTALADO EM RAMAIS E SUB-RAMAIS DE GÁS - FORNECIMENTO E INSTALAÇÃO. AF_10/2020"},{"$f":"IFERROR(VLOOKUP($C233,Orçamento!A243:E501,5,FALSE),0)","v":26},"UN",{"$f":"VLOOKUP($C233,Orçamento!A243:H502,8,FALSE)","v":86.93},{"$f":"VLOOKUP($C233,Orçamento!A243:I502,9,FALSE)","v":2260.1799999999998},{"$f":"VLOOKUP($C233,Orçamento!A243:G502,7,FALSE)","v":0.22159999999999999},1.1122000000000001,null,"",null,""]
[{"$f":"'[1]Identificação-TCE'!$A$13","v":1},{"$f":"IF(AND(G234<>\"\",H234>0,I234<>\"\",J234<>0,K234<>0),COUNT($B$11:B233)+1,\"\")","v":223},{"$f":"Orçamento!A244","v":"13.3"},"SINAPI","SINAPI 97548","2022-02-11",{"$f":"VLOOKUP($C234,Orçamento!A244:C502,3,FALSE)","v":"CURVA 45 GRAUS, EM AÇO, CONEXÃO SOLDADA, DN 20 (3/4\"), INSTALADO EM RAMAIS E SUB-RAMAIS DE GÁS - FORNECIMENTO E INSTALAÇÃO. AF_10/2020"},{"$f":"IFERROR(VLOOKUP($C234,Orçamento!A244:E502,5,FALSE),0)","v":7},"UN",{"$f":"VLOOKUP($C234,Orçamento!A244:H503,8,FALSE)","v":86.93},{"$f":"VLOOKUP($C234,Orçamento!A244:I503,9,FALSE)","v":608.51},{"$f":"VLOOKUP($C234,Orçamento!A244:G503,7,FALSE)","v":0.22159999999999999},1.1122000000000001,null,"",null,""]
[{"$f":"'[1]Identificação-TCE'!$A$13","v":1},{"$f":"IF(AND(G235<>\"\",H235>0,I235<>\"\",J235<>0,K235<>0),COUNT($B$11:B234)+1,\"\")","v":224},{"$f":"Orçamento!A245","v":"13.4"},"SINAPI","SINAPI 97553","2022-02-11",{"$f":"VLOOKUP($C235,Orçamento!A245:C503,3,FALSE)","v":"TÊ, EM AÇO, CONEXÃO SOLDADA, DN 20 (3/4\"), INSTALADO EM RAMAIS E SUB-RAMAIS DE GÁS - FORNECIMENTO E INSTALAÇÃO. AF_10/2020"},{"$f":"IFERROR(VLOOKUP($C235,Orçamento!A245:E503,5,FALSE),0)","v":25},"UN",{"$f":"VLOOKUP($C235,Orçamento!A245:H504,8,FALSE)","v":125.51},{"$f":"VLOOKUP($C235,Orçamento!A245:I504,9,FALSE)","v":3137.75},{"$f":"VLOOKUP($C235,Orçamento!A245:G504,7,FALSE)","v":0.22159999999999999},1.1122000000000001,null,"",null,""]
[{"$f":"'[1]Identificação-TCE'!$A$13","v":1},{"$f":"IF(AND(G236<>\"\",H236>0,I236<>\"\",J236<>0,K236<>0),COUNT($B$11:B235)+1,\"\")","v":225},{"$f":"Orçamento!A246","v":"13.5"},"SINAPI","SINAPI 97462","2022-02-11",{"$f":"VLOOKUP($C236,Orçamento!A246:C504,3,FALSE)","v":"LUVA COM REDUÇÃO, EM AÇO, CONEXÃO SOLDADA, DN 25X20MM (1X3/4\"), INSTALADO EM REDE DE ALIMENTAÇÃO PARA HIDRANTE - FORNECIMENTO E INSTALAÇÃO. AF_10/2020"},{"$f":"IFERROR(VLOOKUP($C236,Orçamento!A246:E504,5,FALSE),0)","v":20},"UN",{"$f":"VLOOKUP($C236,Orçamento!A246:H505,8,FALSE)","v":52.53},{"$f":"VLOOKUP($C236,Orçamento!A246:I505,9,FALSE)","v":1050.5999999999999},{"$f":"VLOOKUP($C236,Orçamento!A246:G505,7,FALSE)","v":0.22159999999999999},1.1122000000000001,null,"",null,""]
[{"$f":"'[1]Identificação-TCE'!$A$13","v":1},{"$f":"IF(AND(G237<>\"\",H237>0,I237<>\"\",J237<>0,K237<>0),COUNT($B$11:B236)+1,\"\")","v":226},{"$f":"Orçamento!A247","v":"13.6"},"SINAPI","SINAPI 95249","2022-02-11",{"$f":"VLOOKUP($C237,Orçamento!A247:C505,3,FALSE)","v":"VÁLVULA DE ESFERA BRUTA, BRONZE, ROSCÁVEL, 3/4\", INSTALADO EM RESERVAÇÃO DE ÁGUA DE EDIFICAÇÃO QUE POSSUA RESERVATÓRIO DE FIBRA/FIBROCIMENTO - FORNECIMENTO E INSTALAÇÃO. AF_06/2016"},{"$f":"IFERROR(VLOOKUP($C237,Orçamento!A247:E505,5,FALSE),0)","v":7},"UN",{"$f":"VLOOKUP($C237,Orçamento!A247:H506,8,FALSE)","v":89.12},{"$f":"VLOOKUP($C237,Orçamento!A247:I506,9,FALSE)","v":623.84},{"$f":"VLOOKUP($C237,Orçamento!A247:G506,7,FALSE)","v":0.22159999999999999},1.1122000000000001,null,"",null,""]
[{"$f":"'[1]Identificação-TCE'!$A$13","v":1},{"$f":"IF(AND(G238<>\"\",H238>0,I238<>\"\",J238<>0,K238<>0),COUNT($B$11:B237)+1,\"\")","v":227},{"$f":"Orçamento!A248","v":"13.7"},"SINAPI","SINAPI 95248","2022-02-11",{"$f":"VLOOKUP($C238,Orçamento!A248:C506,3,FALSE)","v":"VÁLVULA DE ESFERA BRUTA, BRONZE, ROSCÁVEL, 1/2\", INSTALADO EM RESERVAÇÃO DE ÁGUA DE EDIFICAÇÃO QUE POSSUA RESERVATÓRIO DE FIBRA/FIBROCIMENTO - FORNECIMENTO E INSTALAÇÃO. AF_06/2016"},{"$f":"IFERROR(VLOOKUP($C238,Orçamento!A248:E506,5,FALSE),0)","v":2},"UN",{"$f":"VLOOKUP($C238,Orçamento!A248:H507,8,FALSE)","v":76.040000000000006},{"$f":"VLOOKUP($C238,Orçamento!A248:I507,9,FALSE)","v":152.08000000000001},{"$f":"VLOOKUP($C238,Orçamento!A248:G507,7,FALSE)","v":0.22159999999999999},1.1122000000000001,null,"",null,""]
[{"$f":"'[1]Identificação-TCE'!$A$13","v":1},{"$f":"IF(AND(G239<>\"\",H239>0,I239<>\"\",J239<>0,K239<>0),COUNT($B$11:B238)+1,\"\")","v":228},{"$f":"Orçamento!A249","v":"13.8"},"SINAPI","SINAPI 89711","2022-02-11",{"$f":"VLOOKUP($C239,Orçamento!A249:C507,3,FALSE)","v":"TUBO PVC, SÉRIE NORMAL, ESGOTO PREDIAL, DN 40MM, FORNECIDO E INSTALADO EM RAMAL DE DESCARGA OU RAMAL DE ESGOTO SANITÁRIO. AF_12/2014"},{"$f":"IFERROR(VLOOKUP($C239,Orçamento!A249:E507,5,FALSE),0)","v":138},{"$f":"VLOOKUP($C239,Orçamento!A249:D507,4,FALSE)","v":"M"},{"$f":"VLOOKUP($C239,Orçamento!A249:H508,8,FALSE)","v":23.63},{"$f":"VLOOKUP($C239,Orçamento!A249:I508,9,FALSE)","v":3260.94},{"$f":"VLOOKUP($C239,Orçamento!A249:G508,7,FALSE)","v":0.22159999999999999},1.1122000000000001,null,"",null,""]
[{"$f":"'[1]Identificação-TCE'!$A$13","v":1},{"$f":"IF(AND(G240<>\"\",H240>0,I240<>\"\",J240<>0,K240<>0),COUNT($B$11:B239)+1,\"\")","v":229},{"$f":"Orçamento!A250","v":"13.9"},"SINAPI","SINAPI 89497","2022-02-11",{"$f":"VLOOKUP($C240,Orçamento!A250:C508,3,FALSE)","v":"JOELHO 90 GRAUS, PVC, SOLDÁVEL, DN 40MM, INSTALADO EM PRUMADA DE ÁGUA - FORNECIMENTO E INSTALAÇÃO. AF_12/2014"},{"$f":"IFERROR(VLOOKUP($C240,Orçamento!A250:E508,5,FALSE),0)","v":24},"UN",{"$f":"VLOOKUP($C240,Orçamento!A250:H509,8,FALSE)","v":17.7},{"$f":"VLOOKUP($C240,Orçamento!A250:I509,9,FALSE)","v":424.8},{"$f":"VLOOKUP($C240,Orçamento!A250:G509,7,FALSE)","v":0.22159999999999999},1.1122000000000001,null,"",null,""]
[{"$f":"'[1]Identificação-TCE'!$A$13","v":1},{"$f":"IF(AND(G241<>\"\",H241>0,I241<>\"\",J241<>0,K241<>0),COUNT($B$11:B240)+1,\"\")","v":230},{"$f":"Orçamento!A251","v":"13.10"},"SINAPI","SINAPI  89498","2022-02-11",{"$f":"VLOOKUP($C241,Orçamento!A251:C509,3,FALSE)","v":"JOELHO 45 GRAUS, PVC, SOLDÁVEL, DN 40MM, INSTALADO EM PRUMADA DE ÁGUA - FORNECIMENTO E INSTALAÇÃO. AF_12/2014"},{"$f":"IFERROR(VLOOKUP($C241,Orçamento!A251:E509,5,FALSE),0)","v":7},"UN",{"$f":"VLOOKUP($C241,Orçamento!A251:H510,8,FALSE)","v":19.7},{"$f":"VLOOKUP($C241,Orçamento!A251:I510,9,FALSE)","v":137.9},{"$f":"VLOOKUP($C241,Orçamento!A251:G510,7,FALSE)","v":0.22159999999999999},1.1122000000000001,null,"",null,""]
[{"$f":"'[1]Identificação-TCE'!$A$13","v":1},{"$f":"IF(AND(G242<>\"\",H242>0,I242<>\"\",J242<>0,K242<>0),COUNT($B$11:B241)+1,\"\")","v":231},{"$f":"Orçamento!A252","v":"13.11"},"SINAPI","SINAPI 89782","2022-02-11",{"$f":"VLOOKUP($C242,Orçamento!A252:C510,3,FALSE)","v":"TÊ, PVC, SÉRIE NORMAL, ESGOTO PREDIAL, DN 40X40MM, JUNTA SOLDÁVEL, FORNECIDO E INSTALADO EM RAMAL DE DESCARGA OU RAMAL DE ESGOTO SANITÁRIO. AF_12/2014"},{"$f":"IFERROR(VLOOKUP($C242,Orçamento!A252:E510,5,FALSE),0)","v":5},"UN",{"$f":"VLOOKUP($C242,Orçamento!A252:H511,8,FALSE)","v":15.44},{"$f":"VLOOKUP($C242,Orçamento!A252:I511,9,FALSE)","v":77.2},{"$f":"VLOOKUP($C242,Orçamento!A252:G511,7,FALSE)","v":0.22159999999999999},1.1122000000000001,null,"",null,""]
[{"$f":"'[1]Identificação-TCE'!$A$13","v":1},{"$f":"IF(AND(G243<>\"\",H243>0,I243<>\"\",J243<>0,K243<>0),COUNT($B$11:B242)+1,\"\")","v":232},{"$f":"Orçamento!A253","v":"13.12"},"CCU","CPUE 101","2022-02-11",{"$f":"VLOOKUP($C243,Orçamento!A253:C511,3,FALSE)","v":"MANGOTE FLEXÍVEL 7/16\""},{"$f":"IFERROR(VLOOKUP($C243,Orçamento!A253:E511,5,FALSE),0)","v":20},{"$f":"VLOOKUP($C243,Orçamento!A253:D511,4,FALSE)","v":"M"},{"$f":"VLOOKUP($C243,Orçamento!A253:H512,8,FALSE)","v":4.4400000000000004},{"$f":"VLOOKUP($C243,Orçamento!A253:I512,9,FALSE)","v":88.8},{"$f":"VLOOKUP($C243,Orçamento!A253:G512,7,FALSE)","v":0.22159999999999999},1.1122000000000001,null,"",null,""]
[{"$f":"'[1]Identificação-TCE'!$A$13","v":1},{"$f":"IF(AND(G244<>\"\",H244>0,I244<>\"\",J244<>0,K244<>0),COUNT($B$11:B243)+1,\"\")","v":233},{"$f":"Orçamento!A254","v":"13.13"},"CCU","CPUE 102","2022-02-11",{"$f":"VLOOKUP($C244,Orçamento!A254:C512,3,FALSE)","v":"MANGOTE FLEXÍVEL 1/2\""},{"$f":"IFERROR(VLOOKUP($C244,Orçamento!A254:E512,5,FALSE),0)","v":2},{"$f":"VLOOKUP($C244,Orçamento!A254:D512,4,FALSE)","v":"M"},{"$f":"VLOOKUP($C244,Orçamento!A254:H513,8,FALSE)","v":8.15},{"$f":"VLOOKUP($C244,Orçamento!A254:I513,9,FALSE)","v":16.3},{"$f":"VLOOKUP($C244,Orçamento!A254:G513,7,FALSE)","v":0.22159999999999999},1.1122000000000001,null,"",null,""]
[{"$f":"'[1]Identificação-TCE'!$A$13","v":1},{"$f":"IF(AND(G245<>\"\",H245>0,I245<>\"\",J245<>0,K245<>0),COUNT($B$11:B244)+1,\"\")","v":234},{"$f":"Orçamento!A255","v":"13.14"},"CCU","CPUE 103","2022-02-11",{"$f":"VLOOKUP($C245,Orçamento!A255:C513,3,FALSE)","v":"MANÔMETRO DIÂMETRO 75MM, RANGE DE PRESSÃO DE 0 A 7KgF/CM2"},{"$f":"IFERROR(VLOOKUP($C245,Orçamento!A255:E513,5,FALSE),0)","v":2},"UN",{"$f":"VLOOKUP($C245,Orçamento!A255:H514,8,FALSE)","v":188.68},{"$f":"VLOOKUP($C245,Orçamento!A255:I514,9,FALSE)","v":377.36},{"$f":"VLOOKUP($C245,Orçamento!A255:G514,7,FALSE)","v":0.22159999999999999},1.1122000000000001,null,"",null,""]
[{"$f":"'[1]Identificação-TCE'!$A$13","v":1},{"$f":"IF(AND(G246<>\"\",H246>0,I246<>\"\",J246<>0,K246<>0),COUNT($B$11:B245)+1,\"\")","v":235},{"$f":"Orçamento!A256","v":"13.15"},"CCU","CPUE 104","2022-02-11",{"$f":"VLOOKUP($C246,Orçamento!A256:C514,3,FALSE)","v":"REGULADOR DE PRESSÃO COM VÁLVULA DE SEGURANÇA, COM MANÔMETRO, SEGUNDO ESTÁGIO, ENTRADA DE 1,5 KgF/CM2 E SAÍDA DE 280MMCA"},{"$f":"IFERROR(VLOOKUP($C246,Orçamento!A256:E514,5,FALSE),0)","v":2},"UN",{"$f":"VLOOKUP($C246,Orçamento!A256:H515,8,FALSE)","v":257.57},{"$f":"VLOOKUP($C246,Orçamento!A256:I515,9,FALSE)","v":515.14},{"$f":"VLOOKUP($C246,Orçamento!A256:G515,7,FALSE)","v":0.22159999999999999},1.1122000000000001,null,"",null,""]
[{"$f":"'[1]Identificação-TCE'!$A$13","v":1},{"$f":"IF(AND(G247<>\"\",H247>0,I247<>\"\",J247<>0,K247<>0),COUNT($B$11:B246)+1,\"\")","v":236},{"$f":"Orçamento!A257","v":"13.16"},"CCU","CPUE 105","2022-02-11",{"$f":"VLOOKUP($C247,Orçamento!A257:C515,3,FALSE)","v":"REGULADOR DE PRESSÃO COM VÁLVULA DE SEGURANÇA, COM MANÔMETRO, PRIMEIRO ESTÁGIO, ENTRADA DE 5 KgF/CM2 E SAÍDA DE 1,5KgF/CM2"},{"$f":"IFERROR(VLOOKUP($C247,Orçamento!A257:E515,5,FALSE),0)","v":2},"UN",{"$f":"VLOOKUP($C247,Orçamento!A257:H516,8,FALSE)","v":257.57},{"$f":"VLOOKUP($C247,Orçamento!A257:I516,9,FALSE)","v":515.14},{"$f":"VLOOKUP($C247,Orçamento!A257:G516,7,FALSE)","v":0.22159999999999999},1.1122000000000001,null,"",null,""]
[{"$f":"'[1]Identificação-TCE'!$A$13","v":1},{"$f":"IF(AND(G248<>\"\",H248>0,I248<>\"\",J248<>0,K248<>0),COUNT($B$11:B247)+1,\"\")","v":237},{"$f":"Orçamento!A259","v":"14.1"},"SINAPI","SINAPI 97101","2022-02-11",{"$f":"VLOOKUP($C248,Orçamento!A259:C517,3,FALSE)","v":"EXECUÇÃO DE RADIER, ESPESSURA DE 10CM, FCK=30MPA, COM USO DE FORMAS EM MADEIRA SERRADA. AF_09/2017"},{"$f":"IFERROR(VLOOKUP($C248,Orçamento!A259:E517,5,FALSE),0)","v":9},{"$f":"VLOOKUP($C248,Orçamento!A259:D517,4,FALSE)","v":"M2"},{"$f":"VLOOKUP($C248,Orçamento!A259:H518,8,FALSE)","v":218.14},{"$f":"VLOOKUP($C248,Orçamento!A259:I518,9,FALSE)","v":1963.26},{"$f":"VLOOKUP($C248,Orçamento!A259:G518,7,FALSE)","v":0.22159999999999999},1.1122000000000001,null,"",null,""]
[{"$f":"'[1]Identificação-TCE'!$A$13","v":1},{"$f":"IF(AND(G249<>\"\",H249>0,I249<>\"\",J249<>0,K249<>0),COUNT($B$11:B248)+1,\"\")","v":238},{"$f":"Orçamento!A260","v":"14.2"},"SINAPI","SINAPI 95955","2022-02-11",{"$f":"VLOOKUP($C249,Orçamento!A260:C518,3,FALSE)","v":"EXECUÇÃO DE ESTRUTURAS DE CONCRETO ARMADO, PARA EDIFICAÇÃO HABITACIONAL UNIFAMILIAR TÉRREA (CASA ISOLADA), FCK=25MPA. AF_01/2017"},{"$f":"IFERROR(VLOOKUP($C249,Orçamento!A260:E518,5,FALSE),0)","v":1},{"$f":"VLOOKUP($C249,Orçamento!A260:D518,4,FALSE)","v":"M3"},{"$f":"VLOOKUP($C249,Orçamento!A260:H519,8,FALSE)","v":3955.24},{"$f":"VLOOKUP($C249,Orçamento!A260:I519,9,FALSE)","v":3955.24},{"$f":"VLOOKUP($C249,Orçamento!A260:G519,7,FALSE)","v":0.22159999999999999},1.1122000000000001,null,"",null,""]
[{"$f":"'[1]Identificação-TCE'!$A$13","v":1},{"$f":"IF(AND(G250<>\"\",H250>0,I250<>\"\",J250<>0,K250<>0),COUNT($B$11:B249)+1,\"\")","v":239},{"$f":"Orçamento!A261","v":"14.3"},"SINAPI","SINAPI 101159","2022-02-11",{"$f":"VLOOKUP($C250,Orçamento!A261:C519,3,FALSE)","v":"ALVENARIA DE VEDAÇÃO DE BLOCOS CERÂMICOS MACIÇOS DE 5X10X20CM (ESPESSURA 10CM) E ARGAMASSA DE ASSENTAMENTO COM PREPARO EM BETONEIRA. AF_05/2020"},{"$f":"IFERROR(VLOOKUP($C250,Orçamento!A261:E519,5,FALSE),0)","v":30},{"$f":"VLOOKUP($C250,Orçamento!A261:D519,4,FALSE)","v":"M2"},{"$f":"VLOOKUP($C250,Orçamento!A261:H520,8,FALSE)","v":152.41},{"$f":"VLOOKUP($C250,Orçamento!A261:I520,9,FALSE)","v":4572.3},{"$f":"VLOOKUP($C250,Orçamento!A261:G520,7,FALSE)","v":0.22159999999999999},1.1122000000000001,null,"",null,""]
[{"$f":"'[1]Identificação-TCE'!$A$13","v":1},{"$f":"IF(AND(G251<>\"\",H251>0,I251<>\"\",J251<>0,K251<>0),COUNT($B$11:B250)+1,\"\")","v":240},{"$f":"Orçamento!A262","v":"14.4"},"SINAPI","SINAPI 87878","2022-02-11",{"$f":"VLOOKUP($C251,Orçamento!A262:C520,3,FALSE)","v":"CHAPISCO APLICADO EM ALVENARIAS E ESTRUTURAS DE CONCRETO INTERNAS, COM COLHER DE PEDREIRO. ARGAMASSA TRAÇO 1:3 COM PREPARO MANUAL. AF_06/2014"},{"$f":"IFERROR(VLOOKUP($C251,Orçamento!A262:E520,5,FALSE),0)","v":30},{"$f":"VLOOKUP($C251,Orçamento!A262:D520,4,FALSE)","v":"M2"},{"$f":"VLOOKUP($C251,Orçamento!A262:H521,8,FALSE)","v":5.0199999999999996},{"$f":"VLOOKUP($C251,Orçamento!A262:I521,9,FALSE)","v":150.6},{"$f":"VLOOKUP($C251,Orçamento!A262:G521,7,FALSE)","v":0.22159999999999999},1.1122000000000001,null,"",null,""]
[{"$f":"'[1]Identificação-TCE'!$A$13","v":1},{"$f":"IF(AND(G252<>\"\",H252>0,I252<>\"\",J252<>0,K252<>0),COUNT($B$11:B251)+1,\"\")","v":241},{"$f":"Orçamento!A263","v":"14.5"},"SINAPI","SINAPI 87813","2022-02-11",{"$f":"VLOOKUP($C252,Orçamento!A263:C521,3,FALSE)","v":"EMBOÇO OU MASSA ÚNICA EM ARGAMASSA TRAÇO 1:2:8, PREPARO MECÂNICO COM BETONEIRA 400L, APLICADA MANUALMENTE EM SUPERFÍCIES EXTERNAS DA SACADA, ESPESSURA DE 35MM, SEM USO DE TELA METÁLICA DE REFORÇA CONTRA FISSURAÇÃO. AF_06/2014"},{"$f":"IFERROR(VLOOKUP($C252,Orçamento!A263:E521,5,FALSE),0)","v":30},{"$f":"VLOOKUP($C252,Orçamento!A263:D521,4,FALSE)","v":"M2"},{"$f":"VLOOKUP($C252,Orçamento!A263:H522,8,FALSE)","v":104.03},{"$f":"VLOOKUP($C252,Orçamento!A263:I522,9,FALSE)","v":3120.9},{"$f":"VLOOKUP($C252,Orçamento!A263:G522,7,FALSE)","v":0.22159999999999999},1.1122000000000001,null,"",null,""]
[{"$f":"'[1]Identificação-TCE'!$A$13","v":1},{"$f":"IF(AND(G253<>\"\",H253>0,I253<>\"\",J253<>0,K253<>0),COUNT($B$11:B252)+1,\"\")","v":242},{"$f":"Orçamento!A264","v":"14.6"},"SINAPI","SINAPI 98547","2022-02-11",{"$f":"VLOOKUP($C253,Orçamento!A264:C522,3,FALSE)","v":"IMPERMEABILIZAÇÃO DE SUPERFÍCIE COM MANTA ASFÁLTICA, DUAS CAMADAS, INCLUSIVE APLICAÇÃO DE PRIMER ASFÁLTICO, E=3MM E E=4MM. AF_06/2018"},{"$f":"IFERROR(VLOOKUP($C253,Orçamento!A264:E522,5,FALSE),0)","v":37},{"$f":"VLOOKUP($C253,Orçamento!A264:D522,4,FALSE)","v":"M2"},{"$f":"VLOOKUP($C253,Orçamento!A264:H523,8,FALSE)","v":212.09},{"$f":"VLOOKUP($C253,Orçamento!A264:I523,9,FALSE)","v":7847.33},{"$f":"VLOOKUP($C253,Orçamento!A264:G523,7,FALSE)","v":0.22159999999999999},1.1122000000000001,null,"",null,""]
[{"$f":"'[1]Identificação-TCE'!$A$13","v":1},{"$f":"IF(AND(G254<>\"\",H254>0,I254<>\"\",J254<>0,K254<>0),COUNT($B$11:B253)+1,\"\")","v":243},{"$f":"Orçamento!A265","v":"14.7"},"SINAPI","SINAPI 101749","2022-02-11",{"$f":"VLOOKUP($C254,Orçamento!A265:C523,3,FALSE)","v":"PISO CIMENTADO, TRAÇO 1:3 (CIMENTO E AREIA), ACABAMENTO LISO, ESPESSURA 4,0 CM, PREPARO MECÂNICO DA ARGAMASSA. AF_09/2020"},{"$f":"IFERROR(VLOOKUP($C254,Orçamento!A265:E523,5,FALSE),0)","v":37},{"$f":"VLOOKUP($C254,Orçamento!A265:D523,4,FALSE)","v":"M2"},{"$f":"VLOOKUP($C254,Orçamento!A265:H524,8,FALSE)","v":57.34},{"$f":"VLOOKUP($C254,Orçamento!A265:I524,9,FALSE)","v":2121.58},{"$f":"VLOOKUP($C254,Orçamento!A265:G524,7,FALSE)","v":0.22159999999999999},1.1122000000000001,null,"",null,""]
[{"$f":"'[1]Identificação-TCE'!$A$13","v":1},{"$f":"IF(AND(G255<>\"\",H255>0,I255<>\"\",J255<>0,K255<>0),COUNT($B$11:B254)+1,\"\")","v":244},{"$f":"Orçamento!A266","v":"14.8"},"CCU","CPUE 41","2022-02-11",{"$f":"VLOOKUP($C255,Orçamento!A266:C524,3,FALSE)","v":"Tratamento de estrutura metálica "},{"$f":"IFERROR(VLOOKUP($C255,Orçamento!A266:E524,5,FALSE),0)","v":37},{"$f":"VLOOKUP($C255,Orçamento!A266:D524,4,FALSE)","v":"M2"},{"$f":"VLOOKUP($C255,Orçamento!A266:H525,8,FALSE)","v":44.58},{"$f":"VLOOKUP($C255,Orçamento!A266:I525,9,FALSE)","v":1649.46},{"$f":"VLOOKUP($C255,Orçamento!A266:G525,7,FALSE)","v":0.22159999999999999},1.1122000000000001,null,"",null,""]
[{"$f":"'[1]Identificação-TCE'!$A$13","v":1},{"$f":"IF(AND(G256<>\"\",H256>0,I256<>\"\",J256<>0,K256<>0),COUNT($B$11:B255)+1,\"\")","v":245},{"$f":"Orçamento!A267","v":"14.9"},"CCU","CPUE 18","2022-02-11",{"$f":"VLOOKUP($C256,Orçamento!A267:C525,3,FALSE)","v":"TESTES FINAIS DE INSTALAÇÕES"},{"$f":"IFERROR(VLOOKUP($C256,Orçamento!A267:E525,5,FALSE),0)","v":1},"UN",{"$f":"VLOOKUP($C256,Orçamento!A267:H526,8,FALSE)","v":669.09},{"$f":"VLOOKUP($C256,Orçamento!A267:I526,9,FALSE)","v":669.09},{"$f":"VLOOKUP($C256,Orçamento!A267:G526,7,FALSE)","v":0.22159999999999999},1.1122000000000001,null,"",null,""]
[{"$f":"'[1]Identificação-TCE'!$A$13","v":1},{"$f":"IF(AND(G257<>\"\",H257>0,I257<>\"\",J257<>0,K257<>0),COUNT($B$11:B256)+1,\"\")","v":246},{"$f":"Orçamento!A268","v":"14.10"},"CCU","CPUE 17","2022-02-11",{"$f":"VLOOKUP($C257,Orçamento!A268:C526,3,FALSE)","v":"LIMPEZA FINAL DE OBRA"},{"$f":"IFERROR(VLOOKUP($C257,Orçamento!A268:E526,5,FALSE),0)","v":1300},{"$f":"VLOOKUP($C257,Orçamento!A268:D526,4,FALSE)","v":"M2"},{"$f":"VLOOKUP($C257,Orçamento!A268:H527,8,FALSE)","v":4.5599999999999996},{"$f":"VLOOKUP($C257,Orçamento!A268:I527,9,FALSE)","v":5928},{"$f":"VLOOKUP($C257,Orçamento!A268:G527,7,FALSE)","v":0.22159999999999999},1.1122000000000001,null,"",null,""]

{"sheet":"Identificação-TCE","index":2,"n_rows":62,"n_cols":7,"rows_kept":62,"cut":false,"hidden":true,"merged":[[10,0,11,0],[10,1,11,1],[0,0,0,6],[1,1,1,2],[2,1,2,6],[3,1,3,4],[4,5,4,6]]}
["IDENTIFICAÇÃO"]
["Modalidade*",null,null,"N° *",null,"Ano *"]
["Descrição do Objeto",{"$f":"Orçamento!B3","v":"Reforma dos setores 2 e 4 do Ginásio Municipal Osmar Fortes Barcellos (Ginásio Tesourinha) "}]
["Órgão ","SMELJ",null,null,null,"CNPJ *"]
["Tipo de Objeto*",null,"N° CENTRAL DE COMPRAS"]
["Preço Total Estimado",{"$f":"'Orçamento-TCE'!C6","v":2045309.4300000018}]
["Preço Total Proposto",{"$f":"'Proposta-TCE'!C6","v":2045309.4300000018}]
["Qtd. Itens Orçamento",{"$f":"COUNTIF('Orçamento-TCE'!$H$12:$H$257,\"<>0\")","v":246}]
["Atenção! Para incluir mais de 50 lotes, selecione as células A62 a G62 e arraste as fórmulas para baixo, de acordo com o número de lotes necessário."]
["*Campos de preenchimento obrigatório",null,"**Campos de preenchimento obrigatório para licitação composta por lotes"]
["Nº do lote**","Descrição do Lote**","Estimativa",null,null,null,"Proposta"]
[null,null,"Valor do lote (R$)",null,null,null,"Valor do lote (R$)"]
[1,{"$f":"B3","v":"Reforma dos setores 2 e 4 do Ginásio Municipal Osmar Fortes Barcellos (Ginásio Tesourinha) "},{"$f":"B6","v":2045309.4300000018},null,null,null,{"$f":"B7","v":2045309.4300000018}]
[null,null,0,null,null,null,0]
[null,null,0,null,null,null,0]
[null,null,0,null,null,null,0]
[null,null,0,null,null,null,0]
[null,null,0,null,null,null,0]
[null,null,0,null,null,null,0]
[null,null,0,null,null,null,0]
[null,null,0,null,null,null,0]
[null,null,0,null,null,null,0]
[null,null,0,null,null,null,0]
[null,null,0,null,null,null,0]
[null,null,0,null,null,null,0]
[null,null,0,null,null,null,0]
[null,null,0,null,null,null,0]
[null,null,0,null,null,null,0]
[null,null,0,null,null,null,0]
[null,null,0,null,null,null,0]
[null,null,0,null,null,null,0]
[null,null,0,null,null,null,0]
[null,null,0,null,null,null,0]
[null,null,0,null,null,null,0]
[null,null,0,null,null,null,0]
[null,null,0,null,null,null,0]
[null,null,0,null,null,null,0]
[null,null,0,null,null,null,0]
[null,null,0,null,null,null,0]
[null,null,0,null,null,null,0]
[null,null,0,null,null,null,0]
[null,null,0,null,null,null,0]
[null,null,0,null,null,null,0]
[null,null,0,null,null,null,0]
[null,null,0,null,null,null,0]
[null,null,0,null,null,null,0]
[null,null,0,null,null,null,0]
[null,null,0,null,null,null,0]
[null,null,0,null,null,null,0]
[null,null,0,null,null,null,0]
[null,null,0,null,null,null,0]
[null,null,0,null,null,null,0]
[null,null,0,null,null,null,0]
[null,null,0,null,null,null,0]
[null,null,0,null,null,null,0]
[null,null,0,null,null,null,0]
[null,null,0,null,null,null,0]
[null,null,0,null,null,null,0]
[null,null,0,null,null,null,0]
[null,null,0,null,null,null,0]
[null,null,0,null,null,null,0]
[null,null,0,null,null,null,0]

{"sheet":"Orçamento","index":3,"n_rows":272,"n_cols":12,"rows_kept":272,"cut":false,"hidden":false,"merged":[[271,0,271,1],[1,2,1,8],[5,0,5,8],[4,6,4,8],[2,6,2,8],[3,6,3,8]]}
[]
[null,null,"PREFEITURA DE PORTO ALEGRE"]
["Obra:","Reforma dos setores 2 e 4 do Ginásio Municipal Osmar Fortes Barcellos (Ginásio Tesourinha) ",{"$nulls":4},"SINAPI data base jan/2022 - não desonerado"]
["Endereço:","Av. Erico Veríssimo, s/n",{"$nulls":4},"Data referência técnica SINAPI: 11/02/2022"]
["SEI:","22.0.000029811-9",{"$nulls":4},"Data base ORSE:  jan/2022"]
["ORÇAMENTO DISCRIMINADO"]
["ITEM","FONTE PREÇO"," DISCRIMINAÇÃO","UNID.","QUANT.","PREÇO UNITÁRIO (R$)","BDI","PREÇO UNITÁRIO C/ BDI       (R$)","CUSTO TOTAL                    (R$)"]
[]
[1,null,"INSTALAÇÕES PROVISÓRIAS",{"$nulls":5},{"$f":"SUM(I10:I13)","v":8593.67}]
["1.1","CPUE  30","PLACA DE OBRA","M2",2.88,{"$f":"CPUE!J21","v":320.00669999999997},0.22159999999999999,{"$f":"ROUND(F10*(1+G10),2)","v":390.92},{"$f":"ROUND(E10*H10,2)","v":1125.8499999999999}]
["1.2","CPUE  54","ANDAIME TUBULAR METÁLICO","MÊS",8,{"$f":"CPUE!J103","v":646.51040000000012},0.22159999999999999,{"$f":"ROUND(F11*(1+G11),2)","v":789.78},{"$f":"ROUND(E11*H11,2)","v":6318.24}]
["1.3","SINAPI 101908","EXTINTOR DE INCÊNDIO PORTÁTIL COM CARGA DE PQS DE 4 KG, CLASSE BC - FORNECIMENTO E INSTALAÇÃO. AF_10/2020_P","UNID",2,231.64,0.22159999999999999,282.97000000000003,565.94000000000005]
["1.4","SINAPI 101905","EXTINTOR DE INCÊNDIO PORTÁTIL COM CARGA DE ÁGUA PRESSURIZADA DE 10 L, CLASSE A - FORNECIMENTO E INSTALAÇÃO. AF_10/2020_P","UNID",2,238.88,0.22159999999999999,291.82,583.64]
[2,null,"ADMINISTRAÇÃO DA OBRA",{"$nulls":5},{"$f":"SUM(I15:I15)","v":116639.28}]
["2.1","CPUE 116","ADMINISTRAÇÃO LOCAL","UNID",1,{"$f":"CPUE!J521","v":95480.75},0.22159999999999999,116639.28,{"$f":"ROUND(E15*H15,2)","v":116639.28}]
[3,null,"REMOÇÕES E DEMOLIÇÕES",{"$nulls":5},{"$f":"SUM(I17:I27)","v":43890.93}]
["3.1","SINAPI 97640","REMOÇÃO DE FORROS DE DRYWALL, PVC E FIBROMINERAL, DE FORMA MANUAL, SEM REAPROVEITAMENTO. AF_12/2017","M2",317.29000000000002,1.51,0.22159999999999999,1.84,{"$f":"ROUND(E17*H17,2)","v":583.80999999999995}]
["3.2","SINAPI 97629","DEMOLIÇÃO DE LAJES, DE FORMA MECANIZADA COM MARTELETE, SEM REAPROVEITAMENTO. AF_12/2017","M3",7.53,122.13,0.22159999999999999,149.19,{"$f":"ROUND(E18*H18,2)","v":1123.4000000000001}]
["3.3","SINAPI 97642","REMOÇÃO DE TRAMA METÁLICA OU DE MADEIRA PARA FORRO, DE FORMA MANUAL SEM REAPROVEITAMENTO. AF_12/2017","M2",189.14,2.71,0.22159999999999999,3.31,626.04999999999995]
["3.4","SINAPI  97633","DEMOLIÇÃO DE REVESTIMENTO CERÂMICO, DE FORMA MANUAL, SEM REAPROVEITAMENTO. AF_12/2017","M2",301.22000000000003,19.34,0.22159999999999999,23.63,7117.83]
["3.5","SINAPI  97634","DEMOLIÇÃO DE REVESTIMENTO CERÂMICO, DE FORMA MECANIZADA COM MARTELETE, SEM REAPROVEITAMENTO. AF_12/2017","M2",1053.1600000000001,11.22,0.22159999999999999,13.71,14438.82]
["3.6","SINAPI  97621","DEMOLIÇÃO DE ALVENARIA DE BLOCO FURADO, DE FORMA MANUAL, COM REAPROVEITAMENTO. AF_12/2017","M3",66.849999999999994,100.37,0.22159999999999999,122.61,8196.48]
["3.7","SINAPI  97638","REMOÇÃO DE CHAPAS E PERFIS DE DRYWALL, DE FORMA MANUAL, SEM REAPROVEITAMENTO. AF_12/2017","M2",23.23,6.99,0.22159999999999999,8.5399999999999991,198.38]
["3.8","SINAPI  97644","REMOÇÃO DE PORTAS, DE FORMA MANUAL, SEM REAPROVEITAMENTO. AF_12/2017","m2",84.21,7.85,0.22159999999999999,9.59,807.57]
["3.9","SINAPI  97645","REMOÇÃO DE JANELAS, DE FORMA MANUAL, SEM REAPROVEIAMENTO. AF_12/2017","M2",116.42,29.6,0.22159999999999999,36.159999999999997,4209.75]
["3.10","SINAPI  97663","REMOÇÃO DE LOUÇAS, DE FORMA MANUAL, SEM REAPROVEITAMENTO. AF_12/2017","UNID",55,10.41,0.22159999999999999,12.72,699.6]
["3.11","SINAPI 95875","TRANSPORTE COM CAMINHÃO BASCULANTE DE 10M3, EM VIA URBANA PAVIMENTADA, DMT ATÉ 30 KM (UNIDADE: M3XKM). AF_07/2020","M3XKM",2944.62,1.64,0.22159999999999999,2,5889.24]
[4,null,"PAREDES E PAINÉIS",{"$nulls":5},{"$f":"SUM(I29:I33)","v":62287.359999999993}]
["4.1","SINAPI 103324","ALVENARIA DE VEDAÇÃO DE BLOCOS CERÂMICOS FURADOS NA VERTICAL DE 14X19X39 CM (ESPESSURA 14 CM) E ARGAMASSA DE ASSENTAMENTO COM PREPARO EM BETONEIRA. AF_12/2021","M2",373.38,71.040000000000006,0.22159999999999999,86.78,{"$f":"ROUND(E29*H29,2)","v":32401.919999999998}]
["4.2","SINAPI 103326","ALVENARIA DE VEDAÇÃO DE BLOCOS CERÂMICOS FURADOS NA VERTICAL DE 19X19X39 CM (ESPESSURA 19 CM) E ARGAMASSA DE ASSENTAMENTO COM PREPARO EM BETONEIRA. AF_12/2021","M2",3.9,86.43,0.22159999999999999,105.58,{"$f":"ROUND(E30*H30,2)","v":411.76}]
["4.3","SINAPI 96361","PAREDE COM PLACAS DE GESSO ACARTONADO (DRYWALL), PARA USO INTERNO, COM DUAS FACES SIMPLES E ESTRUTURA METÁLICA COM GUIAS DUPLAS, COM VÃOS. AF_06/2017","M2",114.08,180.69,0.22159999999999999,220.73,25180.880000000001]
["4.4","SINAPI 102257","DIVISÓRIA SANITÁRIA, TIPO CABINE, EM PAINEL DE GRANILITE, ESP = 3CM, ASSENTADO COM ARGAMASSA COLANTE AC III-E, EXCLUSIVE FERRAGENS. AF_01/2021","M2",11.34,254.43,0.22159999999999999,310.81,3524.59]
["4.5","ORSE 00178","FERRAGEM PARA DIVISÓRIA (VÃO PORTA) COMPOSTA DE 3 DOBRADIÇAS PALMELA E 1 FECHADURA TUBULAR LOCKWELL COM BOTÃO DE GIRO PARA TRAVAMENTO, REF: 41410N, OU SIMILAR","CJ",3,209.62,0.22159999999999999,256.07,768.21,null,null,""]
[5,null,"ESQUADRIAS METÁLICAS E DE MADEIRA C/FERRAGENS E VIDROS",{"$nulls":5},{"$f":"SUM(I35:I52)","v":260278.17999999996}]
["5.1","COT 01","EA01","UNID",1,{"$f":"'Mapa Cotacões'!H8","v":961},0.13730000000000001,1092.95,{"$f":"ROUND(E35*H35,2)","v":1092.95}]
["5.2","COT 01","EA03","UNID",3,{"$f":"'Mapa Cotacões'!H15","v":1750},0.13730000000000001,1990.28,{"$f":"ROUND(E36*H36,2)","v":5970.84}]
["5.3","COT 01","EA04","UNID",1,{"$f":"'Mapa Cotacões'!H22","v":2550},0.13730000000000001,2900.12,2900.12]
["5.4","COT 01","EA05","UNID",5,{"$f":"'Mapa Cotacões'!H29","v":2700},0.13730000000000001,3070.71,15353.55]
["5.5","COT 01","EA09","UNID",3,{"$f":"'Mapa Cotacões'!H36","v":4400},0.13730000000000001,5004.12,15012.36]
["5.6","COT 01","EA11","UNID",4,{"$f":"'Mapa Cotacões'!H43","v":4800},0.13730000000000001,5459.04,21836.16]
["5.7","COT 01","EA12","UNID",5,{"$f":"'Mapa Cotacões'!H50","v":9300},0.13730000000000001,10576.89,52884.45]
["5.8","COT 01","EA13","UNID",2,{"$f":"'Mapa Cotacões'!H57","v":4950},0.13730000000000001,5629.64,11259.28]
["5.9","COT 01","EA15","UNID",7,{"$f":"'Mapa Cotacões'!H64","v":4565.74},0.13730000000000001,5192.62,36348.339999999997]
["5.10","COT 01","EA16","UNID",1,{"$f":"'Mapa Cotacões'!H78","v":13234},0.13730000000000001,15051.03,15051.03]
["5.11","COT 110","EA18   ","UNID",1,{"$f":"'Mapa Cotacões'!H85","v":20800},0.13730000000000001,23655.84,23655.84]
["5.12","CPUE 56","PM01 - 1 FOLHA DE ABRIR 0,70 X 1,40 M","UNID",3,{"$f":"CPUE!J118","v":957.76017500000012},0.22159999999999999,1170,3510]
["5.13","SINAPI 100687","KIT DE PORTA DE MADEIRA FRISADA, SEMI-OCA (LEVE OU MÉDIA), PADRÃO MÉDIO, 60X210CM, ESPESSURA DE 3,5CM, ITENS INCLUSOS: DOBRADIÇAS, MONTAGEM E INSTALAÇÃO DE BATENTE, FECHADURA COM EXECUÇÃO DO FURO - FORNECIMENTO E INSTALAÇÃO. AF_12/2019","UNID",4,1069.17,0.22159999999999999,1306.0999999999999,5224.3999999999996]
["5.14","SINAPI 100689","KIT DE PORTA DE MADEIRA FRISADA, SEMI-OCA (LEVE OU MÉDIA), PADRÃO MÉDIO, 80 X 210CM, ESPESSURA DE 3,5CM,ITENS INCLUSOS: DOBRADIÇAS, MONTAGEM E INSTALAÇÃO DE BATENTE, FECHADURA COM EXECUÇÃO DO FURO - FORNECIMENTO E INSTALAÇÃO. AF_12/2019","UNID",18,1156.98,0.22159999999999999,1413.37,25440.66]
["5.15","CPUE 57","PM04 - 1 FOLHA DE ABRIR 1,00x2,10 M","UNID",11,{"$f":"CPUE!J133","v":1163.2341750000001},0.22159999999999999,1421.01,15631.11]
["5.16","CPUE 58","PM06 - 2 FOLHAS DE ABRIR 1,60 X 2,10 M","UNID",2,{"$f":"CPUE!J148","v":1373.9991750000004},0.22159999999999999,1678.48,3356.96]
["5.17","CPUE 59","PM07 - 2 FOLHAS DE ABRIR 1,80 X 2,10 M","UNID",2,{"$f":"CPUE!J163","v":1535.6191750000003},0.22159999999999999,1875.91,3751.82]
["5.18","CPUE 60","PM08 - 2 FOHAS DE ABRIR 2,00 X 2,10 M","UNID",1,{"$f":"CPUE!J178","v":1635.8141750000002},0.22159999999999999,1998.31,1998.31]
[6,null,"PROTEÇÕES",{"$nulls":5},{"$f":"SUM(I54:I58)","v":25972.42}]
["6.1","CPUE 119","IMPERMEABILIZAÇÃO DE SUPERFÍCIE COM EMULSÃO ASFÁLTICA, DUAS CAMADAS, COM APLICAÇÃO DE VÉU DE POLIÉSTER","M2",40.36,{"$f":"CPUE!J533","v":50.379999999999995},0.22159999999999999,61.54,{"$f":"ROUND(E54*H54,2)","v":2483.75}]
["6.2","SINAPI 101749","PISO CIMENTADO, TRAÇO 1:3 (CIMENTO E AREIA), ACABAMENTO LISO, ESPESSURA 4,0 CM, PREPARO MECÂNICO DA ARGAMASSA. AF_09/2020","M2",40.36,46.94,0.22159999999999999,57.34,{"$f":"ROUND(E55*H55,2)","v":2314.2399999999998}]
["6.3","SINAPI 98567","PROTEÇÃO MECÂNICA DE SUPERFÍCIE HORIZONTAL COM ARGAMASSA DE CIMENTO E AREIA, TRAÇO 1:3, E= 4CM. AF_06/2018","M2",40.36,56.65,0.22159999999999999,69.2,2792.91]
["6.4","CPUE 36","BASE DE DISTRIUBUIÇÃO DE CARGA SOBRE CONTRAPISO EXISTENTE, E=2CM","M2",40.36,{"$f":"CPUE!J44","v":120.51909999999998},0.22159999999999999,147.22999999999999,5942.2]
["6.5","CPUE 35","TRATAMENTO DE ESTRUTURAS DE CONCRETO ARMADO","M2",24.95,{"$f":"CPUE!J35","v":408.12840000000006},0.22159999999999999,498.57,12439.32]
[7,null,"REVESTIMENTOS - FORROS - PINTURAS",{"$nulls":5},{"$f":"SUM(I60:I70)","v":252435.65}]
["7.1","SINAPI 87878","CHAPISCO APLICADO EM ALVENARIAS E ESTRUTURAS DE CONCRETO INTERNAS, COM COLHER DE PEDREIRO. ARGAMASSA TRAÇO 1:3 COM PREPARO MANUAL. AF_06/2014","M2",616.20000000000005,4.1100000000000003,0.22159999999999999,5.0199999999999996,{"$f":"ROUND(E60*H60,2)","v":3093.32}]
["7.2","SINAPI  87529","MASSA ÚNICA, PARA RECEBIMENTO DE PINTURA EM ARGAMASSA TRAÇO 1:2:8, PREPARO MECÂNICO COM BETONEIRA 400L, APLICADA MANUALMENTE EM FACES INTERNAS DE PAREDES, ESPESSURA DE 20MM, COM EXECUÇÃO DE TALISCAS. AF_06/2014","M2",616.20000000000005,30.5,0.22159999999999999,37.26,{"$f":"ROUND(E61*H61,2)","v":22959.61}]
["7.3","SINAPI 87274","REVESTIMENTO CERÂMICO PARA PAREDES INTERNAS COM PLACAS TIPO ESMALTADA EXTRA DE DIMENSÕES 33X45CM APLICADAS EM AMBIENTES DE ÁREA MENOR QUE 5M2 A MEIA ALTURA DAS PAREDES. AF_06/2014","M2",757.83,68.83,0.22159999999999999,84.08,63718.35]
["7.4","SINAPI 39511","FORRO DE FIBRA MINERAL EM PLACAS DE 625X625MM, E=15MM, BORDA RETA, COM PINTURA ANTIMOFO, APOIADO EM PERFIL DE AÇO GALVANIZADO COM 24MM DE BASE - INSTALADO","M2",846.46,108.05,0.22159999999999999,131.99,111724.26]
["7.5","SINAPI 100717","LIXAMENTO MANUAL EM SUPERFÍCIES METÁLICAS EM OBRA. AF_01/2020","M2",172.56,8.4499999999999993,0.22159999999999999,10.32,1780.82]
["7.6","SINAPI 100722","PINTURA COM TINTA ALQUÍDICA DE FUNDO (TIPO ZARCÃO) APLICADA A ROLO OU PINCEL SOBRE SUPERFÍCIES METÁLICAS (EXCETO PERFIL) EXECUTADO EM OBRA (POR DEMÃO). AF_01/2020","M2",172.56,20.52,0.22159999999999999,25.07,4326.08]
["7.7","SINAPI 100734","PINTURA COM TINTA ACRÍLICA DE FUNDO APLICADA A ROLO OU PINCEL SOBRE SUPERFÍCIES METÁLICAS (EXCETO PERFIL) EXECUTADO EM OBRA (POR DEMÃO). AF_01/2020","M2",172.56,12.77,0.22159999999999999,15.6,2691.94]
["7.8","SINAPI 102220","PINTURA TINTA DE ACABAMENTO (PIGMENTADA) ESMALTE SINTÉTICO BRILHANTE EM MADEIRA, 2 DEMÃOS. AF_01/2021","M2",242.55,13.7,0.22159999999999999,16.739999999999998,4060.29]
["7.9","SINAPI 88485","APLICAÇÃO DE FUNDO SELADOR ACRÍLICO EM PAREDES, UMA DEMÃO. AF_06/2014","M2",214.93,2.2999999999999998,0.22159999999999999,2.81,603.95000000000005]
["7.10","SINAPI 88489","APLICAÇÃO MANUAL DE PINTURA COM TINTA LÁTEX ACRÍLICA EM PAREDES, DUAS DEMÃOS. AF_06/2014","M2",1765.7,14.79,0.22159999999999999,18.07,31906.2]
["7.11","SINAPI 88495","APLICAÇÃO E LIXAMENTO DE MASSA LÁTEX EM PAREDES, UMA DEMÃO. AF_06/2014","M2",384.46,11.86,0.22159999999999999,14.49,5570.83]
[8,null,"PAVIMENTAÇÕES INTERNAS",{"$nulls":5},{"$f":"SUM(I72:I80)","v":325733.75}]
["8.1","SINAPI 6076","SAIBRO PARA ARGAMASSA (COLETADO NO COMÉRCIO)","M3",107.19,60.42,0.22159999999999999,73.81,{"$f":"ROUND(E72*H72,2)","v":7911.69}]
["8.2","SINAPI 87620","CONTRAPISO EM ARGAMASSA TRAÇO 1:4 (CIMENTO E AREIA), PREPARO MECÂNICO COM BETONEIRA 400L, APLICADO EM ÁREAS SECAS SOBRE LAJE, ADERIDO, ESPESSURA 2CM. AF_06/2014","M2",975.2,27.16,0.22159999999999999,33.18,{"$f":"ROUND(E73*H73,2)","v":32357.14}]
["8.3","CPUE 106","CONTRAPISO DE CONCRETO ARMADO, E=6CM","M2",214.38,{"$f":"CPUE!J461","v":113.1468},0.22159999999999999,138.22,29631.599999999999]
["8.4","SINAPI 87262","REVESTIMENTO CERÂMICO PARA PISO COM PLACAS TIPO PORCELANATO DE DIMENSÕES 60X60CM APLICADA EM AMBIENTES DE ÁREA ENTRE 5M2 E 10M2. AF_06/2014","M2",451.99,137.47,0.22159999999999999,{"$f":"ROUND(F75*(1+G75),2)","v":167.93},75902.679999999993]
["8.5","CPUE 114","PISO DE PORCELANATO TÉCNICO 80X80CM - FORNECIMENTO E INSTALAÇÃO","M2",487.82,{"$f":"CPUE!J509","v":151.2552},0.22159999999999999,184.77,90134.5]
["8.6","SINAPI 101727","PISO VINÍLICO SEMI FLEXÍVEL EM PLACAS, PADRÃO LISO, ESPESSURA 3,2MM, FIXADO COM COLA. AF_09/2020","M2",192.91,163.22999999999999,0.22159999999999999,199.4,38466.25]
["8.7","SINAPI 98688","RODAPÉ EM POLIESTIRENO, ALTURA 5CM. AF_09/2020","M",618.22,51.14,0.22159999999999999,62.47,38620.199999999997]
["8.8","CPUE 113","SOLEIRA EM BASALTO - FORNECIMENTO E INSTALAÇÃO","M",32.85,{"$f":"CPUE!J501","v":89.431939999999997},0.22159999999999999,109.25,3588.86]
["8.9","CPUE 112","PEITORIL DE BASALTO EM JANELAS - FORNECIMENTO E INSTALAÇÃO","M",75.05,{"$f":"CPUE!J494","v":99.48299999999999},0.22159999999999999,121.53,9120.83]
[9,null,"ROTA ACESSÍVEL",{"$nulls":5},{"$f":"SUM(I82:I83)","v":1427.09}]
["9.1","SINAPI 97634","DEMOLIÇÃO DE REVESTIMENTO CERÂMICO, DE FORMA MECANIZADA COM MARTELETE, SEM REAPROVEITAMENTO. AF_12/2017","M2",13.5,11.22,0.22159999999999999,13.71,{"$f":"ROUND(E82*H82,2)","v":185.09}]
["9.2","CPUE 107","PISO PODOTÁTIL ALERTA/DIRECIONAL 40X40CM","M",30,{"$f":"CPUE!J471","v":33.891953000000001},0.22159999999999999,41.4,{"$f":"ROUND(E83*H83,2)","v":1242}]
[10,null,"INSTALAÇÕES ELETRICAS",{"$nulls":5},{"$f":"SUM(I85:I138)","v":495006.48999999982}]
["10.1","CPUE 61"," QGBT - ARMÁRIO AUTO PORTANTE COM BASE SOLEIRA E OLHAIS DE IÇAMENTO COM PORTA INTERNA METÁLICA. 1600X700X350, DISJ. GERAL CX. MOLDADA 35KA/380V – 600 A 01PÇ MULTIMEDIDOR DIGITAL DE GRANDEZAS ELETRICAS DISJUNTORES PARCIAIS EM CX. MOLDADA 18KA/380V CFE. PROJETO.  COM INSTALAÇÃO.","UNID",1,{"$f":"CPUE!J184","v":28130.6},0.22159999999999999,34364.339999999997,{"$f":"ROUND(E85*H85,2)","v":34364.339999999997}]
["10.2","CPUE 63","CD-Q2 - QUADRO DE FORÇA DE SOBREPOR MONTADO EM CAIXA DE COMANDO COM DIMENSÕES MÍNIMAS DE 1800X500X150MM, 66 LUGARES. COM INSTALAÇÃO.","UNID",1,{"$f":"CPUE!J196","v":5570.01},0.22159999999999999,6804.32,{"$f":"ROUND(E86*H86,2)","v":6804.32}]
["10.3","CPUE 64","CD-Q3 - QUADRO DE FORÇA DE SOBREPOR MONTADO EM CAIXA DE COMANDO COM DIMENSÕES MÍNIMAS DE 1800X500X150MM, 66 LUGARES. COM INSTALAÇÃO.","UNID",1,{"$f":"CPUE!J202","v":5414.0599999999995},0.22159999999999999,6613.82,6613.82]
["10.4","CPUE 67","QF EMERGENCIA - QUADRO DE FORÇA DE SOBREPOR MONTADO EM CAIXA DE COMANDO COM DIMENSÕES MÍNIMAS DE 800X500X150MM. COM INSTALAÇÃO.","UNID",1,{"$f":"CPUE!J220","v":3246.79},0.22159999999999999,3966.28,3966.28]
["10.5","SINAPI 92992","CABO DE COBRE FLEXÍVEL ISOLADO, 95MM2, ANTI-CHAMA 0,6/1,0kV, PARA DISTRIBUIÇÃO - FORNECIMENTO E INSTALAÇÃO. AF_12/2015","M",440,101.54,0.22159999999999999,124.04,54577.599999999999]
["10.6","SINAPI 92988","CABO DE COBRE FLEXÍVEL ISOLADO, 50MM2, ANTI-CHAMA 0,6/1,0kV, PARA DISTRIBUIÇÃO - FORNECIMENTO E INSTALAÇÃO. AF_12/2015","M",110,55.84,0.22159999999999999,68.209999999999994,7503.1]
["10.7","SINAPI 92986","CABO DE COBRE FLEXÍVEL ISOLADO, 35MM2, ANTI-CHAMA 0,6/1,0kV, PARA DISTRIBUIÇÃO - FORNECIMENTO E INSTALAÇÃO. AF_12/2015","M",280,39.65,0.22159999999999999,48.44,13563.2]
["10.8","SINAPI 92984","CABO DE COBRE FLEXÍVEL ISOLADO, 25MM2, ANTI-CHAMA 0,6/1,0kV, PARA DISTRIBUIÇÃO - FORNECIMENTO E INSTALAÇÃO. AF_12/2015","M",620,29.19,0.22159999999999999,35.659999999999997,22109.200000000001]
["10.9","SINAPI 92982","CABO DE COBRE FLEXÍVEL ISOLADO, 16MM2, ANTI-CHAMA 0,6/1,0kV, PARA DISTRIBUIÇÃO - FORNECIMENTO E INSTALAÇÃO. AF_12/2015","M",250,18.28,0.22159999999999999,22.33,5582.5]
["10.10","SINAPI 92980","CABO DE COBRE FLEXÍVEL ISOLADO, 10MM2, ANTI-CHAMA 0,6/1,0kV, PARA DISTRIBUIÇÃO - FORNECIMENTO E INSTALAÇÃO. AF_12/2015","M",720,11.94,0.22159999999999999,14.59,10504.8]
["10.11","CPUE 43","LUMINÁRIA DE EMBUTIR - COMPLETA COM QUATRO LÂMPADAS TUBULARES LED T8 (4x9 - 10W), INSTALAÇÃO EM FORRO COM MODELAÇÃO DE 625X625MM, COM REFLETOR PARABÓLICO E ALETAS DE ALUMÍNIO ANODIZADO BRILHANTE DE ALTA REFLETÂNCIA E ALTA PUREZA 99,85%. SOQUETE TIPO PUSH-IN G-13 DE ENGATE RÁPIDO, ROTOR DE SEGURANÇA EM POLICARBONATO E CONTATOS EM BRONZE FOSFOROSO, COMPLETA. CERTIFICAÇÃO CE, GARANTIA MÍNIMA DE 2 ANOS","UNID",150,{"$f":"CPUE!J65","v":452.7},0.22159999999999999,553.02,82953]
["10.12","SINAPI 97585","LUMINÁRIA TIPO CALHA, DE SOBREPOR, COM 2 LÂMPADAS TUBULARES FLUORESCENTES DE 18W, COM REATOR DE PARTIDA RÁPIDA - FORNECIMENTO E INSTALAÇÃO. AF_02/2020","UNID",23,145.29,0.22159999999999999,177.49,4082.27]
["10.13","CPUE 44","LUMINÁRIA DE SOBREPOR - COMPLETA COM DUAS LÂMPADAS TUBULARES LED T8 (2X9W), INSTALAÇÃO EM FORRO DE GESSO, COM REFLETOR PARABÓLICO E ALETAS DE ALUMÍNIO ANODIZADO BRILHANTE DE ALTA REFLETÂNCIA E ALTA PUREZA 99,85%. SOQUE TIPO PUSH-IN G-13 DE ENGATE RÁPIDO, ROTOR DE SEGURANÇA EM POLICARBONATO E CONTATOS EM BRONZE FOSFOROSO. COMPLETA. CERTIFICAÇÃO CE. GARANTIA MÍNIMA 2 ANOS. ","UNID",1,{"$f":"CPUE!J72","v":176.91},0.22159999999999999,216.11,216.11]
["10.14","CPUE 45","Luminária arandela de Sobrepor - Lâmpada led 18 W ","UNID",19,{"$f":"CPUE!J79","v":140.24},0.22159999999999999,171.32,3255.08]
["10.15","SINAPI 97595","SENSOR DE PRESENÇA COM FOTOCÉLULA, FIXAÇÃO EM PAREDE - FORNECIMENTO E INSTALAÇÃO. AF_02/2020","UNID",2,124.76,0.22159999999999999,152.41,304.82]
["10.16","CPUE 71","MÓDULO AUTÔNOMO DE ILUMINAÇÃO DE EMERGÊNCIA COM DIFUSOR LEITOSO, 500 LÚMENS, 115/220V, COM 80 LED'S. ALTO BRILHO, BATERIA 6V, 4,5Ah, AUTONOMIA DE 8 HORAS, GABINETE EM METAL, PINTURA EPÓXI. REF. TECHNOMASTER LM 0180 OU EQUIVALENTE","UNID",23,{"$f":"CPUE!J238","v":150.92000000000002},0.22159999999999999,184.36,4240.28]
["10.17","CPUE 72","MÓDULO AUTÔNOMO DE EMERGÊNCIA (127/220V) COM 2 FAROLETES DE 32 LED'S CADA, COM BATERIA 12V - 7A COM AUTONOMIA DE 32 HORAS COM SUPORTE METÁLICO PARA FIXAÇÃO DA BATERIA. REF. TECHNOMASTER UN0232 OU EQUIVALENTE","UNID",1,{"$f":"CPUE!J244","v":232.62},0.22159999999999999,284.17,284.17]
["10.18","SINAPI 91953","INTERRUPTOR SIMPLES (1 MÓDULO), 10A//250V, INCLUINDO SUPORTE E PLACA - FORNECIMENTO E INSTALAÇÃO. AF_12/2015","UNID",14,24.2,0.22159999999999999,29.56,413.84]
["10.19","SINAPI 91959","INTERRUPTOR SIMPLES (2 MÓDULOS), 10A/250V, INCLUINDO SUPORTE E PLACA. FORNECIMENTO E INSTALAÇÃO. AF_12/2015","UNID",16,38.32,0.22159999999999999,46.81,748.96]
["10.20","SINAPI 91967","INTERRUPTOR SIMPLES (3 MÓDULOS), 10A/250V, INCLUINDO SUPORTE E PLACA. FORNECIMENTO E INSTALAÇÃO. AF_12/2015","UNID",9,52.46,0.22159999999999999,64.09,576.80999999999995]
["10.21","SINAPI 91981","INTERRUPTOR BIPOLAR, (1 MÓDULO), 10A/250V, INCLUINDO SUPORTE E PLACA. FORNECIMENTO E INSTALAÇÃO. AF_09/2017","UNID",10,42.68,0.22159999999999999,52.14,521.4]
["10.22","SINAPI 91979","INTERRUPTOR INTERMEDIÁRIO (1 MÓDULO), 10A/250V, INCLUINDO SUPORTE E PLACA. FORNECIMENTO E INSTALAÇÃO. AF_09/2017","UNID",1,43.98,0.22159999999999999,53.73,53.73]
["10.23","SINAPI 91992","TOMADA ALTA DE EMBUTIR (1 MÓDULO), 2P+T 10A, INCLUINDO SUPORTE E PLACA. FORNECIMENTO E INSTALAÇÃO. AF_12/2015","UNID",23,36.340000000000003,0.22159999999999999,44.39,1020.97]
["10.24","SINAPI 92004","TOMADA MÉDIA DE EMBUTIR (2 MÓDULOS), 2P+T 10A, INCLUINDO SUPORTE E PLACA. FORNECIMENTO E INSTALAÇÃO. AF_12/2015","UNID",56,47.14,0.22159999999999999,57.59,3225.04]
["10.25","SINAPI 92005","TOMADA MÉDIA DE EMBUTIR (2 MÓDULOS), 2P+T 20A, INCLUINDO SUPORTE E PLACA. FORNECIMENTO E INSTALAÇÃO. AF_12/2015","UNID",23,51.82,0.22159999999999999,63.3,1455.9]
["10.26","CPUE 47","CABO DE COBRE PP CORDPLAST 3X1,5MM2 HF (NÃO HALOGENADO), 70ºC 450/750V. REF. AFITOX, AFUMEX OU EQUIVALENTE. (LIGAÇÃO PGDM, INTERFONE, FECHO SAA, ILUM. PÓRTICO, LIGAÇÃO LUMINÁRIAS, TOTEM, CUBO, SENSOR PRESENÇA)","M",97,{"$f":"CPUE!J85","v":8.4459},0.22159999999999999,10.32,1001.04]
["10.27","CPUE 110","CONJUNTO PLUGS MACHO/FÊMEA 2P+T 10A/250V NBR 14136 (LIGAÇÃO LUMINÁRIAS)","CJ",193,{"$f":"CPUE!J477","v":18.784999999999997},0.22159999999999999,22.95,4429.3500000000004]
["10.28","SINAPI 91926","CABO DE COBRE FLEXÍVEL ISOLADO 2,5MM2, ANTI-CHAMA 450/750V, PARA CIRCUITOS TERMINAIS - FORNECIMENTO E INSTALAÇÃO. AF_12/2015","M",1920,4.0999999999999996,0.22159999999999999,5.01,9619.2000000000007]
["10.29","SINAPI 91928","CABO DE COBRE FLEXÍVEL ISOLADO 4MM2, ANTI-CHAMA 450/750V, PARA CIRCUITOS TERMINAIS - FORNECIMENTO E INSTALAÇÃO. AF_12/2015","M",160,6.79,0.22159999999999999,8.2899999999999991,1326.4]
["10.30","SINAPI 95745","ELETRODUTO DE AÇO GALVANIZADO, CLASSE LEVE, DN 20MM (3/4\"), APARENTE, INSTALADO EM TETO - FORNECIMENTO E INSTALAÇÃO. AF_11/2016_P","M",150,33.65,0.22159999999999999,41.11,6166.5]
["10.31","SINAPI 95746","ELETRODUTO DE AÇO GALVANIZADO, CLASSE LEVE, DN 25MM (1\"), APARENTE, INSTALADO EM TETO - FORNECIMENTO E INSTALAÇÃO. AF_11/2016_P","M",560,42.43,0.22159999999999999,51.83,29024.799999999999]
["10.32","CPUE 111","ELETRODUTO DE AÇO GALVANIZADO, CLASSE SEMI PESADO, DN 50MM - FORNECIMENTO E INSTALAÇÃO","M",90,{"$f":"CPUE!J485","v":89.09991500000001},0.22159999999999999,108.84,9795.6]
["10.33","CPUE 73","BARRAMENTO DE EQUIPOTENCIALIZAÇÃO","UNID",1,{"$f":"CPUE!J250","v":41.126000000000005},0.22159999999999999,50.24,50.24]
["10.34","SINAPI 96977","CORDOALHA DE COBRE NU, 50MM2, ENTERRADA, SEM ISOLADOR - FORNECIMENTO E INSTALAÇÃO. AF_12/2017","M",30,55.27,0.22159999999999999,67.52,2025.6]
["10.35","SINAPI 96986","HASTE DE ATERRAMENTO 3/4 PARA SPDA -FORNECIMENTO E INSTALAÇÃO. AF_12/2017","UNID",3,140.49,0.22159999999999999,171.62,514.86]
["10.36","ORSE 00764","Fornecimento e instalação de eletrocalha perfurada 300x100x3000mm","M",170,120.24,0.22159999999999999,146.88999999999999,24971.3]
["10.37","ORSE 12804","Tampa de encaixe 300x3000mm, zincada, para eletrocalha metálica","UNID",57,127.74,0.22159999999999999,156.05000000000001,8894.85]
["10.38","ORSE 09525","Suporte horizontal 300x100mm para fixação de eletrocalha metálica","UNID",170,13.19,0.22159999999999999,16.11,2738.7]
["10.39","ORSE 11923","Fornecimento e instalação de curva vertical em PVC, para eletrocalha, 300x100mm","UNID",8,124.31,0.22159999999999999,151.86000000000001,1214.8800000000001]
["10.40","ORSE 12803","Emenda interna 300 x 100 mm com base lisa perfurada para eletrocalha metálica (ref. Mopa ou similar)","UNID",169,24.64,0.22159999999999999,30.1,5086.8999999999996]
["10.41","CPUE 74","Perfilado 38x38mm chapa #18","M",440,{"$f":"CPUE!J256","v":35.031999999999996},0.22159999999999999,42.8,18832]
["10.42","CPUE 75","Suporte longo para perfilado 38x38MM","UNID",440,{"$f":"CPUE!J265","v":1.5450400000000002},0.22159999999999999,1.89,831.6]
["10.43","CPUE 76","Vergalhão rosca total 1/4\"","M",450,{"$f":"CPUE!J272","v":20.232500000000002},0.22159999999999999,24.72,11124]
["10.44","CPUE 77","Chumbador rosca interna 1/4\"","UNID",225,{"$f":"CPUE!J278","v":28.375},0.22159999999999999,34.659999999999997,7798.5]
["10.45","CPUE 78","TRANSFORMADOR TRIFÁSICO A SECO, PN=225KVA, CLASSE 15KV - BT 220/127V - 60HZ, IP00.","UNID",1,{"$f":"CPUE!J285","v":27905.028249999999},0.22159999999999999,34088.78,34088.78]
["10.46","CPUE 79","CABO DE COBRE UNIPOLAR #35MM² BLINDADO, ISOLAÇÃO 12/20KV EPR - COBERTURA EM PVC","M",300,{"$f":"CPUE!J292","v":104.13876},0.22159999999999999,127.22,38166]
["10.47","CPUE 91","TERMINAÇÃO TERMOCONTRÁTIL PARA CABO 35MM2, CLASSE 15kV (PARA USO EXTERNO)","UNID",3,{"$f":"CPUE!J365","v":260.185},0.22159999999999999,317.83999999999997,953.52]
["10.48","CPUE 85","TERMINAÇÃO TERMOCONTRÁTIL PARA CABO 35MM2, CLASSE 15kV (PARA USO INTERNO)","UNID",3,{"$f":"CPUE!J329","v":259.97500000000002},0.22159999999999999,317.58999999999997,952.77]
["10.49","CPUE 50","SECCIONADORA TRIPOLAR SECA 15KV-400A-TSI 95KV-COMANDO POR PUNHO","UNID",1,{"$f":"CPUE!J97","v":1381.9099999999999},0.22159999999999999,1688.14,1688.14]
["10.50","CPUE 49","SECCIONADORA TRIPOLAR FUSÍVEL 15KV-400A-TSI95KV-COMANDO POR PUNHO ABERTURA MÍNIMA 18CM-RUPTURA MÌNIMA 30KA-COM FUSÍVEL HH ABERTURA SOB CARGA","UNID",1,{"$f":"CPUE!J91","v":2878.7249999999995},0.22159999999999999,3516.65,3516.65]
["10.51","CPUE 80","PUNHO DE ACIONAMENTO DA SECCIONADORA C/ MICROINTERRUPTOR DO INTERTRAVAMENTO ELÉTRICO, DIRETAMENTE ATERRADO","UNID",1,{"$f":"CPUE!J298","v":331.1},0.22159999999999999,404.47,404.47]
["10.52","SINAPI 37558","PLACA DE SINALIZAÇÃO DE SEGURANÇA CONTRA INCÊNDIO, FOTOLUMINISCENTE, RETANGULAR, 20X40CM EM PVC 2MM, ANTI-CHAMAS (SÍMBOLOS, CORES E PICTOGRAMAS CONFORME NBR 13434)","UNID",3,37.25,0.22159999999999999,45.5,136.5]
["10.53","CPUE 81","QUADRO COM DIAGRAMA UNIFILAR DA SUBESTAÇÃO","UNID",1,{"$f":"CPUE!J303","v":537.54},0.22159999999999999,656.66,656.66]
["10.54","SINAPI 4796","PISO DE BORRACHA FRISADO OU PASTILHADO, PRETO, EM PLACAS DE 50X50CM, E=7MM, PARA ARGAMASSA","M2",0.25,180.55,0.22159999999999999,220.56,55.14]
[11,null,"INSTALAÇÕES HIDROSSANITÁRIAS",{"$nulls":5},{"$f":"SUM(I140:I215)","v":240492.54}]
["11.1","SINAPI 96635","TUBO, PPR, DN 25, CLASSE PN 20, INSTALADO EM RAMAL OU SUB-RAMAL DE ÁGUA - FORNECIMENTO E INSTALAÇÃO. AF_06/2015","M",60,28.1,0.22159999999999999,{"$f":"ROUND(F140*(1+G140),2)","v":34.33},{"$f":"ROUND(E140*H140,2)","v":2059.8000000000002}]
["11.2","SINAPI 89356","TUBO, PVC, SOLDÁVEL, DN 25MM, INSTALADO EM RAMAL OU SUB-RAMAL DE ÁGUA - FORNECIMENTO E INSTALAÇÃO. AF_12/2014","M",157,21.43,0.22159999999999999,26.18,{"$f":"ROUND(E141*H141,2)","v":4110.26}]
["11.3","SINAPI 96645","TUBO, PPR, DN 32, CLASSE PN 12, INSTALADO EM RAMAL DE DISTRIBUIÇÃO DE ÁGUA - FORNECIMENTO E INSTALAÇÃO. AF_06/2015","M",17,24.98,0.22159999999999999,30.52,518.84]
["11.4","SINAPI 89357","TUBO, PVC, SOLDÁVEL, DN 32MM, INSTALADO EM RAMAL OU SUB-RAMAL DE ÁGUA - FORNECIMENTO E INSTALAÇÃO. AF_12/2014","M",15,32.520000000000003,0.22159999999999999,39.729999999999997,595.95000000000005]
["11.5","SINAPI 89448","TUBO, PVC, SOLDÁVEL, DN 40MM, INSTALADO EM PRUMADA DE ÁGUA - FORNECIMENTO E INSTALAÇÃO. AF_12/2014","M",14,22.62,0.22159999999999999,27.63,386.82]
["11.6","SINAPI 89711","TUBO PVC SÉRIE NORMAL, ESGOTO PREDIAL, DN 40MM, FORNECIDO E INSTALADO EM RAMAL DE DESCARGA OU RAMAL DE ESGOTO SANITÁRIO. AF_12/2014","M",102,19.34,0.22159999999999999,23.63,2410.2600000000002]
["11.7","SINAPI 89449","TUBO, PVC, SOLDÁVEL, DN 50MM, INSTALADO EM PRUMADA DE ÁGUA - FORNECIMENTO E INSTALAÇÃO. AF_12/2014","M",40,25.98,0.22159999999999999,31.74,1269.5999999999999]
["11.8","SINAPI 89712","TUBO PVC SÉRIE NORMAL, ESGOTO PREDIAL, DN 50MM, FORNECIDO E INSTALADO EM RAMAL DE DESCARGA OU RAMAL DE ESGOTO SANITÁRIO. AF_12/2014","M",134,30.04,0.22159999999999999,36.700000000000003,4917.8]
["11.9","SINAPI 89451","TUBO, PVC, SOLDÁVEL, DN 75MM, INSTALADO EM PRUMADA DE ÁGUA - FORNECIMENTO E INSTALAÇÃO. AF_12/2014","M",155,71.84,0.22159999999999999,87.76,13602.8]
["11.10","SINAPI 89713","TUBO PVC SÉRIE NORMAL, ESGOTO PREDIAL, DN 75MM, FORNECIDO E INSTALADO EM RAMAL DE DESCARGA OU RAMAL DE ESGOTO SANITÁRIO. AF_12/2014","M",19,45.93,0.22159999999999999,56.11,1066.0899999999999]
["11.11","SINAPI 89714","TUBO PVC SÉRIE NORMAL, ESGOTO PREDIAL, DN 100MM, FORNECIDO E INSTALADO EM RAMAL DE DESCARGA OU RAMAL DE ESGOTO SANITÁRIO. AF_12/2014","M",43,58.27,0.22159999999999999,71.180000000000007,3060.74]
["11.12","SINAPI 96650","JOELHO 90 GRAUS, PPR, DN 25MM, CLASSE PN 25, INSTALADO EM RAMAL DE DISTRIBUIÇÃO - FORNECIMENTO E INSTALAÇÃO. AF_06/2015","UNID",62,9.43,0.22159999999999999,11.52,714.24]
["11.13","SINAPI 96665","TÊ NORMAL, PPR, DN 25MM, CLASSE PN 25, INSTALADO EM RAMAL DE DISTRIBUIÇÃO DE ÁGUA - FORNECIMENTO E INSTALAÇÃO. AF_06/2015","UNID",13,12.4,0.22159999999999999,15.15,196.95]
["11.14","SINAPI 89408","JOELHO 90 GRAUS, PVC, SOLDÁVEL, DN 25MM, INSTALADO EM RAMAL DE DISTRIBUIÇÃO DE ÁGUA - FORNECIMENTO E INSTALAÇÃO. AF_12/2014","UNID",113,6.1,0.22159999999999999,7.45,841.85]
["11.15","SINAPI 89395","TÊ, PVC, SOLDÁVEL, DN 25MM, INSTALADO EM RAMAL OU SUB-RAMAL DE ÁGUA - FORNECIMENTO E INSTALAÇÃO. AF_12/2014","UNID",34,12.07,0.22159999999999999,14.74,501.16]
["11.16","SINAPI 96662","BUCHA DE REDUÇÃO, PPR, 32X25, CLASSE PN 25, INSTALADO EM RAMAL DE DISTRIBUIÇÃO DE ÁGUA - FORNECIMENTO E INSTALAÇÃO. AF_06/2015","UNID",3,12.31,0.22159999999999999,15.04,45.12]
["11.17","SINAPI 89426","LUVA DE REDUÇÃO, PVC, SOLDÁVEL, DN 32MMX25MM, INSTALADO EM RAMAL DE DISTRIBUIÇÃO DE ÁGUA - FORNECIMENTO E INSTALAÇÃO. AF_12/2014","UNID",3,9.8800000000000008,0.22159999999999999,12.07,36.21]
["11.18","SINAPI 89413","JOELHO 90 GRAUS, PVC, SOLDÁVEL, DN 32MM, INSTALADO EM RAMAL DE DISTRIBUIÇÃO DE ÁGUA - FORNECIMENTO E INSTALAÇÃO. AF_12/2014","UNID",20,9.66,0.22159999999999999,11.8,236]
["11.19","SINAPI 96686","JOELHO 90 GRAUS, PPR, DN 32 MM, CLASSE PN 25, INSTALADO EM PRUMADA DE ÁGUA FORNECIMENTO E INSTALAÇÃO . AF_06/2015","UNID",16,7.42,0.22159999999999999,9.06,144.96]
["11.20","SINAPI 89497","JOELHO 90 GRAUS, PVC, SOLDÁVEL, DN 40MM, INSTALADO EM PRUMADA DE ÁGUA - FORNECIMENTO E INSTALAÇÃO. AF_12/2014","UNID",14,14.49,0.22159999999999999,17.7,247.8]
["11.21","SINAPI 89724","JOELHO 90 GRAUS, PVC, SERIE NORMAL, ESGOTO PREDIAL, DN 40MM, JUNTA SOLDÁVEL, FORNECIDO E INSTALADO EM RAMAL DE DESCARGA OU RAMAL DE ESGOTO SANITÁRIO. AF_12/2014","UNID",68,10.96,0.22159999999999999,13.39,910.52]
["11.22","SINAPI 89726","JOELHO 45 GRAUS, PVC, SERIE NORMAL, ESGOTO PREDIAL, DN 40MM, JUNTA SOLDÁVEL, FORNECIDO E INSTALADO EM RAMAL DE DESCARGA OU RAMAL DE ESGOTO SANITÁRIO. AF_12/2014","UNID",80,7.5,0.22159999999999999,9.16,732.8]
["11.23","SINAPI 89783","JUNÇÃO SIMPLES, PVC, SÉRIE NORMAL, ESGOTO PREDIAL, DN 40MM, JUNTA SOLDÁVEL, FORNECIDO E INSTALADO EM RAMAL DE DESCARGA OU RAMAL DE ESGOTO SANITÁRIO. AF_12/2014","UNID",28,13,0.22159999999999999,15.88,444.64]
["11.24","SINAPI 89501","JOELHO 90 GRAUS, PVC, SOLDÁVEL, DN 50MM, INSTALADO EM PRUMADA DE ÁGUA - FORNECIMENTO E INSTALAÇÃO. AF_12/2014","UNID",35,17.16,0.22159999999999999,20.96,733.6]
["11.25","SINAPI 89732","JOELHO 45 GRAUS, PVC, SÉRIE NORMAL, ESGOTO PREDIAL, DN 50MM, JUNTA ELÁSTICA, FORNECIDO E INSTALADO  EM RAMAL DE DESCARGA OU ESGOTO SANITÁRIO. AF_12/2014","UNID",59,11.9,0.22159999999999999,14.54,857.86]
["11.26","SINAPI 89731","JOELHO 90 GRAUS, PVC, SÉRIE NORMAL, ESGOTO PREDIAL, DN 50M, JUNTA ELÁSTICA, FORNECIDO E INSTALADO EM REMAL DE DESCARGA OU RAMAL DE ESGOTO SANITÁRIO. AF_12/2014","UNID",50,11.08,0.22159999999999999,13.54,677]
["11.27","SINAPI 89625","TÊ, PVC, SOLDÁVEL, DN 50MM, INSTALADO EM PRUMADA DE ÁGUA - FORNECIMENTO E INSTALAÇÃO. AF_12/2014","UNID",15,27.79,0.22159999999999999,33.950000000000003,509.25]
["11.28","SINAPI 89785","JUNÇÃO SIMPLES, PVC, SÉRIE NORMAL, ESGOTO PREDIAL, DN 50X50MM, JUNTA ELÁSTICA, FORNECIDO E INSTALADO EM RAMAL DE DESCARGA OU RAMAL DE ESGOTO SANITÁRIO. AF_12/2014","UNID",31,23.69,0.22159999999999999,28.94,897.14]
["11.29","SINAPI 89630","TÊ DE REDUÇÃO, PVC, SOLDÁVEL, DN 75MMX50MM, INSTALADO EM PRUMADA DE ÁGUA - FORNECIMENTO E INSTALAÇÃO. AF_12/2014","UNID",22,103.74,0.22159999999999999,126.73,2788.06]
["11.30","SINAPI 89665","REDUÇÃO EXCÊNTRICA, PVC, SÉRIE R, ÁGUA PLUVIAL, DN 75X50MM, JUNTA ELÁSTICA, FORNECIDO E INSTALADO EM CONDUTORES VERTICAIS DE ÁGUAS PLUVIAIS. AF_12/2014","UNID",3,15.71,0.22159999999999999,19.190000000000001,57.57]
["11.31","SINAPI 94682","JOELHO 90 GRAUS, PVC, SOLDÁVEL, DN 75MM, INSTALADO EM RESERVAÇÃO DE ÁGUA DE EDIFICAÇÃO QUE POSSUA RESERVATÓRIO DE FIBRA/FIBROCIMENTO - FORNECIMENTO E INSTALAÇÃO. AF_06/2016","UNID",24,172.53,0.22159999999999999,210.76,5058.24]
["11.32","SINAPI 89805","JOELHO 90 GRAUS, PVC, SÉRIE NORMAL, ESGOTO PREDIAL, DN 75MM, JUNTA ELÁSTICA, FORNECIDO E INSTALADO EM PRUMADA DE ESGOTO SANITÁRIO OU VENTILAÇÃO. AF_12/2014","UNID",9,15.69,0.22159999999999999,19.170000000000002,172.53]
["11.33","SINAPI 94697","TÊ, PVC, SOLDÁVEL, DN 75MM INSTALADO EM RESERVAÇÃO DE ÁGUA DE EDIFICAÇÃO QUE POSSUA RESERVATÓRIO DE FIBRA/FIBROCIMENTO - FORNECIMENTO E INSTALAÇÃO. AF_06/2016","UNID",13,127.61,0.22159999999999999,155.88999999999999,2026.57]
["11.34","SINAPI 89565","JUNÇÃO SIMPLES, PVC, SÉRIE R, ÁGUA PLUVIAL, DN 75X75MM, JUNTA ELÁSTICA, FORNECIDO E INSTALADO EM RAMAL DE ENCAMINHAMENTO. AF_12/2014","UNID",10,63.2,0.22159999999999999,77.209999999999994,772.1]
["11.35","SINAPI 89566","TÊ, PVC, SÉRIE R, ÁGUA PLUVIAL, DN 75MM, JUNTA ELÁSTICA - FORNECIDO E INSTALADO EM RAMAL DE ENCAMINHAMENTO. AF_12/2014","UNID",13,53.74,0.22159999999999999,65.650000000000006,853.45]
["11.36","SINAPI 89673","REDUÇÃO EXCÊNTRICA, PVC, SERIE R, ÁGUA PLUVIAL, DN 100 X 75 MM, JUNTA ELÁSTICA, FORNECIDO E INSTALADO EM CONDUTORES VERTICAIS DE ÁGUAS PLUVIAIS. AF_12/2014","UNID",12,32.1,0.22159999999999999,39.21,470.52]
["11.37","SINAPI 89745","CONECTOR, CPVC, SOLDÁVEL, DN 22MMX1/2, INSTALADO EM RAMAL DE DISTRIBUIÇÃO DE ÁGUA - FORNECIMENTO E INSTALAÇÃO. AF_12/2014","UNID",13,33.700000000000003,0.22159999999999999,41.17,535.21]
["11.38","SINAPI 89746","JOELHO 45 GRAUS, PVC, SÉRIE NORMAL, ESGOTO PREDIAL, DN 100MM, JUNTA ELÁSTICA, FORNECIDO E INSTALADO  EM RAMAL DE DESCARGA OU ESGOTO SANITÁRIO. AF_12/2014","UNID",31,25.8,0.22159999999999999,31.52,977.12]
["11.39","SINAPI 89797","JUNÇÃO SIMPLES, PVC, SÉRIE NORMAL, ESGOTO PREDIAL, DN 100X100MM, JUNTA ELÁSTICA, FORNECIDO E INSTALADO EM RAMAL DE DESCARGA OU RAMAL DE ESGOTO SANITÁRIO. AF_12/2014","UNID",22,51.67,0.22159999999999999,63.12,1388.64]
["11.40","SINAPI 89709","RALO SIFONADO, PVC, DN 100X40MM, JUNTA SOLDÁVEL, FORNECIDO E INSTALADO EM RAMAL DE DESCARGA OU EM RAMAL DE ESGOTO SANITÁRIO. AF_12/2014","UNID",17,18.05,0.22159999999999999,22.05,374.85]
["11.41","SINAPI 98110","CAIXA DE GORDURA PEQUENA (CAPACIDADE: 19L), CIRCULAR, EM PVC, DIÂMETRO INTERNO  = 0,3M. AF_12/2020","UNID",3,464.47,0.22159999999999999,567.4,1702.2]
["11.42","SINAPI 89354","MISTURADOR MONOCOMANDO PARA CHUVEIRO, BASE BRUTA E ACABAMENTO CROMADO - FORNECIDO E INSTALADO EM RAMAL DE ÁGUA. AF_12/2014","UNID",16,779.43,0.22159999999999999,952.15,15234.4]
["11.43","SINAPI 89491","CAIXA SIFONADA, PVC, DN 150X185X75MM, FORNECIDA E INSTALADA EM RAMAIS DE ENCAMINHAMENTO DE ÁGUA PLUVIAL. AF_12/2014","UNID",16,96.84,0.22159999999999999,118.3,1892.8]
["11.44","SINAPI 99635","VÁLVULA DE DESCARGA METÁLICA, BASE 1 1/2\", ACABAMENTO METÁLICO CROMADO - FORNECIMENTO E INSTALAÇÃO. AF_01/2019","UNID",12,302.23,0.22159999999999999,369.2,4430.3999999999996]
["11.45","SINAPI 94489","REGISTRO DE ESFERA, PVC, SOLDÁVEL, DN 25MM, INSTALADO EM RESERVAÇÃO DE ÁGUA DE EDIFIAÇÃO QUE POSSUA RESERVATÓRIO DE FIBRA/FIBROCIMENTO - FORNECIMENTO E INSTALAÇÃO. AF_06/2016","UNID",5,35.22,0.22159999999999999,43.02,215.1]
["11.46","SINAPI 94490","REGISTRO DE ESFERA, PVC, SOLDÁVEL, DN 32MM, INSTALADO EM RESERVAÇÃO DE ÁGUA DE EDIFIAÇÃO QUE POSSUA RESERVATÓRIO DE FIBRA/FIBROCIMENTO - FORNECIMENTO E INSTALAÇÃO. AF_06/2016","UNID",5,52.97,0.22159999999999999,64.709999999999994,323.55]
["11.47","SINAPI 94493","REGISTRO DE ESFERA, PVC, SOLDÁVEL, DN 60MM, INSTALADO EM RESERVAÇÃO DE ÁGUA DE EDIFICAÇÃO QUE POSSUA RESERVATÓRIO DE FIBRA/FIBROCIMENTO - FORNECIMENTO E INSTALAÇÃO. AF_06/2016","UNID",2,136.27000000000001,0.22159999999999999,166.47,332.94]
["11.48","CPUE 82","CALDEIRA MURAL GLP, POTÊNCIA NOMINAL 69,0KW, VAZÃO 42,5 L/MINM COM CHAMINÉ INCLUSA","UNID",2,{"$f":"CPUE!J309","v":11693.439999999999},0.22159999999999999,14284.71,28569.42]
["11.49","CPUE 83","RESERVATÓRIO DE ÁGUA QUENTE 300 LITROS","UNID",2,{"$f":"CPUE!J315","v":3264.48},0.22159999999999999,3987.89,7975.78]
["11.50","SINAPI 94482","CONJUNTO HIDRÁULICO PARA INSTALAÇÃO DE BOMBA EM AÇO ROSCÁVEL, DN SUCÇÃO 40 (1 1/2\") E DN RECALQUE 32 (1 1/4\"), PARA EDIFICAÇÃO ENTRE 4 E 8 PAVIMENTOS - FORNECIMENTO E INSTALAÇÃO. AF_06/2016","UNID",2,1437.03,0.22159999999999999,1755.48,3510.96]
["11.51","CPUE 84","VÁLVULA QUEBRA VÁCUO 32MM ","UNID ",2,{"$f":"CPUE!J322","v":306.62536},0.22159999999999999,374.57,749.14]
["11.52","SINAPI 94490","REGISTRO DE ESFERA, PVC SOLDÁVEL, DN 32MM, INSTALADO EM RESERVAÇÃO DE ÁGUA DE EDIFICAÇÃO QUE POSSUA RESERVATÓRIO DE FIBRA/FIBROCIMENTO - FORNECIMENTO E INSTALAÇÃO. AF_06/2016","UNID",2,52.97,0.22159999999999999,64.709999999999994,129.41999999999999]
["11.53","SINAPI 101882","QUADRO DE DISTRIBUIÇÃO DE ENERGIA EM CHAPA DE AÇO GALVANIZADO, DE EMBUTIR, COM BARRAMENTO TRIFÁSICO, PARA 30 DISJUNTORES DIN 225A - FORNECIMENTO E INSTALAÇÃO. AF_10/2020","UNID",2,1643.59,0.22159999999999999,2007.81,4015.62]
["11.54","SINAPI 91855","ELETRODUTO FLEXÍVEL CORRUGADO REFORÇADO, PVC, DN 25MM (3/4'), PARA CIRCUITOS TERMINAIS, INSTALADO EM PAREDE - FORNECIMENTO E INSTALAÇÃO. AF_12/2015","M",2,9.6999999999999993,0.22159999999999999,11.85,23.7]
["11.55","SINAPI 91863","ELETRODUTO RÍGIDO ROSCÁVEL, PVC, DN 25MM (3/4\"), PARA CIRCUITOS TERMINAIS, INSTALADO EM FORRO - FORNECIMENTO E INSTALAÇÃO. AF_12/2015","M",6,10.76,0.22159999999999999,13.14,78.84]
["11.56","SINAPI 95804","CONDULETE DE PVC, TIPO B, PARA ELETRODUTO DE PVC SOLDÁVEL DN 20MM (1/2\"), APARENTE - FORNECIMENTO E INSTALAÇÃO. AF_11/2016","UNID",12,25.07,0.22159999999999999,30.63,367.56]
["11.57","SINAPI 86901","CUBA DE EMBUTIR OVAL EM LOUÇA BRANCA, 35X50CM OU EQUIVALENTE - FORNECIMENTO E INSTALAÇÃO. AF_11/2016","UNID",18,128.65,0.22159999999999999,157.16,2828.88]
["11.58","SINAPI 95469","VASO SANITÁRIO SIFONADO CONVENCIONAL COM LOUÇA BRANCA - FORNECIMENTO E INSTALAÇÃO. AF_01/2020","UNID",7,260.24,0.22159999999999999,317.91000000000003,2225.37]
["11.59","SINAPI 95470","VASO SANITARIO SIFONADO CONVENCIONAL COM LOUÇA BRANCA, INCLUSO CONJUNTO DE LIGAÇÃO PARA BACIA SANITÁRIA AJUSTÁVEL - FORNECIMENTO E INSTALAÇÃO. AF_10/2016","UNID",7,269.97000000000003,0.22159999999999999,329.8,2308.6]
["11.60","SINAPI 100858","MICTÓRIO SIFONADO LOUÇA BRANCA, PADRÃO MÉDIO - FORNECIMENTO E INSTALAÇÃO. AF_01/2020","UNID",2,607.38,0.22159999999999999,741.98,1483.96]
["11.61","SINAPI 100849","ASSENTO SANITÁRIO CONVENCIONAL - FORNECIMENTO E INSTALAÇÃO","UNID",14,49.84,0.22159999999999999,60.88,852.32]
["11.62","CPUE 39","TORNEIRA PARA SANITÁRIO PNE AUTOMÁTICA","UNID",19,{"$f":"CPUE!J51","v":234.46780000000001},0.22159999999999999,286.43,5442.17]
["11.63","CPUE 86","PORTA PAPEL HIGIÊNICO EM ROLO - DISPENSER EM PLÁSTICO","UNID",14,{"$f":"CPUE!J335","v":51.982115999999998},0.22159999999999999,63.5,889]
["11.64","SINAPI 100855","SABONETEIRA DE PAREDE EM PLASTICO ABS COM ACABAMENTO CROMADO E ACRILICO, INCLUSO FIXAÇÃO. AF_01/2020","UNID",13,67.989999999999995,0.22159999999999999,{"$f":"ROUND(F203*(1+G203),2)","v":83.06},1079.78]
["11.65","CPUE 87","MEIA SABONETEIRA PARA CHUVEIRO","UNID",16,{"$f":"CPUE!J341","v":67.892116000000001},0.22159999999999999,82.94,1327.04]
["11.66","CPUE 88","TOALHEIRO DISPENSER PARA TOALHA DE PAPEL, EM PLÁSTICO","UNID",14,{"$f":"CPUE!J347","v":51.982115999999998},0.22159999999999999,63.5,{"$f":"ROUND(E205*H205,2)","v":889}]
["11.67","CPUE 89","CHUVEIRO AQUECEDOR A GÁS","UNID",16,{"$f":"CPUE!J354","v":266.64135499999998},0.22159999999999999,325.73,5211.68]
["11.68","CPUE 90","BATEDOR DE AÇO POLIDO","UNID ",14,{"$f":"CPUE!J359","v":311.95999999999998},0.22159999999999999,381.09,5335.26]
["11.69","SINAPI 100875","BANCO ARTICULADO, EM AÇO INOX, PARA PCD, FIXADO NA PAREDE - FORNECIMENTO E INSTALAÇÃO. AF_01/2020","UNID",10,1338.43,0.22159999999999999,1635.03,16350.3]
["11.70","CPUE 115","BANCOS EM \"L\"","M",14.44,{"$f":"CPUE!J514","v":604.41999999999996},0.22159999999999999,738.36,10661.92]
["11.71","CPUE 92","ESPELHO PRATA LAMINADO 60X80CM","M2",8.64,{"$f":"CPUE!J370","v":185.40119999999999},0.22159999999999999,226.49,1956.87]
["11.72","SINAPI 86889","BANCADA DE GRANITO CINZA POLIDO, DE 1,50X0,60M, PARA PIA DE COZINHA - FORNECIMENTO E INSTALAÇÃO. AF_01/2020","UNID",5,647.32000000000005,0.22159999999999999,790.77,3953.85]
["11.73","SINAPI 100874","PUXADOR PARA PCD, FIXADO NA PORTA - FORNECIMENTO E INSTALAÇÃO. AF_01/2020","UNID",7,357.79,0.22159999999999999,437.08,3059.56]
["11.74","CPUE 117","BARRA DE APOIO RETA, EM AÇO INOX POLIDO, COMPRIMENTO 40CM, FIXADO NA PAREDE - FORNECIMENTO E INSTALAÇÃO. AF_01/2020","UNID",14,{"$f":"CPUE!J528","v":290.53785199999999},0.22159999999999999,354.92,4968.88]
["11.75","SINAPI 100867","BARRA DE APOIO RETA, EM AÇO INOX POLIDO, COMPRIMENTO 70CM, FIXADO NA PAREDE - FORNECIMENTO E INSTALAÇÃO. AF_01/2020","UNID",75,382.9,0.22159999999999999,467.75,35081.25]
["11.76","SINAPI 100868","BARRA DE APOIO RETA, EM AÇO INOX POLIDO, COMPRIMENTO 80CM, FIXADA NA PAREDE - FORNECIMENTO E INSTALAÇÃO. AF_01/2020","UNID",14,399.6,0.22159999999999999,488.15,6834.1]
[12,null,"INSTALAÇÕES DE PPCI",{"$nulls":5},{"$f":"SUM(I217:I240)","v":157096.26999999999}]
["12.1","SINAPI 92648","TUBO DE AÇO PRETO SEM COSTURA, CONEXÃO SOLDADA, DN 40 (1 1/2\"), INSTALADO EM REDE DE ALIMENTAÇÃO PARA SPRINKLER - FORNECIMENTO E INSTALAÇÃO. AF_10/2020","M",3,78.95,0.22159999999999999,96.45,{"$f":"ROUND(E217*H217,2)","v":289.35000000000002}]
["12.2","SINAPI 92339","TUBO DE AÇO PRETO SEM COSTURA, CONEXÃO SOLDADA, DN 65 (2 1/2\"), INSTALADO EM PRUMADAS - FORNECIMENTO E INSTALAÇÃO. AF_10/2020","M",135,167.72,0.22159999999999999,204.89,{"$f":"ROUND(E218*H218,2)","v":27660.15}]
["12.3","SINAPI 97483","CURVA 45 GRAUS, EM AÇO, CONEXÃO SOLDADA DN 40 (1 1/2\"), INSTALADO EM REDE DE ALIMENTAÇÃO DE HIDRANTE - FORNECIMENTO E INSTALAÇÃO. AF_10/2020","UNID",3,186.76,0.22159999999999999,228.15,684.45]
["12.4","SINAPI 97435","CURVA 45 GRAUS, EM AÇO, CONEXÃO RANHURADA, DN 65 (2 1/2\"), INSTALADO EM PRUMADAS - FORNECIMENTO E INSTALAÇÃO. AF_10/2020","UNID",6,130.69999999999999,0.22159999999999999,159.66,957.96]
["12.5","SINAPI 97436","CURVA 90 GRAUS, EM AÇO, CONEXÃO RANHURADA, DN 65 (2 1/2\"), INSTALADO EM PRUMADAS - FORNECIMENTO E INSTALAÇÃO. AF_10/2020","UNID",9,135.24,0.22159999999999999,165.21,1486.89]
["12.6","SINAPI 97440","TÊ EM AÇO, CONEXÃO RANHURADA, DN 65 (2 1/2\"), I NSTALADO EM PRUMADAS - FORNECIMENTO E INSTALAÇÃO. AF_10/2020","UNID",3,206.28,0.22159999999999999,251.99,755.97]
["12.7","SINAPI 97475","LUVA COM REDUÇÃO, EM AÇO, CONEXÃO SOLDADA, DN 65X50MM (2 1/2\"X2\"), INSTALADO EM REDE DE ALIMENTAÇÃO PARA HIDRANTE - FORNECIMENTO E INSTALAÇÃO.AF_10/2020","UNID",3,369.34,0.22159999999999999,451.19,1353.57]
["12.8","SINAPI 95252","VÁLVULA DE ESFERA BRUTA, BRONZE, ROSCÁVEL, 1 1/2\", INSTALADO EM RESERVAÇÃO DE ÁGUA DE EDIFICAÇÃO QUE POSSUA RESERVATÓRIO DE FIBRA/FIBROCIMENTO - FORNECIMENTO E INSTALAÇÃO. AF_06/2016","UNID",3,176.64,0.22159999999999999,215.78,647.34]
["12.9","SINAPI 94499","REGISTRO DE GAVETA BRUTO, LATÃO, ROSCÁVEL, 2 1/2\", INSTALADO EM RESERVAÇÃO DE ÁGUA DE EDIFICAÇÃO QUE POSSUA RESERVATÓRIO DE FIBRA/FIBROCIMENTO - FORNECIMENTO E INSTALAÇÃO. AF_06/2016","UNID",3,345.76,0.22159999999999999,422.38,1267.1400000000001]
["12.10","CPUE 93","ADAPTADOR ROSCA 25MM","UNID",3,{"$f":"CPUE!J379","v":6.8121400000000003},0.22159999999999999,8.32,24.96]
["12.11","CPUE 94","MANGOTINHO 25MM EM CARRETEL COM 30M","UNID",3,{"$f":"CPUE!J386","v":3014.1750000000002},0.22159999999999999,3682.12,11046.36]
["12.12","CPUE 95","ESGUICHO NEBLINA 25MM","UNID",3,{"$f":"CPUE!J392","v":338.10750000000002},0.22159999999999999,413.03,1239.0899999999999]
["12.13","CPUE 96","TOMADA STORZ 40MM","UNID",3,{"$f":"CPUE!J398","v":224.90749999999997},0.22159999999999999,274.75,824.25]
["12.14","CPUE 97","CHAVE DE UNIÕES","UNID",3,{"$f":"CPUE!J404","v":25.427500000000002},0.22159999999999999,31.06,93.18]
["12.15","CPUE 98","CAIXA PARA CARRETEL DE MANGOTINHO DE 50M","UNID",3,{"$f":"CPUE!J410","v":503.65},0.22159999999999999,615.26,1845.78]
["12.16","SINAPI 96765","ABRIGO PARA HIDRANTE, 90X60X17CM, COM REGISTRO GLOBO ANGULAR 45 GRAUS 2 1/2\", ADAPTADOR STORZ DE 2 1/2\", MANGUEIRA DE INCÊNDIO 20M, REDUÇÃO 2 1/2\" X 1 1/2\" E ESGUICHO EM LATÃO 1 1/2\" - FORNECIMENTO E INSTALAÇÃO. AF_10/2020","UNID",3,1515.04,0.22159999999999999,1850.77,5552.31]
["12.17","SINAPI 101905","EXTINTOR DE INCÊNDIO PORTÁTIL COM CARGA DE ÁGUA PRESSURIZADA DE 10 L, CLASSE A - FORNECIMENTO E INSTALAÇÃO. AF_10/2020_P","UNID",3,238.88,0.22159999999999999,291.82,875.46]
["12.18","SINAPI 37556","PLACA DE SINALIZAÇÃO DE SEGURANÇA CONTRA INCÊNDIO, FOTOLUMINISCENTE, QUADRADA, 20X20CM EM PVC 2MM, ANTI-CHAMAS (SÍMBOLOS, CORES E PICTOGRAMAS CONFORME NBR 13434)","UNID",68,23.11,0.22159999999999999,28.23,1919.64]
["12.19","SINAPI 101908","EXTINTOR DE INCÊNDIO PORTÁTIL COM CARGA DE PQS DE 4 KG, CLASSE BC - FORNECIMENTO E INSTALAÇÃO. AF_10/2020_P","UNID",12,231.64,0.22159999999999999,282.97000000000003,3395.64]
["12.20","CPUE 99","SUPORTE PARA FIXAÇÃO DE EXTINTOR EM PAREDE, COM BUCHA E PARAFUSO","UNID",10,{"$f":"CPUE!J415","v":18.473500000000001},0.22159999999999999,22.57,225.7]
["12.21","CPUE 100","ACIONADOR MANUAL DE INCÊNDIO","UNID",3,{"$f":"CPUE!J421","v":72.067999999999998},0.22159999999999999,88.04,264.12]
["12.22","SINAPI 99839","GUARDA-CORPO DE AÇO GALVANIZADO DE 1,10M DE ALTURA, MONTANTES TUBULARES DE 1 1/2\" ESPAÇADOS DE 1,20M, TRAVESSA SUPERIOR DE 2\", GRADIL FORMADO POR BARRAS CHATAS EM FERRO DE 32X4,8MM, FIXADO COM CHUMBADOR MECÂNICO. AF_04/2019_P","M",105,497.64,0.22159999999999999,607.91999999999996,63831.6]
["12.23","SINAPI 99855","CORRIMÃO SIMPLES, DIÂMETRO EXTERNO = 1 1/2\", EM AÇO GALVANIZADO. AF_04/2019_P","M",40,117.16,0.22159999999999999,143.12,5724.8]
["12.24","CPUE 118","CONJUNTO DE MOTOBOMBAS PARA HIDRANTE","UNID",1,{"$f":"CPUE!J540","v":20571.837852000001},0.22159999999999999,25130.560000000001,25130.560000000001]
[13,null,"INSTALAÇÕES DE GÁS",{"$nulls":5},{"$f":"SUM(I242:I257)","v":23478.04}]
["13.1","SINAPI 92690","TUBO DE AÇO PRETO SEM COSTURA, CLASSE MÉDIA, CONEXÃO SOLDADA, DN 20 (3/4\"), INSTALADO EM RAMAIS E SUB-RAMAIS DE GÁS - FORNECIMENTO E INSTALAÇÃO. AF_10/2020","M",150,55.84,0.22159999999999999,68.209999999999994,{"$f":"ROUND(E242*H242,2)","v":10231.5}]
["13.2","SINAPI 97549","CURVA 90 GRAUS, EM AÇO, CONEXÃO SOLDADA, DN 20 (3/4\"), INSTALADO EM RAMAIS E SUB-RAMAIS DE GÁS - FORNECIMENTO E INSTALAÇÃO. AF_10/2020","UNID",26,71.16,0.22159999999999999,86.93,{"$f":"ROUND(E243*H243,2)","v":2260.1799999999998}]
["13.3","SINAPI 97548","CURVA 45 GRAUS, EM AÇO, CONEXÃO SOLDADA, DN 20 (3/4\"), INSTALADO EM RAMAIS E SUB-RAMAIS DE GÁS - FORNECIMENTO E INSTALAÇÃO. AF_10/2020","UNID",7,71.16,0.22159999999999999,86.93,608.51]
["13.4","SINAPI 97553","TÊ, EM AÇO, CONEXÃO SOLDADA, DN 20 (3/4\"), INSTALADO EM RAMAIS E SUB-RAMAIS DE GÁS - FORNECIMENTO E INSTALAÇÃO. AF_10/2020","UNID",25,102.74,0.22159999999999999,125.51,3137.75]
["13.5","SINAPI 97462","LUVA COM REDUÇÃO, EM AÇO, CONEXÃO SOLDADA, DN 25X20MM (1X3/4\"), INSTALADO EM REDE DE ALIMENTAÇÃO PARA HIDRANTE - FORNECIMENTO E INSTALAÇÃO. AF_10/2020","UNID",20,43,0.22159999999999999,52.53,1050.5999999999999]
["13.6","SINAPI 95249","VÁLVULA DE ESFERA BRUTA, BRONZE, ROSCÁVEL, 3/4\", INSTALADO EM RESERVAÇÃO DE ÁGUA DE EDIFICAÇÃO QUE POSSUA RESERVATÓRIO DE FIBRA/FIBROCIMENTO - FORNECIMENTO E INSTALAÇÃO. AF_06/2016","UNID",7,72.95,0.22159999999999999,89.12,623.84]
["13.7","SINAPI 95248","VÁLVULA DE ESFERA BRUTA, BRONZE, ROSCÁVEL, 1/2\", INSTALADO EM RESERVAÇÃO DE ÁGUA DE EDIFICAÇÃO QUE POSSUA RESERVATÓRIO DE FIBRA/FIBROCIMENTO - FORNECIMENTO E INSTALAÇÃO. AF_06/2016","UNID",2,62.25,0.22159999999999999,76.040000000000006,152.08000000000001]
["13.8","SINAPI 89711","TUBO PVC, SÉRIE NORMAL, ESGOTO PREDIAL, DN 40MM, FORNECIDO E INSTALADO EM RAMAL DE DESCARGA OU RAMAL DE ESGOTO SANITÁRIO. AF_12/2014","M",138,19.34,0.22159999999999999,23.63,3260.94]
["13.9","SINAPI 89497","JOELHO 90 GRAUS, PVC, SOLDÁVEL, DN 40MM, INSTALADO EM PRUMADA DE ÁGUA - FORNECIMENTO E INSTALAÇÃO. AF_12/2014","UNID",24,14.49,0.22159999999999999,17.7,424.8]
["13.10","SINAPI  89498","JOELHO 45 GRAUS, PVC, SOLDÁVEL, DN 40MM, INSTALADO EM PRUMADA DE ÁGUA - FORNECIMENTO E INSTALAÇÃO. AF_12/2014","UNID",7,16.13,0.22159999999999999,19.7,137.9]
["13.11","SINAPI 89782","TÊ, PVC, SÉRIE NORMAL, ESGOTO PREDIAL, DN 40X40MM, JUNTA SOLDÁVEL, FORNECIDO E INSTALADO EM RAMAL DE DESCARGA OU RAMAL DE ESGOTO SANITÁRIO. AF_12/2014","UNID",5,12.64,0.22159999999999999,15.44,77.2]
["13.12","CPUE 101","MANGOTE FLEXÍVEL 7/16\"","M",20,{"$f":"CPUE!J427","v":3.6325000000000003},0.22159999999999999,4.4400000000000004,88.8]
["13.13","CPUE 102","MANGOTE FLEXÍVEL 1/2\"","M",2,{"$f":"CPUE!J433","v":6.6725000000000003},0.22159999999999999,8.15,16.3]
["13.14","CPUE 103","MANÔMETRO DIÂMETRO 75MM, RANGE DE PRESSÃO DE 0 A 7KgF/CM2","UNID",2,{"$f":"CPUE!J439","v":154.44999999999999},0.22159999999999999,188.68,377.36]
["13.15","CPUE 104","REGULADOR DE PRESSÃO COM VÁLVULA DE SEGURANÇA, COM MANÔMETRO, SEGUNDO ESTÁGIO, ENTRADA DE 1,5 KgF/CM2 E SAÍDA DE 280MMCA","UNID",2,{"$f":"CPUE!J445","v":210.85000000000002},0.22159999999999999,257.57,515.14]
["13.16","CPUE 105","REGULADOR DE PRESSÃO COM VÁLVULA DE SEGURANÇA, COM MANÔMETRO, PRIMEIRO ESTÁGIO, ENTRADA DE 5 KgF/CM2 E SAÍDA DE 1,5KgF/CM2","UNID",2,{"$f":"CPUE!J451","v":210.85000000000002},0.22159999999999999,257.57,515.14]
[14,null,"COMPEMENTAÇÃO DA OBRA",{"$nulls":5},{"$f":"SUM(I259:I268)","v":31977.759999999998}]
["14.1","SINAPI 97101","EXECUÇÃO DE RADIER, ESPESSURA DE 10CM, FCK=30MPA, COM USO DE FORMAS EM MADEIRA SERRADA. AF_09/2017","M2",9,178.57,0.22159999999999999,218.14,{"$f":"ROUND(E259*H259,2)","v":1963.26}]
["14.2","SINAPI 95955","EXECUÇÃO DE ESTRUTURAS DE CONCRETO ARMADO, PARA EDIFICAÇÃO HABITACIONAL UNIFAMILIAR TÉRREA (CASA ISOLADA), FCK=25MPA. AF_01/2017","M3",1,3237.75,0.22159999999999999,3955.24,{"$f":"ROUND(E260*H260,2)","v":3955.24}]
["14.3","SINAPI 101159","ALVENARIA DE VEDAÇÃO DE BLOCOS CERÂMICOS MACIÇOS DE 5X10X20CM (ESPESSURA 10CM) E ARGAMASSA DE ASSENTAMENTO COM PREPARO EM BETONEIRA. AF_05/2020","M2",30,124.76,0.22159999999999999,152.41,4572.3]
["14.4","SINAPI 87878","CHAPISCO APLICADO EM ALVENARIAS E ESTRUTURAS DE CONCRETO INTERNAS, COM COLHER DE PEDREIRO. ARGAMASSA TRAÇO 1:3 COM PREPARO MANUAL. AF_06/2014","M2",30,4.1100000000000003,0.22159999999999999,5.0199999999999996,150.6]
["14.5","SINAPI 87813","EMBOÇO OU MASSA ÚNICA EM ARGAMASSA TRAÇO 1:2:8, PREPARO MECÂNICO COM BETONEIRA 400L, APLICADA MANUALMENTE EM SUPERFÍCIES EXTERNAS DA SACADA, ESPESSURA DE 35MM, SEM USO DE TELA METÁLICA DE REFORÇA CONTRA FISSURAÇÃO. AF_06/2014","M2",30,85.16,0.22159999999999999,104.03,3120.9]
["14.6","SINAPI 98547","IMPERMEABILIZAÇÃO DE SUPERFÍCIE COM MANTA ASFÁLTICA, DUAS CAMADAS, INCLUSIVE APLICAÇÃO DE PRIMER ASFÁLTICO, E=3MM E E=4MM. AF_06/2018","M2",37,173.62,0.22159999999999999,212.09,7847.33]
["14.7","SINAPI 101749","PISO CIMENTADO, TRAÇO 1:3 (CIMENTO E AREIA), ACABAMENTO LISO, ESPESSURA 4,0 CM, PREPARO MECÂNICO DA ARGAMASSA. AF_09/2020","M2",37,46.94,0.22159999999999999,57.34,2121.58]
["14.8","CPUE 41","Tratamento de estrutura metálica ","M2",37,{"$f":"CPUE!J58","v":36.492941210000005},0.22159999999999999,44.58,1649.46]
["14.9","CPUE 18","TESTES FINAIS DE INSTALAÇÕES","UNID",1,547.72,0.22159999999999999,{"$f":"ROUND(F267*(1+G267),2)","v":669.09},669.09]
["14.10","CPUE 17","LIMPEZA FINAL DE OBRA","M2",1300,3.73,0.22159999999999999,4.5599999999999996,5928]
[]
[]
[]
[{"$nulls":7},"PREÇO TOTAL ",{"$f":"I9+I14+I16+I28+I34+I53+I59+I71+I81+I84+I139+I216+I241+I258","v":2045309.4299999997}]

{"sheet":"CFF","index":4,"n_rows":22,"n_cols":15,"rows_kept":22,"cut":false,"hidden":false,"merged":[[5,0,5,2],[4,0,4,14],[0,2,0,14]]}
[null,null,"PREFEITURA DE PORTO ALEGRE"]
["Obra:",{"$f":"Orçamento!B3","v":"Reforma dos setores 2 e 4 do Ginásio Municipal Osmar Fortes Barcellos (Ginásio Tesourinha) "}]
["Endereço:","Av. Erico Veríssimo, s/n"]
["SEI: ","22.0.000029811-9"]
["CRONOGRAMA FÍSICO FINANCEIRO (MENSAL)"]
["SERVIÇO",null,null,"% total","MÊS 1","%","MÊS 2","%","MÊS 3","%","MÊS 4","%","MÊS 5","%","TOTAL"]
[{"$nulls":4},"JUNHO 2022",null,"JULHO 2022",null,"AGOSTO 2022",null,"SETEMBRO 2022",null,"OUTUBRO 2022"]
[1,{"$f":"Orçamento!C9","v":"INSTALAÇÕES PROVISÓRIAS"},{"$f":"Orçamento!I9","v":8593.67},{"$f":"F8+H8+J8+L8+N8","v":1},{"$f":"C8*F8","v":6015.5689999999995},0.7,{"$f":"C8*H8","v":429.68350000000004},0.05,{"$f":"C8*J8","v":429.68350000000004},0.05,{"$f":"C8*L8","v":429.68350000000004},0.05,{"$f":"C8*N8","v":1289.0505000000001},0.15,{"$f":"E8+G8+I8+K8+M8","v":8593.67}]
[2,{"$f":"Orçamento!C14","v":"ADMINISTRAÇÃO DA OBRA"},{"$f":"Orçamento!I14","v":116639.28},{"$f":"F9+H9+J9+L9+N9","v":1},{"$f":"C9*F9","v":23327.856},0.2,{"$f":"C9*H9","v":23327.856},0.2,{"$f":"C9*J9","v":23327.856},0.2,{"$f":"C9*L9","v":23327.856},0.2,{"$f":"C9*N9","v":23327.856},0.2,{"$f":"E9+G9+I9+K9+M9","v":116639.28}]
[3,{"$f":"Orçamento!C16","v":"REMOÇÕES E DEMOLIÇÕES"},{"$f":"Orçamento!I16","v":43890.93},1,35112.743999999999,0.8,8778.1859999999997,0.2,0,null,0,null,0,null,43890.93]
[4,{"$f":"Orçamento!C28","v":"PAREDES E PAINÉIS"},{"$f":"Orçamento!I28","v":62287.359999999993},1,12457.472,0.2,31143.679999999997,0.5,18686.207999999999,0.3,0,null,0,null,62287.359999999993]
[5,{"$f":"Orçamento!C34","v":"ESQUADRIAS METÁLICAS E DE MADEIRA C/FERRAGENS E VIDROS"},{"$f":"Orçamento!I34","v":260278.17999999996},1,0,null,0,null,104111.272,0.4,78083.453999999983,0.3,78083.453999999983,0.3,260278.17999999993]
[6,{"$f":"Orçamento!C53","v":"PROTEÇÕES"},{"$f":"Orçamento!I53","v":25972.42},0.99999999999999989,0,null,18180.693999999996,0.7,5194.4840000000004,0.2,2597.2420000000002,0.1,0,null,25972.42]
[7,{"$f":"Orçamento!C59","v":"REVESTIMENTOS - FORROS - PINTURAS"},{"$f":"Orçamento!I59","v":252435.65},1,0,null,0,null,50487.130000000005,0.2,50487.130000000005,0.2,151461.38999999998,0.6,252435.65]
[8,{"$f":"Orçamento!C71","v":"PAVIMENTAÇÕES INTERNAS"},{"$f":"Orçamento!I71","v":325733.75},1,0,null,0,null,130293.5,0.4,130293.5,0.4,65146.75,0.2,325733.75]
[9,{"$f":"Orçamento!C81","v":"ROTA ACESSÍVEL"},{"$f":"Orçamento!I81","v":1427.09},1,0,null,0,null,0,null,0,null,1427.09,1,1427.09]
[10,{"$f":"Orçamento!C84","v":"INSTALAÇÕES ELETRICAS"},{"$f":"Orçamento!I84","v":495006.48999999982},0.99999999999999989,49500.648999999983,0.1,198002.59599999993,0.4,99001.297999999966,0.2,99001.297999999966,0.2,49500.648999999983,0.1,495006.48999999982]
[11,{"$f":"Orçamento!C139","v":"INSTALAÇÕES HIDROSSANITÁRIAS"},{"$f":"Orçamento!I139","v":240492.54},0.99999999999999989,24049.254000000001,0.1,96197.016000000003,0.4,48098.508000000002,0.2,48098.508000000002,0.2,24049.254000000001,0.1,240492.53999999998]
[12,{"$f":"Orçamento!C216","v":"INSTALAÇÕES DE PPCI"},{"$f":"Orçamento!I216","v":157096.26999999999},1,0,null,0,null,15709.627,0.1,94257.761999999988,0.6,47128.880999999994,0.3,157096.26999999999]
[13,{"$f":"Orçamento!C241","v":"INSTALAÇÕES DE GÁS"},{"$f":"Orçamento!I241","v":23478.04},1,2347.8040000000001,0.1,3521.7060000000001,0.15,9391.2160000000003,0.4,8217.3140000000003,0.35,0,null,23478.04]
[14,{"$f":"Orçamento!C258","v":"COMPEMENTAÇÃO DA OBRA"},{"$f":"Orçamento!I258","v":31977.759999999998},1,0,null,0,null,0,null,3197.7759999999998,0.1,28779.984,0.9,31977.760000000002]
[{"$nulls":4},{"$f":"SUM(E8:E21)","v":152811.348},null,{"$f":"SUM(G8:G21)","v":379581.41749999992},null,504730.78249999997,null,537991.52349999989,null,470194.35849999997,null,{"$f":"SUM(O8:O21)","v":2045309.4299999997}]

{"sheet":"CPUE","index":5,"n_rows":540,"n_cols":10,"rows_kept":540,"cut":false,"hidden":false,"merged":[[539,0,539,6],[527,0,527,6],[520,0,520,6],[426,0,426,6],[432,0,432,6],[438,0,438,6],[444,0,444,6],[450,0,450,6],[460,0,460,6],[470,0,470,6],[532,0,532,6],[397,0,397,6],[403,0,403,6],[409,0,409,6],[414,0,414,6],[420,0,420,6],[249,0,249,6],[231,0,231,6],[364,0,364,6],[328,0,328,6],[334,0,334,6],[297,0,297,6],[340,0,340,6],[346,0,346,6],[353,0,353,6],[358,0,358,6],[243,0,243,6],[255,0,255,6],[264,0,264,6],[271,0,271,6],[277,0,277,6],[237,0,237,6],[50,0,50,6],[64,0,64,6],[71,0,71,6],[147,0,147,6],[162,0,162,6],[117,0,117,6],[195,0,195,6],[78,0,78,6],[84,0,84,6],[90,0,90,6],[96,0,96,6],[183,0,183,6],[219,0,219,6],[225,0,225,6],[5,0,5,6],[20,0,20,6],[24,0,24,6],[34,0,34,6],[43,0,43,6],[10,0,10,6],[102,0,102,6],[132,0,132,6],[201,0,201,6],[207,0,207,6],[213,0,213,6],[57,0,57,6],[177,0,177,6],[189,0,189,6],[284,0,284,6],[513,0,513,6],[476,0,476,6],[484,0,484,6],[493,0,493,6],[500,0,500,6],[508,0,508,6],[369,0,369,6],[291,0,291,6],[378,0,378,6],[385,0,385,6],[391,0,391,6],[302,0,302,6],[308,0,308,6],[314,0,314,6],[321,0,321,6]]}
[]
[]
["REFERÊNCIA",null,"CPUE 17","LIMPEZA FINAL DA OBRA","M2","COEF.","CUSTO","MATERIAL","MÃO OBRA","TOTAL"]
["SINAPI","INSUMO",3,"ÁCIDO MURIÁTICO","L",0.05,18.07,{"$f":"F4*G4","v":0.90350000000000008}]
["SINAPI","COMPOSICAO",88316,"SERVENTE COM ENCARGOS COMPLEMENTARES","H",0.15,18.84,null,{"$f":"F5*G5","v":2.8260000000000001}]
["TOTAL",{"$nulls":6},{"$f":"SUM(H4:H5)","v":0.90350000000000008},{"$f":"SUM(I4:I5)","v":2.8260000000000001},{"$f":"H6+I6","v":3.7295000000000003}]
[]
["REFERÊNCIA",null,"CPUE 18","TESTES FINAIS EM INSTALAÇÕES","UN","COEF.","CUSTO","MATERIAL","MÃO OBRA","TOTAL"]
["SINAPI","COMPOSICAO",90778,"ENGENHEIRO CIVIL DE OBRA PLENO COM ENCARGOS COMPLEMENTARES","H",4,114.57,null,{"$f":"F9*G9","v":458.28},{"$f":"F9*G9","v":458.28}]
["SINAPI","COMPOSICAO","88267","ENCANADOR OU BOMBEIRO HIDRÁULICO COM ENCARGOS COMPLEMENTARES","H",4,22.36,null,{"$f":"F10*G10","v":89.44},{"$f":"F10*G10","v":89.44}]
["TOTAL",{"$nulls":7},{"$f":"SUM(I9:I10)","v":547.72},{"$f":"SUM(J8:J10)","v":547.72}]
[]
["REFERÊNCIA",null,"CPUE 30","PLACA DE OBRA EM CHAPA DE ACO GALVANIZADO","M2","COEF.","CUSTO","MATERIAL","MÃO OBRA","TOTAL"]
["SINAPI","INSUMO",4417,"SARRAFO DE MADEIRA NAO APARELHADA *2,5 X 7* CM, MACARANDUBA, ANGELIM OU EQUIVALENTE DA REGIAO","M",1,4.32,{"$f":"F14*G14","v":4.32}]
["SINAPI","INSUMO",4491,"PONTALETE DE MADEIRA NAO APARELHADA *7,5 X 7,5* CM (3 X 3 \") PINUS, MISTA OU EQUIVALENTE DA REGIAO","M",4,6.25,{"$f":"F15*G15","v":25}]
["SINAPI","INSUMO",4813,"PLACA DE OBRA (PARA CONSTRUCAO CIVIL) EM CHAPA GALVANIZADA *N. 22*, DE *2,0 X 1,125* M","M2",1,225,225]
["SINAPI","INSUMO",5075,"PREGO DE ACO POLIDO COM CABECA 18 X 30 (2 3/4 X 10)","KG",0.11,20.73,2.2803]
["SINAPI","COMPOSICAO","88262","CARPINTEIRO DE FORMAS COM ENCARGOS COMPLEMENTARES","H",1,22.53,null,{"$f":"F18*G18","v":22.53}]
["SINAPI","COMPOSICAO","88316","SERVENTE COM ENCARGOS COMPLEMENTARES","H",2,18.84,null,{"$f":"F19*G19","v":37.68}]
["SINAPI","COMPOSICAO","94962","CONCRETO MAGRO PARA LASTRO, TRAÇO 1:4,5:4,5 (CIMENTO/ AREIA MÉDIA/ BRITA 1)  - PREPARO MECÂNICO COM BETONEIRA 400 L. AF_07/2016","M3",0.01,319.64,3.1964000000000001,null,2.7532000000000001]
["TOTAL",{"$nulls":6},{"$f":"SUM(H14:H20)","v":259.79669999999999},{"$f":"SUM(I14:I20)","v":60.21},{"$f":"SUM(H21:I21)","v":320.00669999999997}]
[]
["REFERÊNCIA",null,"CPUE 31","ART","UN","COEF.","CUSTO","MATERIAL","MÃO OBRA","TOTAL"]
["CREA","INSUMO","COT 8","ART","UN",1,233.94,233.94,null,{"$f":"H24","v":233.94}]
["TOTAL",{"$nulls":6},{"$f":"H24","v":233.94},null,{"$f":"J24","v":233.94}]
[]
["REFERÊNCIA",null,"CPUE 35","Tratamento de estruturas de concreto armado","M2","COEF.","CUSTO","MATERIAL","MÃO OBRA","TOTAL"]
["SINAPI","INSUMO",134,"GRAUTE CIMENTICIO PARA USO GERAL 2200KG/M3","KG ",{"$f":"1.1*2200*0.05","v":121},1.45,{"$f":"F28*G28","v":175.45}]
["MERCADO","INSUMO","COT 70","Convertedor de Ferrugem 200ml - TF7","UN   ",0.125,{"$f":"'Mapa Cotacões'!H282","v":9.39},{"$f":"F29*G29","v":1.1737500000000001}]
["SINAPI","INSUMO",4720,"PEDRA BRITADA N. 0, OU PEDRISCO (4,8 A 9,5 MM) POSTO PEDREIRA/FORNECEDOR, SEM FRETE","M3",{"$f":"F31*0.3","v":1.4999999999999999E-2},70.510000000000005,{"$f":"F30*G30","v":1.05765}]
["SINAPI","COMPOSICAO",97629,"DEMOLIÇÃO DE CONCRETO, DE FORMA MECANIZADA COM MARTELETE, SEM REAPROVEITAMENTO. AF_12/2017","M3",0.05,122.13,31.36,90.77]
["SINAPI","COMPOSICAO",96531,"FABRICAÇÃO, MONTAGEM E DESMONTAGEM DE FÔRMA PARA BLOCO DE COROAMENTO, EM MADEIRA SERRADA, E=25 MM, 2 UTILIZAÇÕES. AF_06/2017(UNIDADE: MXKM). AF_07/2019","M2",1.02,null,57.24,37.840000000000003]
["SINAPI","COMPOSICAO",88309,"PEDREIRO COM ENCARGOS COMPLEMENTARES","H",{"$f":"7*0.05","v":0.35000000000000003},20.71,null,{"$f":"F33*G33","v":7.2485000000000008}]
["SINAPI","COMPOSICAO","88316","SERVENTE COM ENCARGOS COMPLEMENTARES","H",{"$f":"F33","v":0.35000000000000003},"17,11",null,{"$f":"F34*G34","v":5.9885000000000002}]
["TOTAL",{"$nulls":6},{"$f":"SUM(H28:H34)","v":266.28140000000002},{"$f":"SUM(I28:I34)","v":141.84700000000001},{"$f":"SUM(H35:I35)","v":408.12840000000006}]
[]
["REFERÊNCIA",null,"CPUE 36","Base de distribução de carga sobre contrapiso existente espessura 2cm","M2","COEF.","CUSTO","MATERIAL","MÃO OBRA","TOTAL"]
["SINAPI","INSUMO",134,"GRAUTE CIMENTICIO PARA USO GERAL 2200KG/M3","KG ",{"$f":"1.1*2200*0.02","v":48.4},1.45,{"$f":"F38*G38","v":70.179999999999993}]
["SINAPI","INSUMO",21141,"TELA DE ACO SOLDADA NERVURADA, CA-60, Q-92, (1,48 KG/M2), DIAMETRO DO FIO = 4,2 MM, LARGURA = 2,45 X 60 M DE COMPRIMENTO, ESPACAMENTO DA MALHA = 15  X 15 CM","M2",1,20.14,{"$f":"F39*G39","v":20.14}]
["SINAPI","INSUMO",4720,"PEDRA BRITADA N. 0, OU PEDRISCO (4,8 A 9,5 MM) POSTO PEDREIRA/FORNECEDOR, SEM FRETE","M3",{"$f":"0.02*0.5","v":0.01},70.510000000000005,{"$f":"F40*G40","v":0.70510000000000006}]
["SINAPI","INSUMO",4512,"SARRAFO *2,5 X 5* CM EM PINUS, MISTA OU EQUIVALENTE DA REGIAO - BRUTA","M",2,1.51,{"$f":"F41*G41","v":3.02}]
["SINAPI","COMPOSICAO",88309,"PEDREIRO COM ENCARGOS COMPLEMENTARES","H",0.7,20.71,null,{"$f":"F42*G42","v":14.497}]
["SINAPI","COMPOSICAO","88316","SERVENTE COM ENCARGOS COMPLEMENTARES","H",0.7,17.11,null,{"$f":"F43*G43","v":11.976999999999999}]
["TOTAL",{"$nulls":6},{"$f":"SUM(H38:H43)","v":94.045099999999991},{"$f":"SUM(I38:I43)","v":26.473999999999997},{"$f":"SUM(H44:I44)","v":120.51909999999998}]
[]
["REFERÊNCIA",null,"CPUE 39","TORNEIRA AUTOMÁTICA CROMADA DECAMATIC 1170C OU PRESMATIC BENEFIT  DOCOL, OU SIMILAR","UNID.","COEF.","CUSTO","MATERIAL","MÃO OBRA","TOTAL"]
["SINAPI","INSUMO",36796,"TORNEIRA CROMADA DE MESA PARA LAVATORIO TEMPORIZADA PRESSAO BICA BAIXA","UN",1,216.08,{"$f":"F47*G47","v":216.08}]
["SINAPI","INSUMO",3146,"FITA VEDA ROSCA EM ROLOS DE 18 MM X 10 M (L X C)","UN",0.02,4.29,{"$f":"F48*G48","v":8.5800000000000001E-2}]
["SINAPI","COMPOSICAO",88267,"ENCANADOR OU BOMBEIRO HIDRÁULICO COM ENCARGOS COMPLEMENTARES","H",0.65,22.36,null,{"$f":"F49*G49","v":14.534000000000001}]
["SINAPI","COMPOSICAO",88316,"SERVENTE COM ENCARGOS COMPLEMENTARES","H",0.2,18.84,null,{"$f":"F50*G50","v":3.7680000000000002}]
["TOTAL",{"$nulls":6},{"$f":"SUM(H47:H50)","v":216.16580000000002},{"$f":"SUM(I47:I50)","v":18.302},{"$f":"SUM(H51:I51)","v":234.46780000000001}]
[]
["REFERÊNCIA",null,"CPUE 41","Tratamento de estruturas metálicas","M2","COEF.","CUSTO","MATERIAL","MÃO OBRA","TOTAL"]
["SINAPI","COMPOSICAO",100717,"LIXAMENTO MANUAL EM SUPERFÍCIES METÁLICAS EM OBRA. AF_01/2020","M2",1,8.4499999999999993,3.11,5.34]
["SINAPI","INSUMO",135,"Convertedor De Ferrugem Em Base De Pintura Tf7 200ml","UN   ",{"$f":"0.125","v":0.125},10,{"$f":"F55*G55","v":1.25}]
["SINAPI","COMPOSICAO",100722,"PINTURA COM TINTA ALQUÍDICA DE FUNDO (TIPO ZARCÃO) APLICADA A ROLO OU PINCEL SOBRE SUPERFÍCIES METÁLICAS (EXCETO PERFIL) EXECUTADO EM OBRA (POR DEMÃO). AF_01/2020","M2",{"$f":"F54","v":1},20.52,{"$f":"8.24*F56","v":8.24},12.08]
["MERCADO","COT -028",null,"GENIE ARTICULADA ELÉTRICA 16M","MÊS",0.3,21.576470700000002,null,{"$f":"F57*G57","v":6.4729412100000001}]
["TOTAL",{"$nulls":6},{"$f":"SUM(H54:H57)","v":12.6},{"$f":"SUM(I54:I57)","v":23.892941210000004},{"$f":"SUM(H58:I58)","v":36.492941210000005}]
[]
["REFERÊNCIA",null,"CPUE 43","Luminária de Embutir - completa com quatro lâmpadas tubulares led T8 (4x9 - 10W), instalação em forro com modelação de 625x625mm,  com refletor parabólico e aletas de alumínio anodizado brilhante de alta refletância e alta pureza 99,85%. Soquete tipo push-in G-13 de engate rápido, rotor de segurança em policarbonato e contatos em bronze fosforoso, completa. Certificação CE, Garantia de mínima de 02 Anos. .","UNID.","COEF.","CUSTO","MATERIAL","MÃO OBRA","TOTAL"]
["SINAPI","INSUMO",38776,"LUMINARIA DE EMBUTIR EM CHAPA DE ACO PARA 4 LAMPADAS FLUORESCENTES DE 14 W *60 X 60 CM* ALETADA (NAO INCLUI REATOR E LAMPADAS)","UN   ",1,384.59,{"$f":"F61*G61","v":384.59}]
["SINAPI","INSUMO",39386,"LAMPADA LED TUBULAR BIVOLT 9/10 W, BASE G13","UN   ",4,11.9,{"$f":"F62*G62","v":47.6}]
["SINAPI","COMPOSICAO",88247,"AUXILIAR DE ELETRICISTA COM ENCARGOS COMPLEMENTARES","H",0.5,17.79,null,{"$f":"F63*G63","v":8.8949999999999996}]
["SINAPI","COMPOSICAO",88264,"ELETRICISTA COM ENCARGOS COMPLEMENTARES","H",0.5,23.23,null,{"$f":"F64*G64","v":11.615}]
["TOTAL",{"$nulls":6},{"$f":"SUM(H61:H64)","v":432.19},{"$f":"SUM(I61:I64)","v":20.509999999999998},{"$f":"SUM(H65:I65)","v":452.7}]
[]
["REFERÊNCIA",null,"CPUE 44","Luminária de Sobrepor - completa com duas lâmpadas tubulares led T8 (2x9W), instalação em forro de gesso,  com refletor parabólico e aletas de alumínio anodizado brilhante de alta refletância e alta pureza 99,85%. Soquete tipo push-in G-13 de engate rápido, rotor de segurança em policarbonato e contatos em bronze fosforoso, completa. Certificação CE, Garantia de mínima de 02 Anos. .","UNID.","COEF.","CUSTO","MATERIAL","MÃO OBRA","TOTAL"]
["SINAPI","INSUMO",3811,"LUMINARIA DE SOBREPOR EM CHAPA DE ACO PARA 2 LAMPADAS FLUORESCENTES DE *18*W, ALETADA, COMPLETA (LAMPADAS E REATOR INCLUSOS)","UN   ",1,132.6,{"$f":"F68*G68","v":132.6}]
["SINAPI","INSUMO",39386,"LAMPADA LED TUBULAR BIVOLT 18/20 W, BASE G13","UN   ",2,11.9,{"$f":"F69*G69","v":23.8}]
["SINAPI","COMPOSICAO",88247,"AUXILIAR DE ELETRICISTA COM ENCARGOS COMPLEMENTARES","H",0.5,17.79,null,{"$f":"F70*G70","v":8.8949999999999996}]
["SINAPI","COMPOSICAO",88264,"ELETRICISTA COM ENCARGOS COMPLEMENTARES","H",0.5,23.23,null,{"$f":"F71*G71","v":11.615}]
["TOTAL",{"$nulls":6},{"$f":"SUM(H68:H71)","v":156.4},{"$f":"SUM(I68:I71)","v":20.509999999999998},{"$f":"SUM(H72:I72)","v":176.91}]
[]
["REFERÊNCIA",null,"CPUE 45","Luminária arandela de Sobrepor - Lâmpada led 18 W ","UNID.","COEF.","CUSTO","MATERIAL","MÃO OBRA","TOTAL"]
["SINAPI","INSUMO",38775,"LUMINÁRIA ARANDELA TIPO TARTARUGA, DE SOBREPOR, COM 1 LÂMPADA LED DE 18 W, SEM REATOR - FORNECIMENTO E INSTALAÇÃO. AF_02/2020","UN   ",1,110.83,{"$f":"F75*G75","v":110.83}]
["SINAPI","INSUMO",38194,"LAMPADA LED 10 W BIVOLT BRANCA, FORMATO TRADICIONAL (BASE E27)","UN   ",1,8.9,{"$f":"F76*G76","v":8.9}]
["SINAPI","COMPOSICAO",88247,"AUXILIAR DE ELETRICISTA COM ENCARGOS COMPLEMENTARES","H",0.5,17.79,null,{"$f":"F77*G77","v":8.8949999999999996}]
["SINAPI","COMPOSICAO",88264,"ELETRICISTA COM ENCARGOS COMPLEMENTARES","H",0.5,23.23,null,{"$f":"F78*G78","v":11.615}]
["TOTAL",{"$nulls":6},{"$f":"SUM(H75:H78)","v":119.73},{"$f":"SUM(I75:I78)","v":20.509999999999998},{"$f":"SUM(H79:I79)","v":140.24}]
[]
["REFERÊNCIA",null,"CPUE 47","CABO MULTIPOLAR DE COBRE, FLEXIVEL, CLASSE 4 OU 5, ISOLACAO EM HEPR, COBERTURA EM PVC-ST2, ANTICHAMA BWF-B, 0,6/1 KV, 3 CONDUTORES DE 1,5 MM2","UNID.","COEF.","CUSTO","MATERIAL","MÃO OBRA","TOTAL"]
["SINAPI","INSUMO",39257,"CABO MULTIPOLAR DE COBRE, FLEXIVEL, CLASSE 4 OU 5, ISOLACAO EM HEPR, COBERTURA EM PVC-ST2, ANTICHAMA BWF-B, 0,6/1 KV, 3 CONDUTORES DE 1,5 MM2","M",1,6.6,{"$f":"F82*G82","v":6.6}]
["SINAPI","COMPOSICAO",88247,"AUXILIAR DE ELETRICISTA COM ENCARGOS COMPLEMENTARES","H",4.4999999999999998E-2,17.79,null,{"$f":"F83*G83","v":0.80054999999999998}]
["SINAPI","COMPOSICAO",88264,"ELETRICISTA COM ENCARGOS COMPLEMENTARES","H",4.4999999999999998E-2,23.23,null,{"$f":"F84*G84","v":1.04535}]
["TOTAL",{"$nulls":6},{"$f":"SUM(H82:H84)","v":6.6},{"$f":"SUM(I82:I84)","v":1.8458999999999999},{"$f":"SUM(H85:I85)","v":8.4459}]
[]
["REFERÊNCIA",null,"CPUE 49","SECCIONADORA TRIPOLAR FUSÍVEL 15KV-400A-TSI95KV-COMANDO POR PUNHO ABERTURA MÍNIMA 18CM-RUPTURA MÌNIMA 30KA-COM FUSÍVEL HH ABERTURA SOB CARGA","UNID.","COEF.","CUSTO","MATERIAL","MÃO OBRA","TOTAL"]
["MERCADO","INSUMO","COT 45","SECCIONADORA TRIPOLAR SECA 15KV-400A-TSI 95KV-COMANDO POR PUNHO C/FUSIVEL","UN   ",1,{"$f":"'Mapa Cotacões'!H195","v":2560.4849999999997},{"$f":"F88*G88","v":2560.4849999999997}]
["SINAPI","COMPOSICAO",88247,"AUXILIAR DE ELETRICISTA COM ENCARGOS COMPLEMENTARES","H",8,17.170000000000002,null,{"$f":"F89*G89","v":137.36000000000001}]
["SINAPI","COMPOSICAO",88264,"ELETRICISTA COM ENCARGOS COMPLEMENTARES","H",8,22.61,null,{"$f":"F90*G90","v":180.88}]
["TOTAL",{"$nulls":6},{"$f":"SUM(H88:H90)","v":2560.4849999999997},{"$f":"SUM(I88:I90)","v":318.24},{"$f":"SUM(H91:I91)","v":2878.7249999999995}]
[]
["REFERÊNCIA",null,"CPUE 50","SECCIONADORA TRIPOLAR SECA 15KV-400A-TSI 95KV-COMANDO POR PUNHO","UNID.","COEF.","CUSTO","MATERIAL","MÃO OBRA","TOTAL"]
["MERCADO","INSUMO","COT 46","SECCIONADORA TRIPOLAR SECA 15KV-400A-TSI 95KV-COMANDO POR PUNHO S/FUSÍVEL","UN   ",1,{"$f":"'Mapa Cotacões'!H201","v":1053.75},{"$f":"F94*G94","v":1053.75}]
["SINAPI","COMPOSICAO",88247,"AUXILIAR DE ELETRICISTA COM ENCARGOS COMPLEMENTARES","H",8,17.79,null,{"$f":"F95*G95","v":142.32}]
["SINAPI","COMPOSICAO",88264,"ELETRICISTA COM ENCARGOS COMPLEMENTARES","H",8,23.23,null,{"$f":"F96*G96","v":185.84}]
["TOTAL",{"$nulls":6},{"$f":"SUM(H94:H96)","v":1053.75},{"$f":"SUM(I94:I96)","v":328.15999999999997},{"$f":"SUM(H97:I97)","v":1381.9099999999999}]
[]
["REFERÊNCIA",null,"CPUE 54","ANDAIMES TUBULARES","MÊS","COEF.","CUSTO","MATERIAL","MÃO OBRA","TOTAL"]
["SINAPI","INSUMO",10527,"LOCACAO DE ANDAIME METALICO TUBULAR DE ENCAIXE, TIPO DE TORRE, COM LARGURA DE 1 ATE 1,5 M E ALTURA DE *1,00* M (INCLUSO SAPATAS FIXAS OU RODIZIOS)","MXMES ",10,25,{"$f":"F100*G100","v":250}]
["SINAPI","COMPOSICAO",100251,"TRANSPORTE HORIZONTAL MANUAL, DE TUBO DE AÇO CARBONO LEVE OU MÉDIO, PRETO OU GALVANIZADO, COM DIÂMETRO MAIOR QUE 32 MM E MENOR OU IGUAL A 65 MM (UNIDADE: MXKM). AF_07/2019","MXKM",4.0199999999999996,11.52,null,{"$f":"F101*G101","v":46.310399999999994}]
["SINAPI","COMPOSICAO",97064,"MONTAGEM E DESMONTAGEM DE ANDAIME TUBULAR TIPO TORRE (EXCLUSIVE ANDAIME E LIMPEZA). AF_11/2017","M",20,17.510000000000002,null,{"$f":"F102*G102","v":350.20000000000005}]
["TOTAL",{"$nulls":6},{"$f":"SUM(H100:H102)","v":250},{"$f":"SUM(I100:I102)","v":396.51040000000006},{"$f":"SUM(H103:I103)","v":646.51040000000012}]
[]
["REFERÊNCIA",null,"CPUE 56","PM01 - 1 FOLHA DE ABRIR 0,70 X 1,40 M","UNID.","COEF.","CUSTO","MATERIAL","MÃO OBRA","TOTAL"]
["SINAPI","INSUMO",183,"BATENTE/ PORTAL/ ADUELA/ MARCO MACICO, E= *3 CM, L= *13 CM, *60 CM A 120* CM X *210 CM,  EM CEDRINHO/ ANGELIM COMERCIAL/ EUCALIPTO/ CURUPIXA/ PEROBA/ CUMARU OU EQUIVALENTE DA REGIAO (NAO INCLUI ALIZARES)","JG",1,270.5,{"$f":"F106*G106","v":270.5}]
["SINAPI","INSUMO",2433,"DOBRADICA EM ACO/FERRO, 3\" X 2 1/2\", E= 1,2 A 1,8 MM, SEM ANEL,  CROMADO OU ZINCADO, TAMPA CHATA, COM PARAFUSOS","UN   ",3,9.83,29.490000000000002]
["SINAPI","INSUMO",11365,"PORTA DE MADEIRA, FOLHA LEVE (NBR 15930) DE 700 X 2100 MM, DE 35 MM A 40 MM DE ESPESSURA, NUCLEO COLMEIA, CAPA LISA EM HDF, ACABAMENTO EM PRIMER PARA PINTURA","UN   ",1,211.74,211.74]
["SINAPI","INSUMO",11055,"PARAFUSO ROSCA SOBERBA ZINCADO CABECA CHATA FENDA SIMPLES 3,5 X 25 MM (1 \")","UN   ",18,0.05,0.9]
["SINAPI","INSUMO",20017,"GUARNICAO/ ALIZAR/ VISTA MACICA, E= *1* CM, L= *4,5* CM, EM CEDRINHO/ ANGELIM COMERCIAL/  EUCALIPTO/ CURUPIXA/ PEROBA/ CUMARU OU EQUIVALENTE DA REGIAO","M",10.4,9.83,102.232]
["SINAPI","INSUMO",20247,"PREGO DE ACO POLIDO COM CABECA 15 X 15 (1 1/4 X 13)","KG",3.15E-2,22.95,0.72292499999999993]
["SINAPI","INSUMO",39027,"PREGO DE ACO POLIDO COM CABECA 19  X 36 (3 1/4  X  9)","KG",0.22500000000000001,20.71,4.6597500000000007]
["SINAPI","COMPOSIÇÃO",91306,"FECHADURA DE EMBUTIR PARA PORTAS INTERNAS, COMPLETA, ACABAMENTO PADRÃO MÉDIO, COM EXECUÇÃO DE FURO - FORNECIMENTO E INSTALAÇÃO. AF_12/2019","UN   ",1,136.6,136.6]
["SINAPI","COMPOSIÇÃO",88261,"CARPINTEIRO DE ESQUADRIA COM ENCARGOS COMPLEMENTARES","H",4,20.079999999999998,null,{"$f":"F114*G114","v":80.319999999999993}]
["SINAPI","COMPOSIÇÃO",88309,"PEDREIRO COM ENCARGOS COMPLEMENTARES","H",1.4,22.79,null,{"$f":"F115*G115","v":31.905999999999995}]
["SINAPI","COMPOSIÇÃO",88316,"SERVENTE COM ENCARGOS COMPLEMENTARES","H",4,18.84,null,{"$f":"F116*G116","v":75.36}]
["SINAPI","COMPOSIÇÃO",88627,"ARGAMASSA TRAÇO 1:0,5:4,5 (EM VOLUME DE CIMENTO, CAL E AREIA MÉDIA ÚMIDA) PARA ASSENTAMENTO DE ALVENARIA, PREPARO MANUAL. AF_08/2019","M3",2.5000000000000001E-2,533.17999999999995,{"$f":"F117*G117","v":13.329499999999999}]
["TOTAL",{"$nulls":6},{"$f":"SUM(H106:H117)","v":770.1741750000001},{"$f":"SUM(I106:I117)","v":187.58599999999998},{"$f":"SUM(H118:I118)","v":957.76017500000012}]
[]
["REFERÊNCIA",null,"CPUE 57","PM04 - 1 FOLHA DE ABRIR 1,00x2,10 M","UNID.","COEF.","CUSTO","MATERIAL","MÃO OBRA","TOTAL"]
["SINAPI","INSUMO",183,"BATENTE/ PORTAL/ ADUELA/ MARCO MACICO, E= *3 CM, L= *13 CM, *60 CM A 120* CM X *210 CM,  EM CEDRINHO/ ANGELIM COMERCIAL/ EUCALIPTO/ CURUPIXA/ PEROBA/ CUMARU OU EQUIVALENTE DA REGIAO (NAO INCLUI ALIZARES)","JG",1,270.5,{"$f":"F121*G121","v":270.5}]
["SINAPI","INSUMO",2433,"DOBRADICA EM ACO/FERRO, 3\" X 2 1/2\", E= 1,2 A 1,8 MM, SEM ANEL,  CROMADO OU ZINCADO, TAMPA CHATA, COM PARAFUSOS","UN   ",3,9.83,{"$f":"F122*G122","v":29.490000000000002}]
["SINAPI","INSUMO",4989,"PORTA DE ABRIR / GIRO, DE MADEIRA FOLHA MEDIA (NBR 15930) DE 1000 X 2100 MM, DE 35 MM A 40 MM DE ESPESSURA, NUCLEO SEMI-SOLIDO (SARRAFEADO), CAPA LISA EM HDF, ACABAMENTO EM LAMINADO NATURAL PARA VERNIZ","UN   ",1,360.67,{"$f":"F123*G123","v":360.67}]
["SINAPI","INSUMO",11055,"PARAFUSO ROSCA SOBERBA ZINCADO CABECA CHATA FENDA SIMPLES 3,5 X 25 MM (1 \")","UN   ",18,0.05,{"$f":"F124*G124","v":0.9}]
["SINAPI","INSUMO",20017,"GUARNICAO/ ALIZAR/ VISTA MACICA, E= *1* CM, L= *4,5* CM, EM CEDRINHO/ ANGELIM COMERCIAL/  EUCALIPTO/ CURUPIXA/ PEROBA/ CUMARU OU EQUIVALENTE DA REGIAO","M",10.4,9.83,{"$f":"F125*G125","v":102.232}]
["SINAPI","INSUMO",20247,"PREGO DE ACO POLIDO COM CABECA 15 X 15 (1 1/4 X 13)","KG",3.15E-2,22.95,{"$f":"F126*G126","v":0.72292499999999993}]
["SINAPI","INSUMO",39027,"PREGO DE ACO POLIDO COM CABECA 19  X 36 (3 1/4  X  9)","KG",0.22500000000000001,20.71,4.6597500000000007]
["SINAPI","COMPOSIÇÃO",91306,"FECHADURA DE EMBUTIR PARA PORTAS INTERNAS, COMPLETA, ACABAMENTO PADRÃO MÉDIO, COM EXECUÇÃO DE FURO - FORNECIMENTO E INSTALAÇÃO. AF_12/2019","UN   ",1,136.6,{"$f":"F128*G128","v":136.6}]
["SINAPI","COMPOSIÇÃO",88261,"CARPINTEIRO DE ESQUADRIA COM ENCARGOS COMPLEMENTARES","H",5,20.079999999999998,null,{"$f":"F129*G129","v":100.39999999999999}]
["SINAPI","COMPOSIÇÃO",88309,"PEDREIRO COM ENCARGOS COMPLEMENTARES","H",3,22.79,null,{"$f":"F130*G130","v":68.37}]
["SINAPI","COMPOSIÇÃO",88316,"SERVENTE COM ENCARGOS COMPLEMENTARES","H",4,18.84,null,{"$f":"F131*G131","v":75.36}]
["SINAPI","COMPOSIÇÃO",88627,"ARGAMASSA TRAÇO 1:0,5:4,5 (EM VOLUME DE CIMENTO, CAL E AREIA MÉDIA ÚMIDA) PARA ASSENTAMENTO DE ALVENARIA, PREPARO MANUAL. AF_08/2019","M3",2.5000000000000001E-2,533.17999999999995,13.329499999999999]
["TOTAL",{"$nulls":6},{"$f":"SUM(H121:H132)","v":919.10417500000017},{"$f":"SUM(I121:I132)","v":244.13},{"$f":"SUM(H133:I133)","v":1163.2341750000001}]
[]
["REFERÊNCIA",null,"CPUE 58","PM06 - 2 FOLHAS DE ABRIR 1,00 X 2,10 M","UNID.","COEF.","CUSTO","MATERIAL","MÃO OBRA","TOTAL"]
["SINAPI","INSUMO",183,"BATENTE/ PORTAL/ ADUELA/ MARCO MACICO, E= *3 CM, L= *13 CM, *60 CM A 120* CM X *210 CM,  EM CEDRINHO/ ANGELIM COMERCIAL/ EUCALIPTO/ CURUPIXA/ PEROBA/ CUMARU OU EQUIVALENTE DA REGIAO (NAO INCLUI ALIZARES)","JG",1,270.5,{"$f":"F136*G136","v":270.5}]
["SINAPI","INSUMO",2433,"DOBRADICA EM ACO/FERRO, 3\" X 2 1/2\", E= 1,2 A 1,8 MM, SEM ANEL,  CROMADO OU ZINCADO, TAMPA CHATA, COM PARAFUSOS","UN   ",6,9.83,58.980000000000004]
["SINAPI","INSUMO",10555,"PORTA DE MADEIRA, FOLHA MEDIA (NBR 15930) DE 800 X 2100 MM, DE 35 MM A 40 MM DE ESPESSURA, NUCLEO SEMI-SOLIDO (SARRAFEADO), CAPA LISA EM HDF, ACABAMENTO EM PRIMER PARA PINTURA","UN   ",2,245.19,490.38]
["SINAPI","INSUMO",11055,"PARAFUSO ROSCA SOBERBA ZINCADO CABECA CHATA FENDA SIMPLES 3,5 X 25 MM (1 \")","UN   ",39,0.05,1.9500000000000002]
["SINAPI","INSUMO",20017,"GUARNICAO/ ALIZAR/ VISTA MACICA, E= *1* CM, L= *4,5* CM, EM CEDRINHO/ ANGELIM COMERCIAL/  EUCALIPTO/ CURUPIXA/ PEROBA/ CUMARU OU EQUIVALENTE DA REGIAO","M",12.4,9.83,121.89200000000001]
["SINAPI","INSUMO",20247,"PREGO DE ACO POLIDO COM CABECA 15 X 15 (1 1/4 X 13)","KG",3.15E-2,22.95,0.72292499999999993]
["SINAPI","INSUMO",39027,"PREGO DE ACO POLIDO COM CABECA 19  X 36 (3 1/4  X  9)","KG",0.22500000000000001,20.71,4.6597500000000007]
["SINAPI","COMPOSIÇÃO",91306,"FECHADURA DE EMBUTIR PARA PORTAS INTERNAS, COMPLETA, ACABAMENTO PADRÃO MÉDIO, COM EXECUÇÃO DE FURO - FORNECIMENTO E INSTALAÇÃO. AF_12/2019","UN   ",1,136.6,{"$f":"F143*G143","v":136.6}]
["SINAPI","COMPOSIÇÃO",88261,"CARPINTEIRO DE ESQUADRIA COM ENCARGOS COMPLEMENTARES","H",5.5,20.079999999999998,null,{"$f":"F144*G144","v":110.44}]
["SINAPI","COMPOSIÇÃO",88309,"PEDREIRO COM ENCARGOS COMPLEMENTARES","H",3.5,22.79,null,{"$f":"F145*G145","v":79.765000000000001}]
["SINAPI","COMPOSIÇÃO",88316,"SERVENTE COM ENCARGOS COMPLEMENTARES","H",4.5,18.84,null,{"$f":"F146*G146","v":84.78}]
["SINAPI","COMPOSIÇÃO",88627,"ARGAMASSA TRAÇO 1:0,5:4,5 (EM VOLUME DE CIMENTO, CAL E AREIA MÉDIA ÚMIDA) PARA ASSENTAMENTO DE ALVENARIA, PREPARO MANUAL. AF_08/2019","M3",2.5000000000000001E-2,533.17999999999995,{"$f":"F147*G147","v":13.329499999999999}]
["TOTAL",{"$nulls":6},{"$f":"SUM(H136:H147)","v":1099.0141750000003},{"$f":"SUM(I136:I147)","v":274.98500000000001},{"$f":"SUM(H148:I148)","v":1373.9991750000004}]
[]
["REFERÊNCIA",null,"CPUE 59","PM07 - 2 FOLHAS DE ABRIR 1,80 X 2,10 M","UNID.","COEF.","CUSTO","MATERIAL","MÃO OBRA","TOTAL"]
["SINAPI","INSUMO",183,"BATENTE/ PORTAL/ ADUELA/ MARCO MACICO, E= *3 CM, L= *13 CM, *60 CM A 120* CM X *210 CM,  EM CEDRINHO/ ANGELIM COMERCIAL/ EUCALIPTO/ CURUPIXA/ PEROBA/ CUMARU OU EQUIVALENTE DA REGIAO (NAO INCLUI ALIZARES)","JG",1,270.5,{"$f":"F151*G151","v":270.5}]
["SINAPI","INSUMO",2433,"DOBRADICA EM ACO/FERRO, 3\" X 2 1/2\", E= 1,2 A 1,8 MM, SEM ANEL,  CROMADO OU ZINCADO, TAMPA CHATA, COM PARAFUSOS","UN   ",6,9.83,58.980000000000004]
["SINAPI","INSUMO",10556,"PORTA DE MADEIRA, FOLHA MEDIA (NBR 15930) DE 900 X 2100 MM, DE 35 MM A 40 MM DE ESPESSURA, NUCLEO SEMI-SOLIDO (SARRAFEADO), CAPA LISA EM HDF, ACABAMENTO EM PRIMER PARA PINTURA","UN   ",2,326,652]
["SINAPI","INSUMO",11055,"PARAFUSO ROSCA SOBERBA ZINCADO CABECA CHATA FENDA SIMPLES 3,5 X 25 MM (1 \")","UN   ",39,0.05,1.9500000000000002]
["SINAPI","INSUMO",20017,"GUARNICAO/ ALIZAR/ VISTA MACICA, E= *1* CM, L= *4,5* CM, EM CEDRINHO/ ANGELIM COMERCIAL/  EUCALIPTO/ CURUPIXA/ PEROBA/ CUMARU OU EQUIVALENTE DA REGIAO","M",12.4,9.83,121.89200000000001]
["SINAPI","INSUMO",20247,"PREGO DE ACO POLIDO COM CABECA 15 X 15 (1 1/4 X 13)","KG",3.15E-2,22.95,0.72292499999999993]
["SINAPI","INSUMO",39027,"PREGO DE ACO POLIDO COM CABECA 19  X 36 (3 1/4  X  9)","KG",0.22500000000000001,20.71,4.6597500000000007]
["SINAPI","INSUMO",91306,"FECHADURA DE EMBUTIR PARA PORTAS INTERNAS, COMPLETA, ACABAMENTO PADRÃO MÉDIO, COM EXECUÇÃO DE FURO - FORNECIMENTO E INSTALAÇÃO. AF_12/2019","UN   ",1,136.6,{"$f":"F158*G158","v":136.6}]
["SINAPI","COMPOSIÇÃO",88261,"CARPINTEIRO DE ESQUADRIA COM ENCARGOS COMPLEMENTARES","H",5.5,20.079999999999998,null,{"$f":"F159*G159","v":110.44}]
["SINAPI","COMPOSIÇÃO",88309,"PEDREIRO COM ENCARGOS COMPLEMENTARES","H",3.5,22.79,null,{"$f":"F160*G160","v":79.765000000000001}]
["SINAPI","COMPOSIÇÃO",88316,"SERVENTE COM ENCARGOS COMPLEMENTARES","H",4.5,18.84,null,{"$f":"F161*G161","v":84.78}]
["SINAPI","COMPOSIÇÃO",88627,"ARGAMASSA TRAÇO 1:0,5:4,5 (EM VOLUME DE CIMENTO, CAL E AREIA MÉDIA ÚMIDA) PARA ASSENTAMENTO DE ALVENARIA, PREPARO MANUAL. AF_08/2019","M3",2.5000000000000001E-2,533.17999999999995,{"$f":"F162*G162","v":13.329499999999999}]
["TOTAL",{"$nulls":6},{"$f":"SUM(H151:H162)","v":1260.6341750000001},{"$f":"SUM(I151:I162)","v":274.98500000000001},{"$f":"SUM(H163:I163)","v":1535.6191750000003}]
[]
["REFERÊNCIA",null,"CPUE 60","PM08 - 2 FOHAS DE ABRIR 2,00 X 2,10 M","UNID.","COEF.","CUSTO","MATERIAL","MÃO OBRA","TOTAL"]
["SINAPI","INSUMO",183,"BATENTE/ PORTAL/ ADUELA/ MARCO MACICO, E= *3 CM, L= *13 CM, *60 CM A 120* CM X *210 CM,  EM CEDRINHO/ ANGELIM COMERCIAL/ EUCALIPTO/ CURUPIXA/ PEROBA/ CUMARU OU EQUIVALENTE DA REGIAO (NAO INCLUI ALIZARES)","JG",1,270.5,{"$f":"F166*G166","v":270.5}]
["SINAPI","INSUMO",2433,"DOBRADICA EM ACO/FERRO, 3\" X 2 1/2\", E= 1,2 A 1,8 MM, SEM ANEL,  CROMADO OU ZINCADO, TAMPA CHATA, COM PARAFUSOS","UN   ",6,9.83,58.980000000000004]
["SINAPI","INSUMO",4989,"PORTA DE ABRIR / GIRO, DE MADEIRA FOLHA MEDIA (NBR 15930) DE 1000 X 2100 MM, DE 35 MM A 40 MM DE ESPESSURA, NUCLEO SEMI-SOLIDO (SARRAFEADO), CAPA LISA EM HDF, ACABAMENTO EM LAMINADO NATURAL PARA VERNIZ","UN   ",2,360.67,721.34]
["SINAPI","INSUMO",11055,"PARAFUSO ROSCA SOBERBA ZINCADO CABECA CHATA FENDA SIMPLES 3,5 X 25 MM (1 \")","UN   ",39,0.05,1.9500000000000002]
["SINAPI","INSUMO",20017,"GUARNICAO/ ALIZAR/ VISTA MACICA, E= *1* CM, L= *4,5* CM, EM CEDRINHO/ ANGELIM COMERCIAL/  EUCALIPTO/ CURUPIXA/ PEROBA/ CUMARU OU EQUIVALENTE DA REGIAO","M",12.4,9.83,121.89200000000001]
["SINAPI","INSUMO",20247,"PREGO DE ACO POLIDO COM CABECA 15 X 15 (1 1/4 X 13)","KG",3.15E-2,22.95,0.72292499999999993]
["SINAPI","INSUMO",39027,"PREGO DE ACO POLIDO COM CABECA 19  X 36 (3 1/4  X  9)","KG",0.22500000000000001,20.71,4.6597500000000007]
["SINAPI","INSUMO",91306,"FECHADURA DE EMBUTIR PARA PORTAS INTERNAS, COMPLETA, ACABAMENTO PADRÃO MÉDIO, COM EXECUÇÃO DE FURO - FORNECIMENTO E INSTALAÇÃO. AF_12/2019","UN   ",1,136.6,{"$f":"F173*G173","v":136.6}]
["SINAPI","COMPOSIÇÃO",88261,"CARPINTEIRO DE ESQUADRIA COM ENCARGOS COMPLEMENTARES","H",6,20.079999999999998,null,{"$f":"F174*G174","v":120.47999999999999}]
["SINAPI","COMPOSIÇÃO",88309,"PEDREIRO COM ENCARGOS COMPLEMENTARES","H",4,22.79,null,{"$f":"F175*G175","v":91.16}]
["SINAPI","COMPOSIÇÃO",88316,"SERVENTE COM ENCARGOS COMPLEMENTARES","H",5,18.84,null,{"$f":"F176*G176","v":94.2}]
["SINAPI","COMPOSIÇÃO",88627,"ARGAMASSA TRAÇO 1:0,5:4,5 (EM VOLUME DE CIMENTO, CAL E AREIA MÉDIA ÚMIDA) PARA ASSENTAMENTO DE ALVENARIA, PREPARO MANUAL. AF_08/2019","M3",2.5000000000000001E-2,533.17999999999995,{"$f":"F177*G177","v":13.329499999999999}]
["TOTAL",{"$nulls":6},{"$f":"SUM(H166:H177)","v":1329.9741750000003},{"$f":"SUM(I166:I177)","v":305.83999999999997},{"$f":"SUM(H178:I178)","v":1635.8141750000002}]
[]
["REFERÊNCIA",null,"CPUE 61"," QGBT - ARMÁRIO AUTO PORTANTE COM BASE SOLEIRA E OLHAIS DE IÇAMENTO COM PORTA INTERNA METÁLICA. 1600X700X350, DISJ. GERAL CX. MOLDADA 35KA/380V – 600 A 01PÇ MULTIMEDIDOR DIGITAL DE GRANDEZAS ELETRICAS DISJUNTORES PARCIAIS EM CX. MOLDADA 18KA/380V CFE. PROJETO.  COM INSTALAÇÃO.","UNID.","COEF.","CUSTO","MATERIAL","MÃO OBRA","TOTAL"]
["MERCADO ","INSUMO","COT 40","QGBT","UN   ",1,{"$f":"'Mapa Cotacões'!H168","v":26900},{"$f":"F181*G181","v":26900}]
["SINAPI","COMPOSICAO",88247,"AUXILIAR DE ELETRICISTA COM ENCARGOS COMPLEMENTARES","H",30,17.79,null,{"$f":"F182*G182","v":533.69999999999993}]
["SINAPI","COMPOSICAO",88264,"ELETRICISTA COM ENCARGOS COMPLEMENTARES","H",30,23.23,null,{"$f":"F183*G183","v":696.9}]
["TOTAL",{"$nulls":6},{"$f":"SUM(H181:H183)","v":26900},{"$f":"SUM(I181:I183)","v":1230.5999999999999},{"$f":"SUM(H184:I184)","v":28130.6}]
[]
["REFERÊNCIA",null,"CPUE 62","CD-01 - QUADRO DE FORÇA DE SOBREPOR MONTADO EM CAIXA DE COMANDO COM DIMENSÕES MÍNIMAS DE 1800X500X150MM, 66 LUGARES. COM INSTALAÇÃO.","UNID.","COEF.","CUSTO","MATERIAL","MÃO OBRA","TOTAL"]
["MERCADO ","INSUMO","COT 47","CD-01","UN   ",1,5640,{"$f":"F187*G187","v":5640}]
["SINAPI","COMPOSICAO",88247,"AUXILIAR DE ELETRICISTA COM ENCARGOS COMPLEMENTARES","H",10,17.170000000000002,null,{"$f":"F188*G188","v":171.70000000000002}]
["SINAPI","COMPOSICAO",88264,"ELETRICISTA COM ENCARGOS COMPLEMENTARES","H",10,22.61,null,{"$f":"F189*G189","v":226.1}]
["TOTAL",{"$nulls":6},{"$f":"SUM(H187:H189)","v":5640},{"$f":"SUM(I187:I189)","v":397.8},{"$f":"SUM(H190:I190)","v":6037.8}]
[]
["REFERÊNCIA",null,"CPUE 63","CD-02 - QUADRO DE FORÇA DE SOBREPOR MONTADO EM CAIXA DE COMANDO COM DIMENSÕES MÍNIMAS DE 1800X500X150MM, 66 LUGARES. COM INSTALAÇÃO.","UNID.","COEF.","CUSTO","MATERIAL","MÃO OBRA","TOTAL"]
["MERCADO","INSUMO","COT 61","CD-02","UN   ",1,{"$f":"'Mapa Cotacões'!H233","v":5159.8100000000004},{"$f":"F193*G193","v":5159.8100000000004}]
["SINAPI","COMPOSICAO",88247,"AUXILIAR DE ELETRICISTA COM ENCARGOS COMPLEMENTARES","H",10,17.79,null,{"$f":"F194*G194","v":177.89999999999998}]
["SINAPI","COMPOSICAO",88264,"ELETRICISTA COM ENCARGOS COMPLEMENTARES","H",10,23.23,null,{"$f":"F195*G195","v":232.3}]
["TOTAL",{"$nulls":6},{"$f":"SUM(H193:H195)","v":5159.8100000000004},{"$f":"SUM(I193:I195)","v":410.2},{"$f":"SUM(H196:I196)","v":5570.01}]
[]
["REFERÊNCIA",null,"CPUE 64","CD-03 - QUADRO DE FORÇA DE SOBREPOR MONTADO EM CAIXA DE COMANDO COM DIMENSÕES MÍNIMAS DE 1800X500X150MM, 66 LUGARES. COM INSTALAÇÃO.","UNID.","COEF.","CUSTO","MATERIAL","MÃO OBRA","TOTAL"]
["MERCADO","INSUMO","COT 64","CD-03","UN   ",1,{"$f":"'Mapa Cotacões'!H246","v":5003.8599999999997},{"$f":"F199*G199","v":5003.8599999999997}]
["SINAPI","COMPOSICAO",88247,"AUXILIAR DE ELETRICISTA COM ENCARGOS COMPLEMENTARES","H",10,17.79,null,{"$f":"F200*G200","v":177.89999999999998}]
["SINAPI","COMPOSICAO",88264,"ELETRICISTA COM ENCARGOS COMPLEMENTARES","H",10,23.23,null,{"$f":"F201*G201","v":232.3}]
["TOTAL",{"$nulls":6},{"$f":"SUM(H199:H201)","v":5003.8599999999997},{"$f":"SUM(I199:I201)","v":410.2},{"$f":"SUM(H202:I202)","v":5414.0599999999995}]
[]
["REFERÊNCIA",null,"CPUE 65","CD-04 - QUADRO DE FORÇA DE SOBREPOR MONTADO EM CAIXA DE COMANDO COM DIMENSÕES MÍNIMAS DE 1800X500X150MM, 66 LUGARES. COM INSTALAÇÃO.","UNID.","COEF.","CUSTO","MATERIAL","MÃO OBRA","TOTAL"]
["MERCADO","INSUMO","COT 65","CD-04","UN   ",1,6000,{"$f":"F205*G205","v":6000}]
["SINAPI","COMPOSICAO",88247,"AUXILIAR DE ELETRICISTA COM ENCARGOS COMPLEMENTARES","H",10,17.170000000000002,null,{"$f":"F206*G206","v":171.70000000000002}]
["SINAPI","COMPOSICAO",88264,"ELETRICISTA COM ENCARGOS COMPLEMENTARES","H",10,22.61,null,{"$f":"F207*G207","v":226.1}]
["TOTAL",{"$nulls":6},{"$f":"SUM(H205:H207)","v":6000},{"$f":"SUM(I205:I207)","v":397.8},{"$f":"SUM(H208:I208)","v":6397.8}]
[]
["REFERÊNCIA",null,"CPUE 66","CD-N3 - QUADRO DE FORÇA DE SOBREPOR MONTADO EM CAIXA DE COMANDO COM DIMENSÕES MÍNIMAS DE 1800X500X150MM, 66 LUGARES. COM INSTALAÇÃO.","UNID.","COEF.","CUSTO","MATERIAL","MÃO OBRA","TOTAL"]
["MERCADO","INSUMO","COT 66","CD-N3","UN   ",1,6360,{"$f":"F211*G211","v":6360}]
["SINAPI","COMPOSICAO",88247,"AUXILIAR DE ELETRICISTA COM ENCARGOS COMPLEMENTARES","H",10,17.170000000000002,null,{"$f":"F212*G212","v":171.70000000000002}]
["SINAPI","COMPOSICAO",88264,"ELETRICISTA COM ENCARGOS COMPLEMENTARES","H",10,22.61,null,{"$f":"F213*G213","v":226.1}]
["TOTAL",{"$nulls":6},{"$f":"SUM(H211:H213)","v":6360},{"$f":"SUM(I211:I213)","v":397.8},{"$f":"SUM(H214:I214)","v":6757.8}]
[]
["REFERÊNCIA",null,"CPUE 67","QF EMERGENCIA - QUADRO DE FORÇA DE SOBREPOR MONTADO EM CAIXA DE COMANDO COM DIMENSÕES MÍNIMAS DE 800X500X150MM. COM INSTALAÇÃO.","UNID.","COEF.","CUSTO","MATERIAL","MÃO OBRA","TOTAL"]
["MERCADO","INSUMO","COT 67","QF - EMERGENCIA","UN   ",1,{"$f":"'Mapa Cotacões'!H264","v":3041.69},{"$f":"F217*G217","v":3041.69}]
["SINAPI","COMPOSICAO",88247,"AUXILIAR DE ELETRICISTA COM ENCARGOS COMPLEMENTARES","H",5,17.79,null,{"$f":"F218*G218","v":88.949999999999989}]
["SINAPI","COMPOSICAO",88264,"ELETRICISTA COM ENCARGOS COMPLEMENTARES","H",5,23.23,null,{"$f":"F219*G219","v":116.15}]
["TOTAL",{"$nulls":6},{"$f":"SUM(H217:H219)","v":3041.69},{"$f":"SUM(I217:I219)","v":205.1},{"$f":"SUM(H220:I220)","v":3246.79}]
[]
["REFERÊNCIA",null,"CPUE 68","QF ELEVADOR - QUADRO DE FORÇA DE SOBREPOR MONTADO EM CAIXA DE COMANDO COM DIMENSÕES MÍNIMAS DE 300X200X150MM. COM INSTALAÇÃO.","UNID.","COEF.","CUSTO","MATERIAL","MÃO OBRA","TOTAL"]
["MERCADO","INSUMO","COT 68","QF ELEVADOR","UN   ",1,1100,{"$f":"F223*G223","v":1100}]
["SINAPI","COMPOSICAO",88247,"AUXILIAR DE ELETRICISTA COM ENCARGOS COMPLEMENTARES","H",2,17.170000000000002,null,{"$f":"F224*G224","v":34.340000000000003}]
["SINAPI","COMPOSICAO",88264,"ELETRICISTA COM ENCARGOS COMPLEMENTARES","H",2,22.61,null,{"$f":"F225*G225","v":45.22}]
["TOTAL",{"$nulls":6},{"$f":"SUM(H223:H225)","v":1100},{"$f":"SUM(I223:I225)","v":79.56},{"$f":"SUM(H226:I226)","v":1179.56}]
[]
["REFERÊNCIA",null,"CPUE 69","QF – HIDRANTE-SOBREPOR, – Disjuntores, contatores, botoeiras, e demais acessórios. 3X 50A 600X400X220MM. COM INSTALAÇÃO.","UNID.","COEF.","CUSTO","MATERIAL","MÃO OBRA","TOTAL"]
["MERCADO","INSUMO","COT 69","QF HIDRANTE","UN   ",1,6000,{"$f":"F229*G229","v":6000}]
["SINAPI","COMPOSICAO",88247,"AUXILIAR DE ELETRICISTA COM ENCARGOS COMPLEMENTARES","H",5,17.170000000000002,null,{"$f":"F230*G230","v":85.850000000000009}]
["SINAPI","COMPOSICAO",88264,"ELETRICISTA COM ENCARGOS COMPLEMENTARES","H",5,22.61,null,{"$f":"F231*G231","v":113.05}]
["TOTAL",{"$nulls":6},{"$f":"SUM(H229:H231)","v":6000},{"$f":"SUM(I229:I231)","v":198.9},{"$f":"SUM(H232:I232)","v":6198.9}]
[]
["REFERÊNCIA",null,"CPUE 71","MÓDULO AUTÔNOMO DE ILUMINAÇÃO DE EMERGÊNCIA COM DIFUSOR LEITOSO, 500 LÚMENS, 115/220V, COM 80 LED'S. ALTO BRILHO, BATERIA 6V, 4,5Ah, AUTONOMIA DE 8 HORAS, GABINETE EM METAL, PINTURA EPÓXI. REF. TECHNOMASTER LM 0180 OU EQUIVALENTE","UNID.","COEF.","CUSTO","MATERIAL","MÃO OBRA","TOTAL"]
["MERCADO","INSUMO","COT 53","Módulo Autônomo de iluminação de emergência com difusor LEITOSO, 500 lumens, 115/220V, com 80 LEDs Alto-brilho, bateria 6V-4.5Ah, autonomia de 8 horas, gabinete em metal, pintura epóxi. Ref.  Technomaster LM 0180 ou equivalente.","UN   ",1,{"$f":"'Mapa Cotacões'!H220","v":109.9},{"$f":"F235*G235","v":109.9}]
["SINAPI","COMPOSICAO",88247,"AUXILIAR DE ELETRICISTA COM ENCARGOS COMPLEMENTARES","H",1,17.79,null,{"$f":"F236*G236","v":17.79}]
["SINAPI","COMPOSICAO",88264,"ELETRICISTA COM ENCARGOS COMPLEMENTARES","H",1,23.23,null,{"$f":"F237*G237","v":23.23}]
["TOTAL",{"$nulls":6},{"$f":"SUM(H235:H237)","v":109.9},{"$f":"SUM(I235:I237)","v":41.019999999999996},{"$f":"SUM(H238:I238)","v":150.92000000000002}]
[]
["REFERÊNCIA",null,"CPUE 72","MÓDULO AUTÔNOMO DE EMERGÊNCIA (127/220V) COM 2 FAROLETES DE 32 LED'S CADA, COM BATERIA 12V-7A COM AUTONOMIA DE 32 HORAS COM SUPORTE METÁLICO PARA FIXAÇÃO DA BATERIA. REF. TECHNOMASTER UN0232 OU EQUIVALENTE","UNID.","COEF.","CUSTO","MATERIAL","MÃO OBRA","TOTAL"]
["MERCADO","INSUMO","COT 52","Módulo autônomo de emergência (127V/220V) com 2 faroletes de 32 LEDs cada, com bateria 12V-7A com autonomia de 32 horas com suporte metálico para fixação da bateria. Ref. Technomaster UN 0232 ou equivalente","UN   ",1,{"$f":"'Mapa Cotacões'!H213","v":191.6},{"$f":"F241*G241","v":191.6}]
["SINAPI","COMPOSICAO",88247,"AUXILIAR DE ELETRICISTA COM ENCARGOS COMPLEMENTARES","H",1,17.79,null,{"$f":"F242*G242","v":17.79}]
["SINAPI","COMPOSICAO",88264,"ELETRICISTA COM ENCARGOS COMPLEMENTARES","H",1,23.23,null,{"$f":"F243*G243","v":23.23}]
["TOTAL",{"$nulls":6},{"$f":"SUM(H241:H243)","v":191.6},{"$f":"SUM(I241:I243)","v":41.019999999999996},{"$f":"SUM(H244:I244)","v":232.62}]
[]
["REFERÊNCIA",null,"CPUE 73","BARRAMENTO DE EQUIPOTENCIALIZAÇÃO","UNID.","COEF.","CUSTO","MATERIAL","MÃO OBRA","TOTAL"]
["MERCADO","INSUMO","COT 72","BARRAMENTO DE EQUIPOTENCIALIZAÇÃO","UN   ",1,{"$f":"'Mapa Cotacões'!H295","v":28.82},{"$f":"F247*G247","v":28.82}]
["SINAPI","COMPOSICAO",88247,"AUXILIAR DE ELETRICISTA COM ENCARGOS COMPLEMENTARES","H",0.3,17.79,null,{"$f":"F248*G248","v":5.3369999999999997}]
["SINAPI","COMPOSICAO",88264,"ELETRICISTA COM ENCARGOS COMPLEMENTARES","H",0.3,23.23,null,{"$f":"F249*G249","v":6.9690000000000003}]
["TOTAL",{"$nulls":6},{"$f":"SUM(H247:H249)","v":28.82},{"$f":"SUM(I247:I249)","v":12.306000000000001},{"$f":"SUM(H250:I250)","v":41.126000000000005}]
[]
["REFERÊNCIA",null,"CPUE 74","PERFILADO 38x38MM CHAPA #18","UNID.","COEF.","CUSTO","MATERIAL","MÃO OBRA","TOTAL"]
["MERCADO","INSUMO","COT 73","PERFILADO PERFURADO 38 X 38 MM, CHAPA 18","M",1,{"$f":"'Mapa Cotacões'!H302","v":30.93},{"$f":"F253*G253","v":30.93}]
["SINAPI","COMPOSICAO",88247,"AUXILIAR DE ELETRICISTA COM ENCARGOS COMPLEMENTARES","H",0.1,17.79,null,{"$f":"F254*G254","v":1.7789999999999999}]
["SINAPI","COMPOSICAO",88264,"ELETRICISTA COM ENCARGOS COMPLEMENTARES","H",0.1,23.23,null,{"$f":"F255*G255","v":2.323}]
["TOTAL",{"$nulls":6},{"$f":"SUM(H253:H255)","v":30.93},{"$f":"SUM(I253:I255)","v":4.1020000000000003},{"$f":"SUM(H256:I256)","v":35.031999999999996}]
[]
["REFERÊNCIA",null,"CPUE 75","Suporte longo para perfilado 38x38MM","UNID.","COEF.","CUSTO","MATERIAL","MÃO OBRA","TOTAL"]
["SINAPI","INSUMO",4350,"BUCHA DE NYLON, DIAMETRO DO FURO 8 MM, COMPRIMENTO 40 MM, COM PARAFUSO DE ROSCA SOBERBA, CABECA CHATA, FENDA SIMPLES, 4,8 X 50 MM","UN   ",0.33300000000000002,0.66,{"$f":"F259*G259","v":0.21978000000000003}]
["SINAPI","INSUMO",11267,"ARRUELA LISA, REDONDA, DE LATAO POLIDO, DIAMETRO NOMINAL 5/8\", DIAMETRO EXTERNO = 34 MM, DIAMETRO DO FURO = 17 MM, ESPESSURA = *2,5* MM","UN   ",0.33300000000000002,0.8,{"$f":"F260*G260","v":0.26640000000000003}]
["SINAPI","INSUMO",39028,"PERFILADO PERFURADO SIMPLES 38 X 38 MM, CHAPA 22","M",0.04,14.29,{"$f":"F261*G261","v":0.5716}]
["SINAPI","INSUMO",39997,"PORCA ZINCADA, SEXTAVADA, DIAMETRO 1/4\"","UN   ",0.33300000000000002,0.31,{"$f":"F262*G262","v":0.10323}]
["SINAPI","COMPOSICAO",88247,"AUXILIAR DE ELETRICISTA COM ENCARGOS COMPLEMENTARES","H",2E-3,17.79,null,{"$f":"F263*G263","v":3.5580000000000001E-2}]
["SINAPI","COMPOSICAO",88264,"ELETRICISTA COM ENCARGOS COMPLEMENTARES","H",1.4999999999999999E-2,23.23,null,{"$f":"F264*G264","v":0.34844999999999998}]
["TOTAL",{"$nulls":6},{"$f":"SUM(H259:H264)","v":1.1610100000000001},{"$f":"SUM(I259:I264)","v":0.38402999999999998},{"$f":"SUM(H265:I265)","v":1.5450400000000002}]
[]
["REFERÊNCIA",null,"CPUE 76","Vergalhão rosca total 1/4\"","M","COEF.","CUSTO","MATERIAL","MÃO OBRA","TOTAL"]
["SINAPI","INSUMO",39996,"VERGALHAO ZINCADO ROSCA TOTAL, 1/4 \" (6,3 MM)","m",1,5.49,{"$f":"F268*G268","v":5.49}]
["SINAPI","INSUMO",398,"ABRACADEIRA EM ACO PARA AMARRACAO DE ELETRODUTOS, TIPO D, COM 3\" E PARAFUSO DE FIXACAO","UN   ",1,4.88,{"$f":"F269*G269","v":4.88}]
["SINAPI","COMPOSICAO",88248,"AUXILIAR DE ENCANADOR OU BOMBEIRO HIDRÁULICO COM ENCARGOS COMPLEMENTARES","H",0.25,17.09,null,{"$f":"F270*G270","v":4.2725}]
["SINAPI","COMPOSICAO",88267,"ENCANADOR OU BOMBEIRO HIDRÁULICO COM ENCARGOS COMPLEMENTARES","H",0.25,22.36,null,{"$f":"F271*G271","v":5.59}]
["TOTAL",{"$nulls":6},{"$f":"SUM(H268:H271)","v":10.370000000000001},{"$f":"SUM(I268:I271)","v":9.8625000000000007},{"$f":"SUM(H272:I272)","v":20.232500000000002}]
[]
["REFERÊNCIA",null,"CPUE 77","CHUMBADOR ROSCA INTERNA 1/4\"","UNID.","COEF.","CUSTO","MATERIAL","MÃO OBRA","TOTAL"]
["SINAPI","INSUMO",11975,"CHUMBADOR DE ACO, DIAMETRO 5/8\", COMPRIMENTO 6\", COM PORCA","UN   ",1,24.43,{"$f":"F275*G275","v":24.43}]
["SINAPI","COMPOSICAO",88248,"AUXILIAR DE ENCANADOR OU BOMBEIRO HIDRÁULICO COM ENCARGOS COMPLEMENTARES","H",0.1,17.09,null,{"$f":"F276*G276","v":1.7090000000000001}]
["SINAPI","COMPOSICAO",88267,"ENCANADOR OU BOMBEIRO HIDRÁULICO COM ENCARGOS COMPLEMENTARES","H",0.1,22.36,null,{"$f":"F277*G277","v":2.2360000000000002}]
["TOTAL",{"$nulls":6},{"$f":"SUM(H275:H277)","v":24.43},{"$f":"SUM(I275:I277)","v":3.9450000000000003},{"$f":"SUM(H278:I278)","v":28.375}]
[]
["REFERÊNCIA",null,"CPUE 78","TRANSFORMADOR TRIFÁSICO A SECO, PN=225KVA, CLASSE 15KV - BT 220/127V - 60HZ, IP00.","UNID.","COEF.","CUSTO","MATERIAL","MÃO OBRA","TOTAL"]
["SINAPI","COMPOSICAO",5928,"GUINDAUTO HIDRÁULICO, CAPACIDADE MÁXIMA DE CARGA 6200 KG, MOMENTO MÁXIMO DE CARGA 11,7 TM, ALCANCE MÁXIMO HORIZONTAL 9,70 M, INCLUSIVE CAMINHÃO TOCO PBT 16.000 KG, POTÊNCIA DE 189 CV - CHP DIURNO. AF_06/2014","CHP",0.36,219,{"$f":"F281*G281","v":78.84}]
["SINAPI","INSUMO",7620,"TRANSFORMADOR TRIFASICO DE DISTRIBUICAO, POTENCIA DE 225 KVA, TENSAO NOMINAL DE 15 KV, TENSAO SECUNDARIA DE 220/127V, EM OLEO ISOLANTE TIPO MINERAL","UN   ",1,27432.28,{"$f":"F282*G282","v":27432.28}]
["SINAPI","COMPOSICAO",88248,"AUXILIAR DE ENCANADOR OU BOMBEIRO HIDRÁULICO COM ENCARGOS COMPLEMENTARES","H",9.9849999999999994,17.09,null,{"$f":"F283*G283","v":170.64364999999998}]
["SINAPI","COMPOSICAO",88267,"ENCANADOR OU BOMBEIRO HIDRÁULICO COM ENCARGOS COMPLEMENTARES","H",9.9849999999999994,22.36,null,{"$f":"F284*G284","v":223.26459999999997}]
["TOTAL",{"$nulls":6},{"$f":"SUM(H281:H284)","v":27511.119999999999},{"$f":"SUM(I281:I284)","v":393.90824999999995},{"$f":"SUM(H285:I285)","v":27905.028249999999}]
[]
["REFERÊNCIA",null,"CPUE 79","CABO DE COBRE UNIPOLAR #35MM² BLINDADO, ISOLAÇÃO 12/20KV EPR - COBERTURA EM PVC","M","COEF.","CUSTO","MATERIAL","MÃO OBRA","TOTAL"]
["SINAPI","INSUMO",901,"CABO DE COBRE UNIPOLAR 35 MM2, BLINDADO, ISOLACAO 12/20 KV EPR, COBERTURA EM","M",1,101.12,{"$f":"F288*G288","v":101.12}]
["SINAPI","INSUMO",21127,"FITA ISOLANTE ADESIVA ANTICHAMA, USO ATE 750 V, EM ROLO DE 19 MM X 5 M","UN   ",8.9999999999999993E-3,2.7,{"$f":"F289*G289","v":2.4299999999999999E-2}]
["SINAPI","COMPOSICAO",88247,"AUXILIAR DE ELETRICISTA COM ENCARGOS COMPLEMENTARES","H",7.2999999999999995E-2,17.79,null,{"$f":"F290*G290","v":1.2986699999999998}]
["SINAPI","COMPOSICAO",88264,"ELETRICISTA COM ENCARGOS COMPLEMENTARES","H",7.2999999999999995E-2,23.23,null,{"$f":"F291*G291","v":1.6957899999999999}]
["TOTAL",{"$nulls":6},{"$f":"SUM(H288:H291)","v":101.1443},{"$f":"SUM(I288:I291)","v":2.9944599999999997},{"$f":"SUM(H292:I292)","v":104.13876}]
[]
["REFERÊNCIA",null,"CPUE 80","PUNHO DE ACIONAMENTO DA SECCIONADORA C/ MICROINTERRUPTOR DO INTERTRAVAMENTO ELÉTRICO, DIRETAMENTE ATERRADO","UNID.","COEF.","CUSTO","MATERIAL","MÃO OBRA","TOTAL"]
["MERCADO","INSUMO","COT 44","PUNHO DE ACIONAMENTO DA SECCIONADORA C/ MICROINTERRUPTOR DO INTERTRAVAMENTO ELÉTRICO, DIRETAMENTE ATERRADO","UN   ",1,{"$f":"'Mapa Cotacões'!H188","v":289.99},{"$f":"F295*G295","v":289.99}]
["SINAPI","COMPOSICAO",88247,"AUXILIAR DE ELETRICISTA COM ENCARGOS COMPLEMENTARES","H",1,17.79,null,{"$f":"F296*G296","v":17.79}]
["SINAPI","COMPOSICAO",88264,"ELETRICISTA COM ENCARGOS COMPLEMENTARES","H",1,23.32,null,{"$f":"F297*G297","v":23.32}]
["TOTAL",{"$nulls":6},{"$f":"SUM(H295:H297)","v":289.99},{"$f":"SUM(I295:I297)","v":41.11},{"$f":"SUM(H298:I298)","v":331.1}]
[]
["REFERÊNCIA",null,"CPUE 81","QUADRO COM DIAGRAMA UNIFILAR DA SUBESTAÇÃO","UNID.","COEF.","CUSTO","MATERIAL","MÃO OBRA","TOTAL"]
["SINAPI","INSUMO",34723,"PLACA DE SINALIZACAO EM CHAPA DE ACO NUM 16 COM PINTURA REFLETIVA","UN   ",1,519.75,{"$f":"F301*G301","v":519.75}]
["SINAPI","COMPOSICAO",88247,"AUXILIAR DE ELETRICISTA COM ENCARGOS COMPLEMENTARES","H",1,17.79,null,{"$f":"F302*G302","v":17.79}]
["TOTAL",{"$nulls":6},{"$f":"SUM(H301:H302)","v":519.75},{"$f":"SUM(I301:I302)","v":17.79},{"$f":"SUM(H303:I303)","v":537.54}]
[]
["REFERÊNCIA",null,"CPUE 82","CALDEIRA MURAL GLP, POTÊNCIA NOMINAL 69,0KW, VAZÃO 42,5 L/MINM COM CHAMINÉ INCLUSA","UNID.","COEF.","CUSTO","MATERIAL","MÃO OBRA","TOTAL"]
["MERCADO","INSUMO","COT 20","CALDEIRA MURAL GLP, POTÊNCIA NOMINAL 69,0KW, VAZÃO 42,5 L/MINM COM CHAMINÉ INCLUSA","UN   ",1,{"$f":"'Mapa Cotacões'!H127","v":10708.96},{"$f":"F306*G306","v":10708.96}]
["SINAPI","COMPOSICAO",88247,"AUXILIAR DE ELETRICISTA COM ENCARGOS COMPLEMENTARES","H",24,17.79,null,{"$f":"F307*G307","v":426.96}]
["SINAPI","COMPOSICAO",88264,"ELETRICISTA COM ENCARGOS COMPLEMENTARES","H",24,23.23,null,{"$f":"F308*G308","v":557.52}]
["TOTAL",{"$nulls":6},{"$f":"SUM(H306:H308)","v":10708.96},{"$f":"SUM(I306:I308)","v":984.48},{"$f":"SUM(H309:I309)","v":11693.439999999999}]
[]
["REFERÊNCIA",null,"CPUE 83","RESERVATÓRIO DE ÁGUA QUENTE 300 LITROS","UNID.","COEF.","CUSTO","MATERIAL","MÃO OBRA","TOTAL"]
["MERCADO","INSUMO","COT 21","RESERVATÓRIO DE ÁGUA QUENTE 300 LITROS","UN   ",1,2060,{"$f":"'Mapa Cotacões'!H134","v":2280}]
["SINAPI","COMPOSICAO",88247,"AUXILIAR DE ELETRICISTA COM ENCARGOS COMPLEMENTARES","H",24,17.79,null,{"$f":"F313*G313","v":426.96}]
["SINAPI","COMPOSICAO",88264,"ELETRICISTA COM ENCARGOS COMPLEMENTARES","H",24,23.23,null,{"$f":"F314*G314","v":557.52}]
["TOTAL",{"$nulls":6},{"$f":"SUM(H312:H314)","v":2280},{"$f":"SUM(I312:I314)","v":984.48},{"$f":"SUM(H315:I315)","v":3264.48}]
[]
["REFERÊNCIA",null,"CPUE 84","VÁLVULA QUEBRA VÁCUO 32MM","UNID.","COEF.","CUSTO","MATERIAL","MÃO OBRA","TOTAL"]
["SINAPI","INSUMO",3148,"FITA VEDA ROSCA EM ROLOS DE 18 MM X 50 M (L X C)","UN   ",1.9E-2,15.82,{"$f":"F318*G318","v":0.30058000000000001}]
["SINAPI","INSUMO",10409," VALVULA DE RETENCAO HORIZONTAL, DE BRONZE (PN-25), 1 1/2\", 400 PSI, TAMPA DE PORCA DE UNIAO, EXTREMIDADES COM ROSCA ","UN   ",1,273.95999999999998,{"$f":"F319*G319","v":273.95999999999998}]
["SINAPI","COMPOSICAO",88247,"AUXILIAR DE ELETRICISTA COM ENCARGOS COMPLEMENTARES","H",0.78900000000000003,17.79,null,{"$f":"F320*G320","v":14.03631}]
["SINAPI","COMPOSICAO",88264,"ELETRICISTA COM ENCARGOS COMPLEMENTARES","H",0.78900000000000003,23.23,null,{"$f":"F321*G321","v":18.328469999999999}]
["TOTAL",{"$nulls":6},{"$f":"SUM(H318:H321)","v":274.26058},{"$f":"SUM(I318:I321)","v":32.364779999999996},{"$f":"SUM(H322:I322)","v":306.62536}]
[]
[]
["REFERÊNCIA",null,"CPUE 85","TERMINAÇÃO TERMOCONTRÁTIL PARA CABO 35MM2, CLASSE 15kV (PARA USO INTERNO)","UNID.","COEF.","CUSTO","MATERIAL","MÃO OBRA","TOTAL"]
["MERCADO","INSUMO","COT 43","TERMINAÇÃO TERMOCONTRÁTIL PARA CABO 35 MM² - CLASSE 15 KV (PARA USO INTERNO)","UN   ",1,{"$f":"'Mapa Cotacões'!H181","v":253.55},{"$f":"F326*G326","v":253.55}]
["SINAPI","COMPOSICAO",88247,"AUXILIAR DE ELETRICISTA COM ENCARGOS COMPLEMENTARES","H",0.1,17.79,null,{"$f":"F327*G327","v":1.7789999999999999}]
["SINAPI","COMPOSICAO",88264,"ELETRICISTA COM ENCARGOS COMPLEMENTARES","H",0.2,23.23,null,{"$f":"F328*G328","v":4.6459999999999999}]
["TOTAL",{"$nulls":6},{"$f":"SUM(H326:H328)","v":253.55},{"$f":"SUM(I326:I328)","v":6.4249999999999998},{"$f":"SUM(H329:I329)","v":259.97500000000002}]
[]
["REFERÊNCIA",null,"CPUE 86","PORTA PAPEL HIGIÊNICO EM ROLO - DISPENSER EM PLÁSTICO","UNID.","COEF.","CUSTO","MATERIAL","MÃO OBRA","TOTAL"]
["SINAPI","INSUMO",37400,"PAPELEIRA PLASTICA TIPO DISPENSER PARA PAPEL HIGIENICO ROLAO","UN   ",1,43.14,{"$f":"F332*G332","v":43.14}]
["SINAPI","COMPOSICAO",88267,"ENCANADOR OU BOMBEIRO HIDRÁULICO COM ENCARGOS COMPLEMENTARES","H",0.31619999999999998,22.36,null,{"$f":"F333*G333","v":7.070231999999999}]
["SINAPI","COMPOSICAO",88316,"SERVENTE COM ENCARGOS COMPLEMENTARES","H",9.9599999999999994E-2,17.79,null,{"$f":"F334*G334","v":1.7718839999999998}]
["TOTAL",{"$nulls":6},{"$f":"SUM(H332:H334)","v":43.14},{"$f":"SUM(I332:I334)","v":8.842115999999999},{"$f":"SUM(H335:I335)","v":51.982115999999998}]
[]
["REFERÊNCIA",null,"CPUE 87","MEIA SABONETEIRA PARA CHUVEIRO","UNID.","COEF.","CUSTO","MATERIAL","MÃO OBRA","TOTAL"]
["SINAPI","INSUMO",11757,"SABONETEIRA DE PAREDE EM METAL CROMADO","UN   ",1,59.05,{"$f":"F338*G338","v":59.05}]
["SINAPI","COMPOSICAO",88267,"ENCANADOR OU BOMBEIRO HIDRÁULICO COM ENCARGOS COMPLEMENTARES","H",0.31619999999999998,22.36,null,{"$f":"F339*G339","v":7.070231999999999}]
["SINAPI","COMPOSICAO",88316,"SERVENTE COM ENCARGOS COMPLEMENTARES","H",9.9599999999999994E-2,17.79,null,{"$f":"F340*G340","v":1.7718839999999998}]
["TOTAL",{"$nulls":6},{"$f":"SUM(H338:H340)","v":59.05},{"$f":"SUM(I338:I340)","v":8.842115999999999},{"$f":"SUM(H341:I341)","v":67.892116000000001}]
[]
["REFERÊNCIA",null,"CPUE 88","TOALHEIRO DISPENSER PARA TOALHA DE PAPEL, EM PLÁSTICO","UNID.","COEF.","CUSTO","MATERIAL","MÃO OBRA","TOTAL"]
["SINAPI","INSUMO",37401,"TOALHEIRO PLASTICO TIPO DISPENSER PARA PAPEL TOALHA INTERFOLHADO","UN   ",1,43.14,{"$f":"F344*G344","v":43.14}]
["SINAPI","COMPOSICAO",88267,"ENCANADOR OU BOMBEIRO HIDRÁULICO COM ENCARGOS COMPLEMENTARES","H",0.31619999999999998,22.36,null,{"$f":"F345*G345","v":7.070231999999999}]
["SINAPI","COMPOSICAO",88316,"SERVENTE COM ENCARGOS COMPLEMENTARES","H",9.9599999999999994E-2,17.79,null,{"$f":"F346*G346","v":1.7718839999999998}]
["TOTAL",{"$nulls":6},{"$f":"SUM(H344:H346)","v":43.14},{"$f":"SUM(I344:I346)","v":8.842115999999999},{"$f":"SUM(H347:I347)","v":51.982115999999998}]
[]
["REFERÊNCIA",null,"CPUE 89","CHUVEIRO PARA AQUECEDOR A GÁS","UNID.","COEF.","CUSTO","MATERIAL","MÃO OBRA","TOTAL"]
["SINAPI","INSUMO",38189,"DUCHA METALICA DE PAREDE, ARTICULAVEL, COM BRACO/CANO, SEM DESVIADOR","UN   ",1,254.06,{"$f":"F350*G350","v":254.06}]
["SINAPI","INSUMO",3146,"FITA VEDA ROSCA EM ROLOS DE 18 MM X 10 M (L X C)","UN   ",2.1000000000000001E-2,4.29,{"$f":"F351*G351","v":9.0090000000000003E-2}]
["SINAPI","COMPOSICAO",88267,"ENCANADOR OU BOMBEIRO HIDRÁULICO COM ENCARGOS COMPLEMENTARES","H",0.44669999999999999,22.36,null,{"$f":"F352*G352","v":9.988211999999999}]
["SINAPI","COMPOSICAO",88316,"SERVENTE COM ENCARGOS COMPLEMENTARES","H",0.14069999999999999,17.79,null,{"$f":"F353*G353","v":2.5030529999999995}]
["TOTAL",{"$nulls":6},{"$f":"SUM(H350:H353)","v":254.15009000000001},{"$f":"SUM(I350:I353)","v":12.491264999999999},{"$f":"SUM(H354:I354)","v":266.64135499999998}]
[]
["REFERÊNCIA",null,"CPUE 90","BATEDOR DE AÇO POLIDO","UNID.","COEF.","CUSTO","MATERIAL","MÃO OBRA","TOTAL"]
["MERCADO","INSUMO","COT 19","BATEDOR DE AÇO POLIDO","UN   ",1,{"$f":"'Mapa Cotacões'!H120","v":289},{"$f":"F357*G357","v":289}]
["SINAPI","COMPOSIÇÃO",88273,"MARCENEIRO COM ENCARGOS COMPLEMENTARES","H",1,22.96,null,{"$f":"F358*G358","v":22.96}]
["TOTAL",{"$nulls":6},{"$f":"SUM(H357:H358)","v":289},{"$f":"SUM(I357:I358)","v":22.96},{"$f":"SUM(H359:I359)","v":311.95999999999998}]
[]
["REFERÊNCIA",null,"CPUE 91","TERMINAÇÃO TERMOCONTRÁTIL PARA CABO 35MM2, CLASSE 15kV (PARA USO EXTERNO)","UNID.","COEF.","CUSTO","MATERIAL","MÃO OBRA","TOTAL"]
["MERCADO","INSUMO","COT 42","TERMINAÇÃO TERMOCONTRÁTIL PARA CABO 35 MM² - CLASSE 15 KV (PARA USO EXTERNO)","UN   ",1,{"$f":"'Mapa Cotacões'!H174","v":253.76},{"$f":"F362*G362","v":253.76}]
["SINAPI","COMPOSICAO",88247,"AUXILIAR DE ELETRICISTA COM ENCARGOS COMPLEMENTARES","H",0.1,17.79,null,{"$f":"F363*G363","v":1.7789999999999999}]
["SINAPI","COMPOSICAO",88264,"ELETRICISTA COM ENCARGOS COMPLEMENTARES","H",0.2,23.23,null,{"$f":"F364*G364","v":4.6459999999999999}]
["TOTAL",{"$nulls":6},{"$f":"SUM(H362:H364)","v":253.76},{"$f":"SUM(I362:I364)","v":6.4249999999999998},{"$f":"SUM(H365:I365)","v":260.185}]
[]
["REFERÊNCIA",null,"CPUE 92","ESPELHO PRATA LAMINADO 60X80CM","UNID.","COEF.","CUSTO","MATERIAL","MÃO OBRA","TOTAL"]
["SINAPI","INSUMO",11186,"ESPELHO CRISTAL E = 4 MM","M2",0.48,349.19,{"$f":"F368*G368","v":167.6112}]
["SINAPI","COMPOSICAO",88316,"SERVENTE COM ENCARGOS COMPLEMENTARES","H",1,17.79,null,{"$f":"F369*G369","v":17.79}]
["TOTAL",{"$nulls":6},{"$f":"SUM(H368:H369)","v":167.6112},{"$f":"SUM(I368:I369)","v":17.79},{"$f":"SUM(H370:I370)","v":185.40119999999999}]
[]
["REFERÊNCIA",null,"CPUE 93","ADPATADOR ROSCA 25MM","UNID.","COEF.","CUSTO","MATERIAL","MÃO OBRA","TOTAL"]
["SINAPI","INSUMO",65,"ADAPTADOR PVC SOLDAVEL CURTO COM BOLSA E ROSCA, 25 MM X 3/4\", PARA AGUA FRIA","UN   ",1,1.48,{"$f":"F373*G373","v":1.48}]
["SINAPI","INSUMO",122,"ADESIVO PLASTICO PARA PVC, FRASCO COM 850 GR","UN   ",7.0000000000000001E-3,79.94,{"$f":"F374*G374","v":0.55957999999999997}]
["SINAPI","INSUMO",20083,"SOLUCAO LIMPADORA PARA PVC, FRASCO COM 1000 CM3","UN   ",8.0000000000000002E-3,90.57,{"$f":"F375*G375","v":0.72455999999999998}]
["SINAPI","INSUMO",38383,"LIXA D'AGUA EM FOLHA, GRAO 100","UN   ",0.05,2.06,{"$f":"F376*G376","v":0.10300000000000001}]
["SINAPI","COMPOSIÇÃO",88248,"AUXILIAR DE ENCANADOR OU BOMBEIRO HIDRÁULICO COM ENCARGOS COMPLEMENTARES","H",0.1,17.09,null,{"$f":"F377*G377","v":1.7090000000000001}]
["SINAPI","COMPOSIÇÃO",88267,"ENCANADOR OU BOMBEIRO HIDRÁULICO COM ENCARGOS COMPLEMENTARES","H",0.1,22.36,null,{"$f":"F378*G378","v":2.2360000000000002}]
["TOTAL",{"$nulls":6},{"$f":"SUM(H373:H378)","v":2.86714},{"$f":"SUM(I377:I378)","v":3.9450000000000003},{"$f":"SUM(H379:I379)","v":6.8121400000000003}]
[]
["REFERÊNCIA",null,"CPUE 94","MANGOTINHO 25MM EM CARRETEL COM 30M","UNID.","COEF.","CUSTO","MATERIAL","MÃO OBRA","TOTAL"]
["MERCADO","INSUMO","COT 32","CARRETEL MANUAL PARA 30M","UN   ",1,{"$f":"'Mapa Cotacões'!H147","v":2316},2316]
["MERCADO","INSUMO","COT 33","MANGOTINHO  25MM de 30M","UN   ",1,{"$f":"'Mapa Cotacões'!H154","v":639},{"$f":"F383*G383","v":639}]
["SINAPI","COMPOSIÇÃO",88248,"AUXILIAR DE ENCANADOR OU BOMBEIRO HIDRÁULICO COM ENCARGOS COMPLEMENTARES","H",1.5,17.09,null,{"$f":"F384*G384","v":25.634999999999998}]
["SINAPI","COMPOSIÇÃO",88267,"ENCANADOR OU BOMBEIRO HIDRÁULICO COM ENCARGOS COMPLEMENTARES","H",1.5,22.36,null,{"$f":"F385*G385","v":33.54}]
["TOTAL",{"$nulls":6},{"$f":"SUM(H382:H385)","v":2955},{"$f":"SUM(I384:I385)","v":59.174999999999997},{"$f":"SUM(H386:I386)","v":3014.1750000000002}]
[]
["REFERÊNCIA",null,"CPUE 95","ESGUICHO NEBLINA 25MM","UNID.","COEF.","CUSTO","MATERIAL","MÃO OBRA","TOTAL"]
["SINAPI","INSUMO",37555,"ESGUICHO JATO REGULAVEL, TIPO ELKHART, ENGATE RAPIDO 2 1/2\", PARA COMBATE A INCENDIO","UN   ",1,292.74,{"$f":"F389*G389","v":292.74}]
["SINAPI","COMPOSIÇÃO",88248,"AUXILIAR DE ENCANADOR OU BOMBEIRO HIDRÁULICO COM ENCARGOS COMPLEMENTARES","H",1.1499999999999999,17.09,null,{"$f":"F390*G390","v":19.653499999999998}]
["SINAPI","COMPOSIÇÃO",88267,"ENCANADOR OU BOMBEIRO HIDRÁULICO COM ENCARGOS COMPLEMENTARES","H",1.1499999999999999,22.36,null,{"$f":"F391*G391","v":25.713999999999999}]
["TOTAL",{"$nulls":6},{"$f":"SUM(H389:H391)","v":292.74},{"$f":"SUM(I390:I391)","v":45.367499999999993},{"$f":"SUM(H392:I392)","v":338.10750000000002}]
[]
["REFERÊNCIA",null,"CPUE 96","TOMADA STORZ 40MM","UNID.","COEF.","CUSTO","MATERIAL","MÃO OBRA","TOTAL"]
["SINAPI","INSUMO",20974,"UNIAO TIPO STORZ, COM EMPATACAO INTERNA TIPO ANEL DE EXPANSAO, ENGATE RAPIDO 2 1/2\", PARA MANGUEIRA DE COMBATE A INCENDIO PREDIAL","UN   ",1,179.54,{"$f":"F395*G395","v":179.54}]
["SINAPI","COMPOSIÇÃO",88248,"AUXILIAR DE ENCANADOR OU BOMBEIRO HIDRÁULICO COM ENCARGOS COMPLEMENTARES","H",1.1499999999999999,17.09,null,{"$f":"F396*G396","v":19.653499999999998}]
["SINAPI","COMPOSIÇÃO",88267,"ENCANADOR OU BOMBEIRO HIDRÁULICO COM ENCARGOS COMPLEMENTARES","H",1.1499999999999999,22.36,null,{"$f":"F397*G397","v":25.713999999999999}]
["TOTAL",{"$nulls":6},{"$f":"SUM(H395:H397)","v":179.54},{"$f":"SUM(I396:I397)","v":45.367499999999993},{"$f":"SUM(H398:I398)","v":224.90749999999997}]
[]
["REFERÊNCIA",null,"CPUE 97","CHAVE DE UNIÕES","UNID.","COEF.","CUSTO","MATERIAL","MÃO OBRA","TOTAL"]
["SINAPI","INSUMO",20971,"CHAVE DUPLA PARA CONEXOES TIPO STORZ, ENGATE RAPIDO 1 1/2\" X 2 1/2\", EM LATAO, PARA INSTALACAO PREDIAL COMBATE A INCENDIO","UN   ",1,19.510000000000002,{"$f":"F401*G401","v":19.510000000000002}]
["SINAPI","COMPOSIÇÃO",88248,"AUXILIAR DE ENCANADOR OU BOMBEIRO HIDRÁULICO COM ENCARGOS COMPLEMENTARES","H",0.15,17.09,null,{"$f":"F402*G402","v":2.5634999999999999}]
["SINAPI","COMPOSIÇÃO",88267,"ENCANADOR OU BOMBEIRO HIDRÁULICO COM ENCARGOS COMPLEMENTARES","H",0.15,22.36,null,{"$f":"F403*G403","v":3.3539999999999996}]
["TOTAL",{"$nulls":6},{"$f":"SUM(H401:H403)","v":19.510000000000002},{"$f":"SUM(I402:I403)","v":5.9174999999999995},{"$f":"SUM(H404:I404)","v":25.427500000000002}]
[]
["REFERÊNCIA",null,"CPUE 98","CAIXA PARA CARRETEL DE MANGOTINHO DE 50M","UNID.","COEF.","CUSTO","MATERIAL","MÃO OBRA","TOTAL"]
["SINAPI","INSUMO",20963,"CAIXA DE INCENDIO/ABRIGO PARA MANGUEIRA, DE SOBREPOR/EXTERNA, COM 90 X 60 X 17 CM, EM CHAPA DE ACO, PORTA COM VENTILACAO, VISOR COM A INSCRICAO \"INCENDIO\", SUPORTE/CESTA INTERNA PARA A MANGUEIRA, PINTURA ELETROSTATICA VERMELHA","UN   ",1,464.2,{"$f":"F407*G407","v":464.2}]
["SINAPI","COMPOSIÇÃO",88248,"AUXILIAR DE ENCANADOR OU BOMBEIRO HIDRÁULICO COM ENCARGOS COMPLEMENTARES","H",1,17.09,null,{"$f":"F408*G408","v":17.09}]
["SINAPI","COMPOSIÇÃO",88267,"ENCANADOR OU BOMBEIRO HIDRÁULICO COM ENCARGOS COMPLEMENTARES","H",1,22.36,null,{"$f":"F409*G409","v":22.36}]
["TOTAL",{"$nulls":6},{"$f":"SUM(H407:H409)","v":464.2},{"$f":"SUM(I408:I409)","v":39.450000000000003},{"$f":"SUM(H410:I410)","v":503.65}]
[]
["REFERÊNCIA",null,"CPUE 99","SUPORTE PARA FIXAÇÃO DE EXTINTOR EM PAREDE, COM BUCHA E PARAFUSO","UNID.","COEF.","CUSTO","MATERIAL","MÃO OBRA","TOTAL"]
["SINAPI","INSUMO",402,"GANCHO OLHAL EM ACO GALVANIZADO, ESPESSURA 16MM, ABERTURA 21MM","UN   ",1,15.91,{"$f":"F413*G413","v":15.91}]
["SINAPI","COMPOSIÇÃO",88248,"AUXILIAR DE ENCANADOR OU BOMBEIRO HIDRÁULICO COM ENCARGOS COMPLEMENTARES","H",0.15,17.09,null,{"$f":"F414*G414","v":2.5634999999999999}]
["TOTAL",{"$nulls":6},{"$f":"SUM(H413:H414)","v":15.91},{"$f":"SUM(I414:I414)","v":2.5634999999999999},{"$f":"SUM(H415:I415)","v":18.473500000000001}]
[]
["REFERÊNCIA",null,"CPUE 100","ACIONADOR MANUAL DE ALARME DE INCÊNDIO","UNID.","COEF.","CUSTO","MATERIAL","MÃO OBRA","TOTAL"]
["MERCADO","INSUMO","COT 8","ACIONADOR MANUAL DE ALARME DE INCÊNDIO","UN   ",1,{"$f":"'Mapa Cotacões'!H92","v":55.66},{"$f":"F418*G418","v":55.66}]
["SINAPI","COMPOSIÇÃO",88247,"AUXILIAR DE ELETRICISTA COM ENCARGOS COMPLEMENTARES","H",0.4,17.79,null,{"$f":"F419*G419","v":7.1159999999999997}]
["SINAPI","COMPOSIÇÃO",88264,"ELETRICISTA COM ENCARGOS COMPLEMENTARES","H",0.4,23.23,null,{"$f":"F420*G420","v":9.2919999999999998}]
["TOTAL",{"$nulls":6},{"$f":"SUM(H418:H420)","v":55.66},{"$f":"SUM(I419:I420)","v":16.408000000000001},{"$f":"SUM(H421:I421)","v":72.067999999999998}]
[]
["REFERÊNCIA",null,"CPUE 101","MANGOTE FLEXÍVEL 5/16\"","M","COEF.","CUSTO","MATERIAL","MÃO OBRA","TOTAL"]
["SINAPI","INSUMO",37456,"MANGUEIRA CRISTAL PARA NIVEL, LISA, PVC TRANSPARENTE, 5/16\" X1 MM","M",1,1.66,{"$f":"F424*G424","v":1.66}]
["SINAPI","COMPOSIÇÃO",88248,"AUXILIAR DE ENCANADOR OU BOMBEIRO HIDRÁULICO COM ENCARGOS COMPLEMENTARES","H",0.05,17.09,null,{"$f":"F425*G425","v":0.85450000000000004}]
["SINAPI","COMPOSIÇÃO",88267,"ENCANADOR OU BOMBEIRO HIDRÁULICO","H",0.05,22.36,null,{"$f":"F426*G426","v":1.1180000000000001}]
["TOTAL",{"$nulls":6},{"$f":"SUM(H424:H426)","v":1.66},{"$f":"SUM(I425:I426)","v":1.9725000000000001},{"$f":"SUM(H427:I427)","v":3.6325000000000003}]
[]
["REFERÊNCIA",null,"CPUE 102","MANGOTE FLEXÍVEL 1/2\"","M","COEF.","CUSTO","MATERIAL","MÃO OBRA","TOTAL"]
["SINAPI","INSUMO",37458,"MANGUEIRA CRISTAL, LISA, PVC TRANSPARENTE, 1/2\" X 2 MM","M",1,4.7,{"$f":"F430*G430","v":4.7}]
["SINAPI","COMPOSIÇÃO",88248,"AUXILIAR DE ENCANADOR OU BOMBEIRO HIDRÁULICO COM ENCARGOS COMPLEMENTARES","H",0.05,17.09,null,{"$f":"F431*G431","v":0.85450000000000004}]
["SINAPI","COMPOSIÇÃO",88267,"ENCANADOR OU BOMBEIRO HIDRÁULICO","H",0.05,22.36,null,{"$f":"F432*G432","v":1.1180000000000001}]
["TOTAL",{"$nulls":6},{"$f":"SUM(H430:H432)","v":4.7},{"$f":"SUM(I431:I432)","v":1.9725000000000001},{"$f":"SUM(H433:I433)","v":6.6725000000000003}]
[]
["REFERÊNCIA",null,"CPUE 103","MANÔMETRO DIÂMETRO 75MM, RANGE DE PRESSÃO DE 0 A 7KGF/CM²","M","COEF.","CUSTO","MATERIAL","MÃO OBRA","TOTAL"]
["MERCADO","INSUMO","COT 14","MANÔMETRO DIÂMETRO 75MM, RANGE DE PRESSÃO DE 0 A 7KGF/CM²","UN   ",1,{"$f":"'Mapa Cotacões'!H106","v":115},{"$f":"F436*G436","v":115}]
["SINAPI","COMPOSIÇÃO",88248,"AUXILIAR DE ENCANADOR OU BOMBEIRO HIDRÁULICO COM ENCARGOS COMPLEMENTARES","H",1,17.09,null,{"$f":"F437*G437","v":17.09}]
["SINAPI","COMPOSIÇÃO",88267,"ENCANADOR OU BOMBEIRO HIDRÁULICO","H",1,22.36,null,{"$f":"F438*G438","v":22.36}]
["TOTAL",{"$nulls":6},{"$f":"SUM(H436:H438)","v":115},{"$f":"SUM(I437:I438)","v":39.450000000000003},{"$f":"SUM(H439:I439)","v":154.44999999999999}]
[]
["REFERÊNCIA",null,"CPUE 104","Regulador de pressão com válvula de segurança, com manômetro, segundo estágio, entrada de 1,5 kgf e saída 280mmca","UNID.","COEF.","CUSTO","MATERIAL","MÃO OBRA","TOTAL"]
["MERCADO","INSUMO","COT 13","Regulador de pressão com válvula de segurança, com manômetro, segundo estágio, entrada de 1,5 kgf/cm² e saída 280 mmca","UN   ",1,{"$f":"'Mapa Cotacões'!H99","v":171.4},{"$f":"F442*G442","v":171.4}]
["SINAPI","COMPOSIÇÃO",88248,"AUXILIAR DE ENCANADOR OU BOMBEIRO HIDRÁULICO COM ENCARGOS COMPLEMENTARES","H",1,17.09,null,{"$f":"F443*G443","v":17.09}]
["SINAPI","COMPOSIÇÃO",88267,"ENCANADOR OU BOMBEIRO HIDRÁULICO","H",1,22.36,null,{"$f":"F444*G444","v":22.36}]
["TOTAL",{"$nulls":6},{"$f":"SUM(H442:H444)","v":171.4},{"$f":"SUM(I443:I444)","v":39.450000000000003},{"$f":"SUM(H445:I445)","v":210.85000000000002}]
[]
["REFERÊNCIA",null,"CPUE 105","Regulador de pressão com válvula de segurança, com manômetro, primeiro estágio, entrada de 5kgf/cm² e saída 1,5 kgf/cm²","UNID.","COEF.","CUSTO","MATERIAL","MÃO OBRA","TOTAL"]
["MERCADO","INSUMO","COT 13","Regulador de pressão com válvula de segurança, com manômetro, primeiro estágio, entrada de 5kgf/cm² e saída 1,5 kgf/cm²","UN   ",1,{"$f":"'Mapa Cotacões'!H99","v":171.4},{"$f":"F448*G448","v":171.4}]
["SINAPI","COMPOSIÇÃO",88248,"AUXILIAR DE ENCANADOR OU BOMBEIRO HIDRÁULICO COM ENCARGOS COMPLEMENTARES","H",1,17.09,null,{"$f":"F449*G449","v":17.09}]
["SINAPI","COMPOSIÇÃO",88267,"ENCANADOR OU BOMBEIRO HIDRÁULICO","H",1,22.36,null,{"$f":"F450*G450","v":22.36}]
["TOTAL",{"$nulls":6},{"$f":"SUM(H448:H450)","v":171.4},{"$f":"SUM(I449:I450)","v":39.450000000000003},{"$f":"SUM(H451:I451)","v":210.85000000000002}]
[]
["REFERÊNCIA",null,"CPUE 106 ","CONTRAPISO DE CONCRETO ARMADO, E = 6 CM","M2","COEF.","CUSTO","MATERIAL","MÃO OBRA","TOTAL"]
["SINAPI","COMPOSICAO",96624,"LASTRO COM MATERIAL GRANULAR (PEDRA BRITADA N.2), APLICADO EM PISOS OU RADIERS, ESPESSURA DE *10 CM*. AF_08/2017","M3",0.06,99.65,{"$f":"F454*G454","v":5.9790000000000001}]
["SINAPI","COMPOSICAO",97082,"ESCAVAÇÃO MANUAL DE VIGA DE BORDA PARA RADIER. AF_09/2017","M3",0.03,54.71,{"$f":"F455*G455","v":1.6413}]
["SINAPI","COMPOSICAO",97083,"COMPACTAÇÃO MECÂNICA DE SOLO PARA EXECUÇÃO DE RADIER, COM COMPACTADOR DE OLOS A PERCUSSÃO. AF_09/2017","M2",1,2.9,2.9]
["SINAPI","COMPOSICAO",97086,"FABRICAÇÃO, MONTAGEM E DESMONTAGEM DE FORMA PARA RADIER, EM MADEIRA SERRADA, 4 UTILIZAÇÕES. AF_09/2017","M2",0.03,101.04,3.0312000000000001]
["SINAPI","COMPOSICAO",97087,"CAMADA SEPARADORA PARA EXECUÇÃO DE RADIER, EM LONA PLÁSTICA. AF_09/2017","M2",1,2.91,2.91]
["SINAPI","COMPOSICAO",97092,"ARMAÇÃO PARA EXECUÇÃO DE RADIER, COM USO DE TELA Q-196. AF_09/2017","KG",3.11,20.99,65.278899999999993]
["SINAPI","COMPOSICAO",97096,"CONCRETAGEM DE RADIER, PISO OU LAJE SOBRE SOLO, FCK 30 MPA, PARA ESPESSURA DE 10 CM - LANÇAMENTO, ADENSAMENTO E ACABAMENTO. AF_09/2017","M3",0.06,523.44000000000005,31.406400000000001]
["TOTAL",{"$nulls":6},{"$f":"SUM(H454:H460)","v":113.1468},{"$f":"SUM(I454:I460)","v":0},{"$f":"SUM(H461:I461)","v":113.1468}]
[]
["REFERÊNCIA",null,"CPUE 107","PISO PODOTÁTIL ALERTA/DIRECIONAL 40 X 40 CM","M ","COEF.","CUSTO","MATERIAL","MÃO OBRA","TOTAL"]
["SINAPI","INSUMO",36178,"PISO PODOTATIL DE CONCRETO - DIRECIONAL E ALERTA, *40 X 40 X 2,5* CM","UN   ",2.5,7.75,{"$f":"F464*G464","v":19.375}]
["SINAPI","INSUMO",370,"AREIA MÉDIA","M3",1.8499999999999999E-2,69,{"$f":"F465*G465","v":1.2765}]
["SINAPI","INSUMO",366,"AREIA FINA","M3",6.9999999999999999E-4,69,{"$f":"F466*G466","v":4.8300000000000003E-2}]
["SINAPI","INSUMO",34353,"CIMENTO COLA AC-2","KG",0.28129999999999999,1.1100000000000001,{"$f":"F467*G467","v":0.31224300000000005}]
["SINAPI","INSUMO",1379,"CIMENTO PORTLAND CP-II 32","KG",5.5904999999999996,0.7,{"$f":"F468*G468","v":3.9133499999999994}]
["SINAPI","COMPOSICAO",88309,"PEDREIRO COM ENCARGOS COMPLEMENTARES","H",0.2,22.79,null,{"$f":"G469*F469","v":4.5579999999999998}]
["SINAPI","COMPOSICAO",88316,"SERVENTE COM E NCARGOS COMPLEMENTARES","H",0.23400000000000001,18.84,null,{"$f":"G470*F470","v":4.4085600000000005}]
["TOTAL",{"$nulls":6},{"$f":"SUM(H464:H470)","v":24.925393},{"$f":"SUM(I464:I470)","v":8.9665600000000012},{"$f":"SUM(H471:I471)","v":33.891953000000001}]
[]
["REFERÊNCIA",null,"CPUE 110","CONJUNTO PLUGS MACHO/FÊMEA 2P+T 10A/250V NBR 14136 (LIGAÇÃO LUMINÁRIA)","UNID.","COEF.","CUSTO","MATERIAL","MÃO OBRA","TOTAL"]
["MERCADO","INSUMO","COT 39","PLUG MACHO E TOMADA FÊMEA 10A 25V CINZA","UN   ",1,{"$f":"'Mapa Cotacões'!H161","v":8.5299999999999994},{"$f":"F474*G474","v":8.5299999999999994}]
["SINAPI","COMPOSICAO",88247,"AUXILIAR DE ELETRICISTA COM ENCARGOS COMPLEMENTARES","H",0.25,17.79,null,{"$f":"G475*F475","v":4.4474999999999998}]
["SINAPI","COMPOSICAO",88264,"ELETRICISTA COM ENCARGOS COMPLEMENTARES","H",0.25,23.23,null,{"$f":"G476*F476","v":5.8075000000000001}]
["TOTAL",{"$nulls":6},{"$f":"SUM(H474:H476)","v":8.5299999999999994},{"$f":"SUM(I474:I476)","v":10.254999999999999},{"$f":"SUM(H477:I477)","v":18.784999999999997}]
[]
["REFERÊNCIA",null,"CPUE 111","ELETRODUTO DE AÇO GALVANIZADO, CLASSE SEMI PESADO, DN 50MM - FORNECIMENTO E INSTALAÇÃO","M","COEF.","CUSTO","MATERIAL","MÃO OBRA","TOTAL"]
["MERCADO","INSUMO","COT 54","ELETRODUTO DE AÇO GALVANIZADO, CLASSE SEMI PESADO, DN 50MM","M",1,{"$f":"'Mapa Cotacões'!H227","v":52.4},{"$f":"F480*G480","v":52.4}]
["SINAPI","COMPOSIÇÃO",95756,"LUVA DE EMENDA PARA ELETRODUTO, AÇO GALVANIZADO, DN 40 MM (1 1/2''), APARENTE, INSTALADA EM TETO - FORNECIMENTO E INSTALAÇÃO. AF_11/2016_P","UN   ",0.1701,22.15,{"$f":"F481*G481","v":3.7677149999999999}]
["SINAPI","COMPOSIÇÃO",91170,"FIXAÇÃO DE TUBOS HORIZONTAIS DE PVC, CPVC OU COBRE DIÂMETROS MENORES OU IGUAIS A 40 MM OU ELETROCALHAS ATÉ 150MM DE LARGURA, COM ABRAÇADEIRA METÁLICA RÍGIDA TIPO D 1/2, FIXADA EM PERFILADO EM LAJE. AF_05/2015","M",1,2.67,{"$f":"F482*G482","v":2.67}]
["SINAPI","COMPOSICAO",88247,"AUXILIAR DE ELETRICISTA COM ENCARGOS COMPLEMENTARES","H",0.33,17.79,null,{"$f":"G483*F483","v":5.8707000000000003}]
["SINAPI","COMPOSICAO",88264,"ELETRICISTA COM ENCARGOS COMPLEMENTARES","H",1.05,23.23,null,{"$f":"G484*F484","v":24.391500000000001}]
["TOTAL",{"$nulls":6},{"$f":"SUM(H480:H484)","v":58.837715000000003},{"$f":"SUM(I480:I484)","v":30.2622},{"$f":"SUM(H485:I485)","v":89.09991500000001}]
[]
["REFERÊNCIA",null,"CPUE 112","PEITORIL DE BASALTO EM JANELAS - FORNECIMENTO E INSTALAÇÃO","M ","COEF.","CUSTO","MATERIAL","MÃO OBRA","TOTAL"]
["SINAPI","INSUMO",34747,"PEITORIL EM MARMORE, POLIDO, BRANCO COMUM, L= *15* CM, E=  *2,0* CM, COM PINGADEIRA","M",1.04,70.14,{"$f":"F488*G488","v":72.945599999999999}]
["SINAPI","COMPOSIÇÃO",87283,"ARGAMASSA TRAÇO 1:6 (EM VOLUME DE CIMENTO E AREIA MÉDIA ÚMIDA) COM ADIÇÃO DE PLASTIFICANTE PARA EMBOÇO/MASSA ÚNICA/ASSENTAMENTO DE ALVENARIA DE VEDAÇÃO, PREPARO MECÂNICO COM BETONEIRA 400 L. AF_08/2019","M3",6.0000000000000001E-3,388.51,{"$f":"F489*G489","v":2.3310599999999999}]
["SINAPI","COMPOSIÇÃO",88274,"MARMORISTA/GRANITEIRO COM ENCARGOS COMPLEMENTARES","H",0.41899999999999998,22.66,null,{"$f":"F490*G490","v":9.4945399999999989}]
["SINAPI","COMPOSICAO",88316,"SERVENTE COM ENCARGOS COMPLEMENTARES","H",0.20899999999999999,18.84,null,{"$f":"G491*F491","v":3.9375599999999999}]
["SINAPI","COMPOSIÇÃO",91692,"SERRA CIRCULAR DE BANCADA COM MOTOR ELÉTRICO POTÊNCIA DE 5HP, COM COIFA PARA DISCO 10\" - CHP DIURNO. AF_08/2015","CHP",2.1000000000000001E-2,27.12,null,{"$f":"G492*F492","v":0.56952000000000003}]
["SINAPI","COMPOSIÇÃO",91693,"SERRA CIRCULAR DE BANCADA COM MOTOR ELÉTRICO POTÊNCIA DE 5HP, COM COIFA PARA DISCO 10\" - CHI DIURNO. AF_08/201","CHI",0.39800000000000002,25.64,null,10.20472]
["TOTAL",{"$nulls":6},{"$f":"SUM(H488:H493)","v":75.276659999999993},{"$f":"SUM(I488:I493)","v":24.206339999999997},{"$f":"SUM(H494:I494)","v":99.48299999999999}]
[]
["REFERÊNCIA",null,"CPUE 113","SOLEIRA EM BASALTO - FORNECIMENTO E INSTALAÇÃO","M ","COEF.","CUSTO","MATERIAL","MÃO OBRA","TOTAL"]
["SINAPI","INSUMO",20232,"SOLEIRA EM GRANITO, POLIDO, TIPO ANDORINHA/ QUARTZ/ CASTELO/ CORUMBA OU OUTROS EQUIVALENTES DA REGIAO, L= *15* CM, E= *2,0* CM","M",1,69.52,{"$f":"F497*G497","v":69.52}]
["SINAPI","INSUMO",37595,"ARGAMASSA COLANTE TIPO AC III","KG",1.29,1.84,{"$f":"F498*G498","v":2.3736000000000002}]
["SINAPI","COMPOSIÇÃO",88274,"MARMORISTA/GRANITEIRO COM ENCARGOS COMPLEMENTARES","H",0.54700000000000004,22.66,null,{"$f":"F499*G499","v":12.395020000000001}]
["SINAPI","COMPOSICAO",88316,"SERVENTE COM ENCARGOS COMPLEMENTARES","H",0.27300000000000002,18.84,null,{"$f":"G500*F500","v":5.1433200000000001}]
["TOTAL",{"$nulls":6},{"$f":"SUM(H497:H500)","v":71.893599999999992},{"$f":"SUM(I497:I500)","v":17.538340000000002},{"$f":"SUM(H501:I501)","v":89.431939999999997}]
[]
["REFERÊNCIA",null,"CPUE 114","PISO PORCELANATO TÉCNICO 80X80CM - FORNECIMENTO E INSTALAÇÃO","M2","COEF.","CUSTO","MATERIAL","MÃO OBRA","TOTAL"]
["SINAPI","INSUMO",34357,"REJUNTE CIMENTICIO, QUALQUER COR","KG",0.14000000000000001,3.52,{"$f":"F504*G504","v":0.49280000000000007}]
["SINAPI","INSUMO",38195,"PISO PORCELANATO, BORDA RETA, EXTRA, FORMATO MAIOR QUE 2025 CM2","M2",1.1200000000000001,92.74,{"$f":"F505*G505","v":103.86880000000001}]
["SINAPI","INSUMO",37595,"ARGAMASSA COLANTE TIPO AC III","KG",8.6199999999999992,1.84,{"$f":"F506*G506","v":15.860799999999999}]
["SINAPI","COMPOSIÇÃO",88256,"AZULEJISTA OU LADRILHISTA COM ENCARGOS COMPLEMENTARES","H",1.06,22.7,null,{"$f":"F507*G507","v":24.062000000000001}]
["SINAPI","COMPOSICAO",88316,"SERVENTE COM ENCARGOS COMPLEMENTARES","H",0.37,18.84,null,{"$f":"G508*F508","v":6.9707999999999997}]
["TOTAL",{"$nulls":6},{"$f":"SUM(H504:H508)","v":120.22240000000001},{"$f":"SUM(I504:I508)","v":31.032800000000002},{"$f":"SUM(H509:I509)","v":151.2552}]
[]
["REFERÊNCIA",null,"CPUE 115","BANCOS PARA VESTIÁRIOS","M ","COEF.","CUSTO","MATERIAL","MÃO OBRA","TOTAL"]
["MERCADO","INSUMO","COT 18","BANCOS COM ASSENTO EM MADEIRA E ESTRUTURA METÁLICA PARA VESTIÁRIOS","M ",1,{"$f":"'Mapa Cotacões'!H113","v":595},{"$f":"F512*G512","v":595}]
["SINAPI","COMPOSICAO",88316,"SERVENTE COM ENCARGOS COMPLEMENTARES","H",0.5,18.84,null,{"$f":"G513*F513","v":9.42}]
["TOTAL",{"$nulls":6},{"$f":"SUM(H512:H513)","v":595},{"$f":"SUM(I512:I513)","v":9.42},{"$f":"SUM(H514:I514)","v":604.41999999999996}]
[]
["REFERÊNCIA",null,"CPUE 116","ADMINISTRAÇÃO LOCAL","UN   ","COEF.","CUSTO","MATERIAL","MÃO OBRA","TOTAL"]
["SINAPI","COMPOSICAO",90778,"ENGENHEIRO CIVIL DE OBRA PLENO COM ENCARGOS COMPLEMENTARES","H",210,114.57,0,{"$f":"F517*G517","v":24059.699999999997}]
["SINAPI","COMPOSICAO",94295,"MESTRE DE OBRAS COM ENCARGOS COMPLEMENTARES","MÊS",5,12685.11,0,63425.55]
["SINAPI","COMPOSICAO",100309,"TÉCNICO DE SEGURANÇA DO TRABALHO COM ENCARGOS COMPLEMENTARES","H",210,35.85,0,7528.5]
["CPUE","COMPOSICAO",31,"ART's","UN   ",2,233.5,0,{"$f":"F520*G520","v":467}]
["TOTAL",{"$nulls":6},{"$f":"SUM(H517:H520)","v":0},{"$f":"SUM(I517:I520)","v":95480.75},{"$f":"SUM(H521:I521)","v":95480.75}]
[]
["REFERÊNCIA",null,"CPUE 117","BARRA DE APOIO RETA, EM AÇO INOX POLIDO, COMPRIMENTO 40CM, FIXADO NA PAREDE - FORNECIMENTO E INSTALAÇÃO.","UN   ","COEF.","CUSTO","MATERIAL","MÃO OBRA","TOTAL"]
["MERCADO","INSUMO","COT 62","BARRA DE APOIO RETA, EM AÇO INOX POLIDO, COMPRIMENTO 40CM.","UN   ",1,{"$f":"'Mapa Cotacões'!H239","v":159.72},{"$f":"F524*G524","v":159.72}]
["SINAPI","INSUMO",4351,"PARAFUSO NIQUELADO 3 1/2\" COM ACABAMENTO CROMADO PARA FIXAR PECA SANITARIA, INCLUI PORCA CEGA, ARRUELA E BUCHA DE NYLON TAMANHO S-8","UN   ",6,17.329999999999998,{"$f":"F525*G525","v":103.97999999999999}]
["SINAPI","COMPOSICAO",88267,"ENCANADOR OU BOMBEIRO HIDRÁULICO COM ENCARGOS COMPLEMENTARES","H",0.94850000000000001,22.36,0,{"$f":"F526*G526","v":21.208459999999999}]
["SINAPI","COMPOSICAO",88316,"SERVENTE COM ENCARGOS COMPLEMENTARES","H",0.29880000000000001,18.84,0,{"$f":"F527*G527","v":5.6293920000000002}]
["TOTAL",{"$nulls":6},{"$f":"SUM(H524:H527)","v":263.7},{"$f":"SUM(I524:I527)","v":26.837851999999998},{"$f":"SUM(H528:I528)","v":290.53785199999999}]
[]
["REFERÊNCIA",null,"CPUE 119","IMPERMEABILIZAÇÃODE SUPERFÍCIE COM EMULSÃO ASFÁLTICA, DUAS CAMADAS, COM APLICAÇÃO DE VÉU DE POLIÉSTER","UN   ","COEF.","CUSTO","MATERIAL","MÃO OBRA","TOTAL"]
["SINAPI","COMPOSICAO",98557,"IMPERMEABILIZAÇÃO DE SUPERFÍCIE COM EMULSÃO ASFÁLTICA, 2 DEMÃOS AF_06/2018","UN   ",1,43.47,0,{"$f":"F531*G531","v":43.47}]
["SINAPI","COMPOSICAO",98558,"TRATAMENTO DE RALO OU PONTO EMERGENTE COM ARGAMASSA POLIMÉRICA / MEMBRANA ACRÍLICA REFORÇADO COM VÉU DE POLIÉSTER (MAV). AF_06/2018","UN   ",1,6.91,0,{"$f":"F532*G532","v":6.91}]
["TOTAL",{"$nulls":6},{"$f":"SUM(H531:H532)","v":0},{"$f":"SUM(I531:I532)","v":50.379999999999995},{"$f":"SUM(H533:I533)","v":50.379999999999995}]
[]
[]
["REFERÊNCIA",null,"CPUE 118","Conjunto de bombas para hidrantes","UN   ","COEF.","CUSTO","MATERIAL","MÃO OBRA","TOTAL"]
["MERCADO","INSUMO","COT 71","Conjunto de bombas para hidrantes","UN   ",1,{"$f":"'Mapa Cotacões'!H289","v":20545},0,{"$f":"F537*G537","v":20545}]
["SINAPI","COMPOSICAO",88267,"ENCANADOR OU BOMBEIRO HIDRÁULICO COM ENCARGOS COMPLEMENTARES","H",0.94850000000000001,22.36,0,{"$f":"F538*G538","v":21.208459999999999}]
["SINAPI","COMPOSICAO",88316,"SERVENTE COM ENCARGOS COMPLEMENTARES","H",0.29880000000000001,18.84,0,{"$f":"F539*G539","v":5.6293920000000002}]
["TOTAL",{"$nulls":6},{"$f":"SUM(H537:H539)","v":0},{"$f":"SUM(I537:I539)","v":20571.837852000001},{"$f":"SUM(H540:I540)","v":20571.837852000001}]

{"sheet":"Mapa Cotacões","index":6,"n_rows":306,"n_cols":8,"rows_kept":306,"cut":false,"hidden":false,"merged":[[71,5,71,6],[72,5,72,6],[73,5,73,6],[85,5,85,6],[86,5,86,6],[87,5,87,6],[88,5,88,6],[74,5,74,6],[76,2,76,5],[77,2,77,5],[78,5,78,6],[79,5,79,6],[80,5,80,6],[81,5,81,6],[83,2,83,5],[84,2,84,5],[60,5,60,6],[62,2,62,5],[63,2,63,5],[64,5,64,6],[65,5,65,6],[66,5,66,6],[67,5,67,6],[69,2,69,5],[70,2,70,5],[300,2,300,5],[301,2,301,5],[302,5,302,6],[303,5,303,6],[304,5,304,6],[305,5,305,6],[10,5,10,6],[11,5,11,6],[13,2,13,5],[14,2,14,5],[15,5,15,6],[18,5,18,6],[20,2,20,5],[21,2,21,5],[22,5,22,6],[23,5,23,6],[24,5,24,6],[25,5,25,6],[27,2,27,5],[28,2,28,5],[29,5,29,6],[30,5,30,6],[31,5,31,6],[32,5,32,6],[298,5,298,6],[287,2,287,5],[288,2,288,5],[289,5,289,6],[290,5,290,6],[291,5,291,6],[285,5,285,6],[277,5,277,6],[278,5,278,6],[293,2,293,5],[294,2,294,5],[295,5,295,6],[296,5,296,6],[297,5,297,6],[275,2,275,5],[276,5,276,6],[280,2,280,5],[281,2,281,5],[282,5,282,6],[283,5,283,6],[284,5,284,6],[265,5,265,6],[266,5,266,6],[268,2,268,5],[269,2,269,5],[270,5,270,6],[271,5,271,6],[272,5,272,6],[274,2,274,5],[260,5,260,6],[252,5,252,6],[251,2,251,5],[250,2,250,5],[262,2,262,5],[263,2,263,5],[264,5,264,6],[247,5,247,6],[248,5,248,6],[253,5,253,6],[254,5,254,6],[256,2,256,5],[257,2,257,5],[258,5,258,6],[259,5,259,6],[245,2,245,5],[237,2,237,5],[238,2,238,5],[239,5,239,6],[240,5,240,6],[241,5,241,6],[242,5,242,6],[246,5,246,6],[234,5,234,6],[235,5,235,6],[228,5,228,6],[231,2,231,5],[232,2,232,5],[233,5,233,6],[244,2,244,5],[222,5,222,6],[223,5,223,6],[225,2,225,5],[226,2,226,5],[227,5,227,6],[229,5,229,6],[220,5,220,6],[221,5,221,6],[211,2,211,5],[212,2,212,5],[213,5,213,6],[214,5,214,6],[215,5,215,6],[216,5,216,6],[218,2,218,5],[219,2,219,5],[206,2,206,5],[207,5,207,6],[208,5,208,6],[209,5,209,6],[201,5,201,6],[202,5,202,6],[203,5,203,6],[205,2,205,5],[196,5,196,6],[197,5,197,6],[199,2,199,5],[200,2,200,5],[189,5,189,6],[190,5,190,6],[191,5,191,6],[193,2,193,5],[194,2,194,5],[195,5,195,6],[183,5,183,6],[184,5,184,6],[186,2,186,5],[187,2,187,5],[188,5,188,6],[177,5,177,6],[179,2,179,5],[180,2,180,5],[181,5,181,6],[182,5,182,6],[172,2,172,5],[173,2,173,5],[174,5,174,6],[175,5,175,6],[176,5,176,6],[167,2,167,5],[168,5,168,6],[169,5,169,6],[170,5,170,6],[154,5,154,6],[155,5,155,6],[156,5,156,6],[157,5,157,6],[166,2,166,5],[163,5,163,6],[164,5,164,6],[148,5,148,6],[149,5,149,6],[150,5,150,6],[152,2,152,5],[153,2,153,5],[159,2,159,5],[160,2,160,5],[161,5,161,6],[162,5,162,6],[142,5,142,6],[143,5,143,6],[145,2,145,5],[146,2,146,5],[147,5,147,6],[136,5,136,6],[137,5,137,6],[139,2,139,5],[140,2,140,5],[141,5,141,6],[132,2,132,5],[133,2,133,5],[134,5,134,6],[135,5,135,6],[125,2,125,5],[126,2,126,5],[127,5,127,6],[128,5,128,6],[129,5,129,6],[121,5,121,6],[122,5,122,6],[123,5,123,6],[113,5,113,6],[114,5,114,6],[115,5,115,6],[116,5,116,6],[118,2,118,5],[130,5,130,6],[112,2,112,5],[100,5,100,6],[101,5,101,6],[102,5,102,6],[104,2,104,5],[105,2,105,5],[106,5,106,6],[119,2,119,5],[120,5,120,6],[107,5,107,6],[108,5,108,6],[109,5,109,6],[34,2,34,5],[35,2,35,5],[36,5,36,6],[37,5,37,6],[38,5,38,6],[39,5,39,6],[41,2,41,5],[42,2,42,5],[111,2,111,5],[43,5,43,6],[44,5,44,6],[45,5,45,6],[46,5,46,6],[48,2,48,5],[49,2,49,5],[50,5,50,6],[51,5,51,6],[52,5,52,6],[53,5,53,6],[55,2,55,5],[56,2,56,5],[57,5,57,6],[58,5,58,6],[59,5,59,6],[94,5,94,6],[95,5,95,6],[97,2,97,5],[98,2,98,5],[99,5,99,6],[90,2,90,5],[91,2,91,5],[92,5,92,6],[93,5,93,6],[4,1,4,7],[1,1,2,1],[1,2,2,7],[6,2,6,5],[7,2,7,5],[8,5,8,6],[9,5,9,6],[16,5,16,6],[17,5,17,6]]}
[]
[null,"OBRA :","Reforma da edificação do Ginásio Municipal Osmar Fortes Barcellos (Ginásio Tesourinha)"]
[]
[]
[null,"MAPA COTAÇÕES"]
[]
[null,"CÓDIGO","DESCRIÇÃO",null,null,null,"UNIDADE","VALOR MEDIANO"]
[null,"COT 01","EA01 (80X70)",null,null,null,"PÇ",{"$f":"MEDIAN(H10:H12)","v":961}]
[null,"DATA COTAÇÃO","FORNECEDOR","CNPJ","CONTATO","TELEFONE",null,"COTAÇÕES"]
[null,"2022-03-15","INOVA VIDROS","35.896.856.0001-71","CONTATO@INOVAVIDROS.COM.BR","(51) 39336900",null,961]
[null,"2022-03-15","SERRALHEIRA HÍPICA","29.432.935/0001-29",null,"(51) 32464777",null,1350]
[null,"2022-03-15","TRIAL","20.063.653/0001-27","TRIAL@TRIALESQUADRIAS.COM","(48) 3632-4038",null,582]
[]
[null,"CÓDIGO","DESCRIÇÃO",null,null,null,"UNIDADE","VALOR MEDIANO"]
[null,"COT 01","EA03 (130X70)",null,null,null,"PÇ",{"$f":"MEDIAN(H17:H19)","v":1750}]
[null,"DATA COTAÇÃO","FORNECEDOR","CNPJ","CONTATO","TELEFONE",null,"COTAÇÕES"]
[null,"2022-03-15","INOVA VIDROS","35.896.856.0001-71","CONTATO@INOVAVIDROS.COM.BR","(51) 39336900",null,2113]
[null,"2022-03-15","SERRALHEIRA HÍPICA","29.432.935/0001-29",null,"(51) 32464777",null,1750]
[null,"2022-03-15","TRIAL","20.063.653/0001-27","TRIAL@TRIALESQUADRIAS.COM","(48) 3632-4038",null,1440.96]
[]
[null,"CÓDIGO","DESCRIÇÃO",null,null,null,"UNIDADE","VALOR MEDIANO"]
[null,"COT 01","EA04 (190X70)",null,null,null,"PÇ",{"$f":"MEDIAN(H24:H26)","v":2550}]
[null,"DATA COTAÇÃO","FORNECEDOR","CNPJ","CONTATO","TELEFONE",null,"COTAÇÕES"]
[null,"2022-03-15","INOVA VIDROS","35.896.856.0001-71","CONTATO@INOVAVIDROS.COM.BR","(51) 39336900",null,2810]
[null,"2022-03-15","SERRALHEIRA HÍPICA","29.432.935/0001-29",null,"(51) 32464777",null,2550]
[null,"2022-03-15","TRIAL","20.063.653/0001-27","TRIAL@TRIALESQUADRIAS.COM","(48) 3632-4038",null,1729.41]
[]
[null,"CÓDIGO","DESCRIÇÃO",null,null,null,"UNIDADE","VALOR MEDIANO"]
[null,"COT 01","EA05 (200X70)",null,null,null,"PÇ",{"$f":"MEDIAN(H31:H33)","v":2700}]
[null,"DATA COTAÇÃO","FORNECEDOR","CNPJ","CONTATO","TELEFONE",null,"COTAÇÕES"]
[null,"2022-03-15","INOVA VIDROS","35.896.856.0001-71","CONTATO@INOVAVIDROS.COM.BR","(51) 39336900",null,3225]
[null,"2022-03-15","SERRALHEIRA HÍPICA","29.432.935/0001-29",null,"(51) 32464777",null,2700]
[null,"2022-03-15","TRIAL","20.063.653/0001-27","TRIAL@TRIALESQUADRIAS.COM","(48) 3632-4038",null,1638.58]
[]
[null,"CÓDIGO","DESCRIÇÃO",null,null,null,"UNIDADE","VALOR MEDIANO"]
[null,"COT 01","EA09 (280X70)",null,null,null,"PÇ",{"$f":"MEDIAN(H38:H40)","v":4400}]
[null,"DATA COTAÇÃO","FORNECEDOR","CNPJ","CONTATO","TELEFONE",null,"COTAÇÕES"]
[null,"2022-03-15","INOVA VIDROS","35.896.856.0001-71","CONTATO@INOVAVIDROS.COM.BR","(51) 39336900",null,5551]
[null,"2022-03-15","SERRALHEIRA HÍPICA","29.432.935/0001-29",null,"(51) 32464777",null,4400]
[null,"2022-03-15","TRIAL","20.063.653/0001-27","TRIAL@TRIALESQUADRIAS.COM","(48) 3632-4038",null,2400.44]
[]
[null,"CÓDIGO","DESCRIÇÃO",null,null,null,"UNIDADE","VALOR MEDIANO"]
[null,"COT 01","EA11 (440X70)",null,null,null,"PÇ",{"$f":"MEDIAN(H45:H47)","v":4800}]
[null,"DATA COTAÇÃO","FORNECEDOR","CNPJ","CONTATO","TELEFONE",null,"COTAÇÕES"]
[null,"2022-03-15","INOVA VIDROS","35.896.856.0001-71","CONTATO@INOVAVIDROS.COM.BR","(51) 39336900",null,6384]
[null,"2022-03-15","SERRALHEIRA HÍPICA","29.432.935/0001-29",null,"(51) 32464777",null,4800]
[null,"2022-03-15","TRIAL","20.063.653/0001-27","TRIAL@TRIALESQUADRIAS.COM","(48) 3632-4038",null,2650.16]
[]
[null,"CÓDIGO","DESCRIÇÃO",null,null,null,"UNIDADE","VALOR MEDIANO"]
[null,"COT 01","EA12 (440X170)",null,null,null,"PÇ",{"$f":"MEDIAN(H52:H54)","v":9300}]
[null,"DATA COTAÇÃO","FORNECEDOR","CNPJ","CONTATO","TELEFONE",null,"COTAÇÕES"]
[null,"2022-03-15","INOVA VIDROS","35.896.856.0001-71","CONTATO@INOVAVIDROS.COM.BR","(51) 39336900",null,13204]
[null,"2022-03-15","SERRALHEIRA HÍPICA","29.432.935/0001-29",null,"(51) 32464777",null,9300]
[null,"2022-03-15","TRIAL","20.063.653/0001-27","TRIAL@TRIALESQUADRIAS.COM","(48) 3632-4038",null,8059.04]
[]
[null,"CÓDIGO","DESCRIÇÃO",null,null,null,"UNIDADE","VALOR MEDIANO"]
[null,"COT 01","EA13 (420X70)",null,null,null,"PÇ",{"$f":"MEDIAN(H59:H61)","v":4950}]
[null,"DATA COTAÇÃO","FORNECEDOR","CNPJ","CONTATO","TELEFONE",null,"COTAÇÕES"]
[null,"2022-03-15","INOVA VIDROS","35.896.856.0001-71","CONTATO@INOVAVIDROS.COM.BR","(51) 39336900",null,6318]
[null,"2022-03-15","SERRALHEIRA HÍPICA","29.432.935/0001-29",null,"(51) 32464777",null,4950]
[null,"2022-03-15","TRIAL","20.063.653/0001-27","TRIAL@TRIALESQUADRIAS.COM","(48) 3632-4038",null,4090.88]
[]
[null,"CÓDIGO","DESCRIÇÃO",null,null,null,"UNIDADE","VALOR MEDIANO"]
[null,"COT 01","EA15 (500X70)",null,null,null,"PÇ",{"$f":"MEDIAN(H66:H68)","v":4565.74}]
[null,"DATA COTAÇÃO","FORNECEDOR","CNPJ","CONTATO","TELEFONE",null,"COTAÇÕES"]
[null,"2022-03-15","INOVA VIDROS","35.896.856.0001-71","CONTATO@INOVAVIDROS.COM.BR","(51) 39336900",null,4015]
[null,"2022-03-15","SERRALHEIRA HÍPICA","29.432.935/0001-29",null,"(51) 32464777",null,7150]
[null,"2022-03-15","TRIAL","20.063.653/0001-27","TRIAL@TRIALESQUADRIAS.COM","(48) 3632-4038",null,4565.74]
[]
[null,"CÓDIGO","DESCRIÇÃO",null,null,null,"UNIDADE","VALOR MEDIANO"]
[null,"COT 01","EA15 (500X70)",null,null,null,"PÇ",{"$f":"MEDIAN(H73:H75)","v":4565.74}]
[null,"DATA COTAÇÃO","FORNECEDOR","CNPJ","CONTATO","TELEFONE",null,"COTAÇÕES"]
[null,"2022-03-15","INOVA VIDROS","35.896.856.0001-71","CONTATO@INOVAVIDROS.COM.BR","(51) 39336900",null,4015]
[null,"2022-03-15","SERRALHEIRA HÍPICA","29.432.935/0001-29",null,"(51) 32464777",null,7150]
[null,"2022-03-15","TRIAL","20.063.653/0001-27","TRIAL@TRIALESQUADRIAS.COM","(48) 3632-4038",null,4565.74]
[]
[null,"CÓDIGO","DESCRIÇÃO",null,null,null,"UNIDADE","VALOR MEDIANO"]
[null,"COT 01","EA16 (520X170)",null,null,null,"PÇ",{"$f":"MEDIAN(H80:H82)","v":13234}]
[null,"DATA COTAÇÃO","FORNECEDOR","CNPJ","CONTATO","TELEFONE",null,"COTAÇÕES"]
[null,"2022-03-15","INOVA VIDROS","35.896.856.0001-71","CONTATO@INOVAVIDROS.COM.BR","(51) 39336900",null,13234]
[null,"2022-03-15","SERRALHEIRA HÍPICA","29.432.935/0001-29",null,"(51) 32464777",null,15000]
[null,"2022-03-15","TRIAL","20.063.653/0001-27","TRIAL@TRIALESQUADRIAS.COM","(48) 3632-4038",null,9601.91]
[]
[null,"CÓDIGO","DESCRIÇÃO",null,null,null,"UNIDADE","VALOR MEDIANO"]
[null,"COT 01","EA18 (480X350)",null,null,null,"PÇ",{"$f":"MEDIAN(H87:H89)","v":20800}]
[null,"DATA COTAÇÃO","FORNECEDOR","CNPJ","CONTATO","TELEFONE",null,"COTAÇÕES"]
[null,"2022-03-15","INOVA VIDROS","35.896.856.0001-71","CONTATO@INOVAVIDROS.COM.BR","(51) 39336900",null,12799]
[null,"2022-03-15","SERRALHEIRA HÍPICA","29.432.935/0001-29",null,"(51) 32464777",null,20800]
[null,"2022-03-15","TRIAL","20.063.653/0001-27","TRIAL@TRIALESQUADRIAS.COM","(48) 3632-4038",null,31687.55]
[]
[null,"CÓDIGO","DESCRIÇÃO",null,null,null,"UNIDADE","VALOR MEDIANO"]
[null,"COT 08","ACIONADOR MANUAL",null,null,null,"PÇ",{"$f":"MEDIAN(H94:H96)","v":55.66}]
[null,"DATA COTAÇÃO","FORNECEDOR","CNPJ","CONTATO","TELEFONE",null,"COTAÇÕES"]
[null,"2022-03-15","MEGATHOR","24214444/0001-98","VENDAS@MEGATHOR.COM.BR","(51)35008248",null,30]
[null,"2022-03-15","NET ALARMES","20544487/0001-80","SAC@NETALARMES.COM.BR","(43)91794927",null,55.66]
[null,"2022-03-15","VIEW TECH","07327325/0001-22","VENDAS@VIEWTECH.COM.BR","INTERNET",null,63.2]
[]
[null,"CÓDIGO","DESCRIÇÃO",null,null,null,"UNIDADE","VALOR MEDIANO"]
[null,"COT 13","REGULADOR DE PRESSÃO COM VÁLVULA DE SEGURANÇA",null,null,null,"PÇ",{"$f":"MEDIAN(H101:H103)","v":171.4}]
[null,"DATA COTAÇÃO","FORNECEDOR","CNPJ","CONTATO","TELEFONE",null,"COTAÇÕES"]
[null,"2022-03-15","ALIANÇA","61.143.632/0001-07","LETICIA.DIAS@ALIANCAMETALURGICA.COM.BR","(11)29011500",null,255.33]
[null,"2022-03-15","MAGAZINE LUIZA","INTERNET","MAGAZINELUIZA.COM.BR","INTERNET",null,160]
[null,"2022-03-15"," EMBRAR","INTERNET","EMBRAR.COM.BR","(54)32124466",null,171.4]
[]
[null,"CÓDIGO","DESCRIÇÃO",null,null,null,"UNIDADE","VALOR MEDIANO"]
[null,"COT 14","MANÔMETRO MEDIDOR",null,null,null,"PÇ",{"$f":"MEDIAN(H108:H110)","v":115}]
[null,"DATA COTAÇÃO","FORNECEDOR","CNPJ","CONTATO","TELEFONE",null,"COTAÇÕES"]
[null,"2022-03-15","MEDITEC","INTERNET","VANESSA@MEDITEC.COM.BR","(11)937470654",null,111.72]
[null,"2022-03-15","RUCKEN","17080642/0001-40","VENDAS1@RUCKEN.COM.BR","(11)20619000",null,130]
[null,"2022-03-15","CASA DOS MANÔMETROS","30740763/0001-30","CONTATO@CASADOSMANOMETROS.COM.BR","(51)33424479",null,115]
[]
[null,"CÓDIGO","DESCRIÇÃO",null,null,null,"UNIDADE","VALOR MEDIANO"]
[null,"COT 018","BANCOS PARA VESTIÁRIOS",null,null,null,"M",{"$f":"MEDIAN(H115:H117)","v":595}]
[null,"DATA COTAÇÃO","FORNECEDOR","CNPJ","CONTATO","TELEFONE",null,"COTAÇÕES"]
[null,"2022-03-15","MAX SHOP"," 27391453/0001-42 ","ATENDIMENTO@MAXSHOP.COM.BR","(11)35228530",null,595]
[null,"2022-03-15","MAGAZINE LUIZA","INTERNET","MAGAZINELUIZA.COM.BR","INTERNET",null,{"$f":"799/2","v":399.5}]
[null,"2022-03-15","MADEIRA MADEIRA","10490181/0001-35","CONTATO@MADEIRAMADEIRA.COM.BR","INTERNET",null,724.94]
[]
[null,"CÓDIGO","DESCRIÇÃO",null,null,null,"UNIDADE","VALOR MEDIANO"]
[null,"COT 019","BATEDOR DE AÇO POLIDO-CHAPA PARA PROTEÇÃO DE PORTA",null,null,null,"UN ",{"$f":"MEDIAN(H122:H124)","v":289}]
[null,"DATA COTAÇÃO","FORNECEDOR","CNPJ","CONTATO","TELEFONE",null,"COTAÇÕES"]
[null,"2022-03-15","BARRA CERTA","51964039/0001-60","ATENDIMENTO@BARRACERTA.COM.BR","(11)20395990",null,326.7]
[null,"2022-03-15","AMERICANAS","INTERNET","AMERICANAS.COM.BR","INTERNET",null,171]
[null,"2022-03-15","PHD BARRAS","INTERNET","PHDBARRAS@GMAIL.COM","(11)32591899",null,289]
[]
[null,"CÓDIGO","DESCRIÇÃO",null,null,null,"UNIDADE","VALOR MEDIANO"]
[null,"C0T 020","CALDEIRA MURAL GLP POTÊNCIA NOMINAL 69,0 KW,VAZÃO 42,5 L/MIN COM CHAMINÉ INCLUSA",null,null,null,"UN ",{"$f":"MEDIAN(H129:H131)","v":10708.96}]
[null,"DATA COTAÇÃO","FORNECEDOR","CNPJ","CONTATO","TELEFONE",null,"COTAÇÕES"]
[null,"2022-03-15","AMERICANAS","33014556/0001-96","AMERICANAS.COM.BR",40034848,null,9638.06]
[null,"2022-03-15","LEROY MERLIN","INTERNET","LEROYMERLIN.COM.BR","INTERNET",null,11730.61]
[null,"2022-03-15","MAGAZINE LUIZA ","47.960.950/1088-36","MAGAZINELUIZA.COM.BR","INTERNET",null,10708.96]
[]
[null,"CÓDIGO","DESCRIÇÃO",null,null,null,"UNIDADE","VALOR MEDIANO"]
[null,"COT 021","RESERVATÓRIO DE ÁGUA QUENTE 300L",null,null,null,"UN",{"$f":"MEDIAN(H136:H138)","v":2280}]
[null,"DATA COTAÇÃO","FORNECEDOR","CNPJ","CONTATO","TELEFONE",null,"COTAÇÕES"]
[null,"2022-03-15","PATROSOL","30656408/0001-87","COMERCIAL@PATROSOL.COM.BR","(11)41303204",null,2199]
[null,"2022-03-15","UBERSOL","14235798/0001-65","VENDAS@UBERSOLAQUECEDORES.COM.BR","(54)33162324",null,2280]
[null,"2021-05-14","ENERGY SHOP","22219118/0001-48","VENDAS@ENERGYSHOP.COM.BR","(48)32075868",null,2799]
[]
[null,"CÓDIGO","DESCRIÇÃO",null,null,null,"UNIDADE","VALOR MEDIANO"]
[null,"COT 028","ELEVATÓRIA ARTICULADA",null,null,null,"UN",{"$f":"MIN(H143:H144)","v":9170}]
[null,"DATA COTAÇÃO","FORNECEDOR","CNPJ","CONTATO","TELEFONE",null,"COTAÇÕES"]
[null,"2022-03-15","JK7 PLATAFORMAS","INTERNET","JK7PLATAFORMAS@GMAIL","(51)991436425",null,9170]
[null,"2022-03-15","BRAS RENTAL","16.864.907/0001-39,","CONTATO@BRASRENTAL.COM","(51)31113950",null,10350]
[]
[null,"CÓDIGO","DESCRIÇÃO",null,null,null,"UNIDADE","VALOR MEDIANO"]
[null,"COT 032","CARRETEL MANUAL PARA 30M",null,null,null,"UN ",{"$f":"MEDIAN(H149:H151)","v":2316}]
[null,"DATA COTAÇÃO","FORNECEDOR","CNPJ","CONTATO","TELEFONE",null,"COTAÇÕES"]
[null,"2022-03-15","PANITZ","07.867.920/0001-50","VENDAS1@PANITZ.COM.BR","(51)993897131",null,5015]
[null,"2022-03-15","SEU POSTO.COM","20.883537/0001-54","INTERNET","(11)28219005",null,1227.24]
[null,"2022-03-15","LUBMIX","16.823397/0001-51","VENDAS6@LUBMIX.COM.BR","(17)35255110",null,2316]
[]
[null,"CÓDIGO","DESCRIÇÃO",null,null,null,"UNIDADE","VALOR MEDIANO"]
[null,"C0T 033","MANGOTINHO 25MM COM 30M",null,null,null,"UN ",{"$f":"MIN(H156:H158)","v":639}]
[null,"DATA COTAÇÃO","FORNECEDOR","CNPJ","CONTATO","TELEFONE",null,"COTAÇÕES"]
[null,"2022-03-15","QUALITY TUBOS ","11818296/0001-79","VENAS@QUALITYTUBOS.COM.BR","(11)31070000",null,639]
[null,"2022-03-15","PANITZ","07.867.920/0001-50","VENDAS1@PANITZ.COM.BR","(51)993897131",null,980]
[null,"2022-03-15","PVA","72218043/0001-59","PVA@PVA.COM.BR","(54)34531615",null,765.89]
[]
[null,"CÓDIGO","DESCRIÇÃO",null,null,null,"UNIDADE","VALOR MEDIANO"]
[null,"COT 039","CONJUNTO PLUGUE MACHO E FEMEA 2P+T 10A/ 250V",null,null,null,"CJ",{"$f":"MEDIAN(H163:H165)","v":8.5299999999999994}]
[null,"DATA COTAÇÃO","FORNECEDOR","CNPJ","CONTATO","TELEFONE",null,"COTAÇÕES"]
[null,"2022-03-15","PLENOBRAS","72.313.828/0001-00","COMERCIAL@PLENOBRAS.COM.BR","(51) 2101-6800",null,8.5299999999999994]
[null,"2022-03-15","ABT","00.212.675/0001-02","VENDAS@ABTELETRICA.COM.BR","(51) 3300-3830",null,7.24]
[null,"2022-03-15","FAME","60.620.366/0001-95","construtoras@fame.com.br","(11) 3478-5660",null,9.1300000000000008]
[]
[null,"CÓDIGO","DESCRIÇÃO",null,null,null,"UNIDADE","VALOR MEDIANO"]
[null,"C0T 040","QUADRO GERAL DE BAIXA TENSÃO - QGBT",null,null,null,"UN ",{"$f":"MIN(H170:H171)","v":26900}]
[null,"DATA COTAÇÃO","FORNECEDOR","CNPJ","CONTATO","TELEFONE",null,"COTAÇÕES"]
[null,"2022-03-15","HDS","25.328.278/0001-13","VOLNEI@HDSAUTOMACAO.COM.BR","(51) 31182170",null,28729.93]
[null,"2022-03-15","INSELETRO","02.598.479/0001-35","INSELETRO@INSELETRO.COM.BR","(51) 33641922",null,26900]
[]
[null,"CÓDIGO","DESCRIÇÃO",null,null,null,"UNIDADE","VALOR MEDIANO"]
[null,"C0T 042","TERMINAÇÃO CONTRÁTIL",null,null,null,"UN ",{"$f":"MEDIAN(H178)","v":253.76}]
[null,"DATA COTAÇÃO","FORNECEDOR","CNPJ","CONTATO","TELEFONE",null,"COTAÇÕES"]
[null,"2022-03-15","ELETROTRAFO","80.224.785/0001-15","FALECONOSCO@ELETROTRAFO.COM.BR","(43)35205000",null,249.08]
[null,"2022-03-15","TEKY","22.193.309/0001-88","CONTATO@TEKY.COM.BR","(51)40422076",null,456.88]
[null,"2022-03-15","DIMENSIONAL","06.913.480/0015-63.","INTERNET","(19)991501751",null,253.76]
[]
[null,"CÓDIGO","DESCRIÇÃO",null,null,null,"UNIDADE","VALOR MEDIANO"]
[null,"C0T 043","TERMINAL CONTRÁTIL INTERNO",null,null,null,"UN ",{"$f":"MEDIAN(H183:H185)","v":253.55}]
[null,"DATA COTAÇÃO","FORNECEDOR","CNPJ","CONTATO","TELEFONE",null,"COTAÇÕES"]
[null,"2022-03-15","ELETROTRAFO","80.224.785/0001-15","FALECONOSCO@ELETROTRAFO.COM.BR","(43)35205000",null,443.12]
[null,"2022-03-15","TEKY","22193309/0001-88","CONTATO@TEKY.COM.BR","(51)40422076",null,253.55]
[null,"2022-03-15","DIMENSIONAL","06.913.480/0015-63","INTERNET","(19)991501751",null,228.38]
[]
[null,"CÓDIGO","DESCRIÇÃO",null,null,null,"UNIDADE","VALOR MEDIANO"]
[null,"COT 044","MANOPLA PARA COMANDO CHAVE SECCIONADORA",null,null,null,"PÇ",{"$f":"MEDIAN(H190:H192)","v":289.99}]
[null,"DATA COTAÇÃO","FORNECEDOR","CNPJ","CONTATO","TELEFONE"]
[null,"2022-03-15","ELETROTRAFO","80224785/0001-15","FALECONOSCO@ELETROTRAFO.COM.BR","(43)35205000",null,249.08]
[null,"2022-03-15","AMERICANAS","00.776574/0006-60","INTERNET","INTERNET",null,289.99]
[null,"2022-03-15","MAGAZINE LUIZA","_","INTERNET","INTERNET",null,453.95]
[]
[null,"CÓDIGO","DESCRIÇÃO",null,null,null,"UNIDADE","VALOR MEDIANO"]
[null,"COT 045","SECCIONADORA TRIPOLAR SECA 15KV-400A-TSI 95KV-COMANDO POR PUNHO C/FUSÍVEL",null,null,null,"PÇ",{"$f":"MEDIAN(H197:H198)","v":2560.4849999999997}]
[null,"DATA COTAÇÃO","FORNECEDOR","CNPJ","CONTATO","TELEFONE",null,"COTAÇÕES"]
[null,"2022-03-15","TEKY","22193309/0001-88","CONTATO@TEKY.COM.BR","(51)40422076",null,1530.97]
[null,"2022-03-15","ESK REPRESENTAÇÕES","88.245.477/0001-88","ricardo@esk.com.br","(51) 3223-1788",null,3590]
[]
[null,"CÓDIGO","DESCRIÇÃO",null,null,null,"UNIDADE","VALOR MEDIANO"]
[null,"COT 046","SECCIONADORA TRIPOLAR SECA 15KV-400A-TSI 95KV-COMANDO POR PUNHO S/FUSÍVEL",null,null,null,"PÇ",1053.75]
[null,"DATA COTAÇÃO","FORNECEDOR","CNPJ","CONTATO","TELEFONE",null,"COTAÇÕES"]
[null,"2022-03-15","TEKY","22193309/0001-88","CONTATO@TEKY.COM.BR","(51)40422076",null,1450.12]
[null,"2022-03-15","ESK REPRESENTAÇÕES","88.245.477/0001-88","ricardo@esk.com.br","(51) 3223-1788",null,2180]
[]
[null,"CÓDIGO","DESCRIÇÃO",null,null,null,"UNIDADE","VALOR MEDIANO"]
[null,"COT 047","CD 01 SETOR 01",null,null,null,"M",{"$f":"MIN(H209:H210)","v":5313.12}]
[null,"DATA COTAÇÃO","FORNECEDOR","CNPJ","CONTATO","TELEFONE",null,"COTAÇÕES"]
[null,"2022-03-15","HDS","25.328.278/0001-13","VOLNEI@HDSAUTOMACAO.COM.BR","(51) 31182170",null,5313.12]
[null,"2022-03-15","INSELETRO","02.598.479/0001-35","INSELETRO@INSELETRO.COM.BR","(51) 33641922",null,6480]
[]
[null,"CÓDIGO","DESCRIÇÃO",null,null,null,"UNIDADE","VALOR MEDIANO"]
[null,"COT 052 ","BLOCO AUTONOMO DE EMERGENCIA C/2 FAROLETES 32 LEDS",null,null,null,"UN",{"$f":"MEDIAN(H215:H217)","v":191.6}]
[null,"DATA COTAÇÃO","FORNECEDOR","CNPJ","CONTATO","TELEFONE",null,"COTAÇÕES"]
[null,"2022-03-15","MAGAZINE LUIZA","-","INTERNET","_",null,186.23]
[null,"2022-03-15","LEROY MERLIN","-","INTERNET","_",null,254.9]
[null,"2022-03-15","AMERICANAS","00.776574/0006-60","ATENDIMENTO.ACOM@AMERICANAS.COM","INTERNET",null,191.6]
[]
[null,"CÓDIGO","DESCRIÇÃO",null,null,null,"UNIDADE","VALOR MEDIANO"]
[null,"COT 053","BLOCO AUTONOMO DE EMERGENCIA 500 LUMENS 80 LEDS",null,null,null,"UN",{"$f":"MEDIAN(H222:H224)","v":109.9}]
[null,"DATA COTAÇÃO","FORNECEDOR","CNPJ","CONTATO","TELEFONE",null,"COTAÇÕES"]
[null,"2022-03-15","AMERICANAS","00.776574/0006-60","ATENDIMENTO.ACOM@AMERICANAS.COM","INTERNET",null,116.95]
[null,"2022-03-15","MAGAZINE LUIZA","-","INTERNET","_",null,89.9]
[null,"2022-03-15","ILUMINIM","23.429903/0001-98","INTERNET","(51)35575070",null,109.9]
[]
[null,"CÓDIGO","DESCRIÇÃO",null,null,null,"UNIDADE","VALOR MEDIANO"]
[null,"COT 054","ELETRODUTO DE AÇO GALVANIZADO, CLASSE SEMI PESADO, DN 50MM",null,null,null,"M",{"$f":"MIN(H229:H230)","v":52.4}]
[null,"DATA COTAÇÃO","FORNECEDOR","CNPJ","CONTATO","TELEFONE",null,"COTAÇÕES"]
[null,"2022-03-15","AMERICANAS","00.776574/0006-60","INTERNET","_",null,52.4]
[null,"2022-03-15","DIMENSIONAL ","06.913.480/0015-63","INTERNET","(11)991501751",null,53.17]
[]
[null,"CÓDIGO","DESCRIÇÃO",null,null,null,"UNIDADE","VALOR MEDIANO"]
[null,"COT 061","CD 02 SETOR 02",null,null,null,"m",{"$f":"MIN(H235:H236)","v":5159.8100000000004}]
[null,"DATA COTAÇÃO","FORNECEDOR","CNPJ","CONTATO","TELEFONE",null,"COTAÇÕES"]
[null,"2022-03-15","HDS","25.328.278/0001-13","VOLNEI@HDSAUTOMACAO.COM.BR","(51) 31182170",null,5159.8100000000004]
[null,"2022-03-15","INSELETRO","02.598.479/0001-35","INSELETRO@INSELETRO.COM.BR","(51) 33641922",null,7400]
[]
[null,"CÓDIGO","DESCRIÇÃO",null,null,null,"UNIDADE","VALOR MEDIANO"]
[null,"COT 062/063","BARRA DE APOIO 40cm",null,null,null,"UN",{"$f":"MEDIAN(H241:H243)","v":159.72}]
[null,"DATA COTAÇÃO","FORNECEDOR","CNPJ","CONTATO","TELEFONE",null,"COTAÇÕES"]
[null,"2022-03-15","TUMELERO","10.280.765/0048-40","televendas@tumelero.com.br","(51) 998111390",null,148.66]
[null,"2022-03-15","TAQI","89.237.911/0001-40","INTERNET","(51) 40421336",null,159.72]
[null,"2022-03-15","MADEIRA MADEIRA","10.490.181/0001-35","contato@madeiramadeira.com.br","INTERNET",null,173.75]
[]
[null,"CÓDIGO","DESCRIÇÃO",null,null,null,"UNIDADE","VALOR MEDIANO"]
[null,"COT 064","CD 03 SETOR 03",null,null,null,"M",{"$f":"MIN(H248:H249)","v":5003.8599999999997}]
[null,"DATA COTAÇÃO","FORNECEDOR","CNPJ","CONTATO","TELEFONE",null,"COTAÇÕES"]
[null,"2022-03-15","HDS","25.328.278/0001-13","VOLNEI@HDSAUTOMACAO.COM.BR","(51) 31182170",null,5003.8599999999997]
[null,"2022-03-15","INSELETRO","02.598.479/0001-35","INSELETRO@INSELETRO.COM.BR","(51) 33641922",null,5964]
[]
[null,"CÓDIGO","DESCRIÇÃO",null,null,null,"UNIDADE","VALOR MEDIANO"]
[null,"COT 065","CD 04 SETOR 04",null,null,null,"M",{"$f":"MIN(H254:H255)","v":5155.1899999999996}]
[null,"DATA COTAÇÃO","FORNECEDOR","CNPJ","CONTATO","TELEFONE",null,"COTAÇÕES"]
[null,"2022-03-15","HDS","25.328.278/0001-13","VOLNEI@HDSAUTOMACAO.COM.BR","(51) 31182170",null,5155.1899999999996]
[null,"2022-03-15","INSELETRO","02.598.479/0001-35","INSELETRO@INSELETRO.COM.BR","(51) 33641922",null,6900]
[]
[null,"CÓDIGO","DESCRIÇÃO",null,null,null,"UNIDADE","VALOR MEDIANO"]
[null,"COT 066","CD N3",null,null,null,"M",{"$f":"MIN(H260:H261)","v":5607.34}]
[null,"DATA COTAÇÃO","FORNECEDOR","CNPJ","CONTATO","TELEFONE",null,"COTAÇÕES"]
[null,"2022-03-15","HDS","25.328.278/0001-13","VOLNEI@HDSAUTOMACAO.COM.BR","(51) 31182170",null,5607.34]
[null,"2022-03-15","INSELETRO","02.598.479/0001-35","INSELETRO@INSELETRO.COM.BR","(51) 33641922",null,7300]
[]
[null,"CÓDIGO","DESCRIÇÃO",null,null,null,"UNIDADE","VALOR MEDIANO"]
[null,"COT 067","QF EMERGENCIA",null,null,null,"M",{"$f":"MIN(H266:H267)","v":3041.69}]
[null,"DATA COTAÇÃO","FORNECEDOR","CNPJ","CONTATO","TELEFONE",null,"COTAÇÕES"]
[null,"2022-03-15","HDS","25.328.278/0001-13","VOLNEI@HDSAUTOMACAO.COM.BR","(51) 31182170",null,3041.69]
[null,"2022-03-15","INSELETRO","02.598.479/0001-35","INSELETRO@INSELETRO.COM.BR","(51) 33641922",null,4300]
[]
[null,"CÓDIGO","DESCRIÇÃO",null,null,null,"UNIDADE","VALOR MEDIANO"]
[null,"COT 068","QF ELEVADOR Q1/Q2/Q3",null,null,null,"M",{"$f":"MIN(H272:H273)","v":1300}]
[null,"DATA COTAÇÃO","FORNECEDOR","CNPJ","CONTATO","TELEFONE",null,"COTAÇÕES"]
[null,"2022-03-15","HDS","25.328.278/0001-13","VOLNEI@HDSAUTOMACAO.COM.BR","(51) 31182170",null,2347.44]
[null,"2022-03-15","INSELETRO","02.598.479/0001-35","INSELETRO@INSELETRO.COM.BR","(51) 33641922",null,1300]
[]
[null,"CÓDIGO","DESCRIÇÃO",null,null,null,"UNIDADE","VALOR MEDIANO"]
[null,"COT 069","QF HIDRANTES",null,null,null,"M",{"$f":"MIN(H278:H279)","v":2977.55}]
[null,"DATA COTAÇÃO","FORNECEDOR","CNPJ","CONTATO","TELEFONE",null,"COTAÇÕES"]
[null,"2022-03-15","HDS","25.328.278/0001-13","VOLNEI@HDSAUTOMACAO.COM.BR","(51) 31182170",null,2977.55]
[null,"2022-03-15","INSELETRO","02.598.479/0001-35","INSELETRO@INSELETRO.COM.BR","(51) 33641922",null,7900]
[]
[null,"CÓDIGO","DESCRIÇÃO",null,null,null,"UNIDADE","VALOR MEDIANO"]
[null,"COT 070","Convertedor de Ferrugem 200ml - TF7",null,null,null,"UN",{"$f":"MEDIAN(H284:H286)","v":9.39}]
[null,"DATA COTAÇÃO","FORNECEDOR","CNPJ","CONTATO","TELEFONE",null,"COTAÇÕES"]
[null,"2022-03-15","LOJA DO MECÂNICO","29.302.348/0001-15","INTERNET","(11) 3508-9979",null,6.32]
[null,"2022-03-15","FERRAMENTAS KENNEDY","00.915.086/0001-82","INTERNET","(41) 33141853",null,9.39]
[null,"2022-03-15","DOMINIK","72.332.794/0001-00","atendimento@dominik.com.br","(48) 984039291",null,10.75]
[]
[null,"CÓDIGO","DESCRIÇÃO",null,null,null,"UNIDADE","VALOR MEDIANO"]
[null,"COT 071","Conjunto de bombas para hidrantes",null,null,null,"UN",{"$f":"MIN(H291:H292)","v":20545}]
[null,"DATA COTAÇÃO","FORNECEDOR","CNPJ","CONTATO","TELEFONE",null,"COTAÇÕES"]
[null,"2022-03-15","ELÉTRICA FLORIDA","92.329.200/0001-00","vendas@eletricaflorida.com.br","(51) 30248677",null,22015]
[null,"2022-03-15","BOMBASUL","05.613.279/0001.00","leonardo@bombasul.com.br","(51) 3337.1035",null,20545]
[]
[null,"CÓDIGO","DESCRIÇÃO",null,null,null,"UNIDADE","VALOR MEDIANO"]
[null,"COT 072","BARRAMENTO DE EQUIPOTENCIALIZAÇÃO",null,null,null,"UN",{"$f":"MEDIAN(H297:H299)","v":28.82}]
[null,"DATA COTAÇÃO","FORNECEDOR","CNPJ","CONTATO","TELEFONE",null,"COTAÇÕES"]
[null,"2022-03-15","TUMELERO","10.280.765/0048-40","televendas@tumelero.com.br","(51) 998111390",null,28.82]
[null,"2022-03-15","LEROY MERLIN","INTERNET","LEROYMERLIN.COM.BR","INTERNET",null,36.9]
[null,"2022-03-15","VIEW TECH","07327325/0001-22","VENDAS@VIEWTECH.COM.BR","INTERNET",null,18.14]
[]
[null,"CÓDIGO","DESCRIÇÃO",null,null,null,"UNIDADE","VALOR MEDIANO"]
[null,"COT 073","PERFILADO PERFURADO 38 X 38 MM, CHAPA 18",null,null,null,"M",{"$f":"MEDIAN(H304:H306)","v":30.93}]
[null,"DATA COTAÇÃO","FORNECEDOR","CNPJ","CONTATO","TELEFONE",null,"COTAÇÕES"]
[null,"2022-04-09","LOJA ELÉTRICA LTDA","INTERNET","lojaelétrica.com.br","INTERNET",null,30.93]
[null,"2022-04-09","I9 ELÉTRICA","INTERNET","i9eletrica.com.br","INTERNET",null,32.6]
[null,"2022-04-09","TEKY","INTERNET","teky.com.br","INTERNET",null,21.31]

{"sheet":"BDI","index":7,"n_rows":19,"n_cols":2,"rows_kept":19,"cut":false,"hidden":false,"merged":[[0,0,0,1],[1,0,1,1],[5,0,5,1]]}
["PREFEITURA MUNICIPAL DE PORTO ALEGRE"]
["Secretaria Municipal de Desenvolvimento Social"]
[]
["Objeto:","REFORMA DA EDIFICAÇÃO DO GINÁSIO MUNICIPAL OSMAR FORTES BARCELLOS"]
["Local:","AV. ÉRICO VERÍSSIMO S/Nº"]
["COMPOSIÇÃO DO BDI"]
[null,"BDI para contratação de obras e serviços"]
["Parcelas"]
["(AC) - Administração Central",4.0300000000000002E-2]
["(S) + (G) - Seguro e Garantia",6.4999999999999997E-3]
["(R) - Risco",1.3299999999999999E-2]
["(DF) - Despesas Financeiras",1.52E-2]
["(L) - Lucro",7.5499999999999998E-2]
["Impostos (I= I1+I2+I3+I4):"]
["(I1) - PIS",6.4999999999999997E-3]
["(I2 ) - COFINS",0.03]
["(I3 ) - ISSQN",1.6E-2]
["(I4 ) - Contribuição\nPrevidenciária (CPRB)",0]
["BDI sem Desoneração \n(incluindo I4)",{"$f":"((1+B9+B10+B11)*(1+B12)*(1+B13))/(1-(B15+B16+B17+B18))-1","v":0.22160173167282338}]

{"sheet":"Encargos Sociais","index":8,"n_rows":42,"n_cols":6,"rows_kept":42,"cut":false,"hidden":false,"merged":[[6,0,6,5],[17,0,17,5],[29,0,29,5],[36,0,36,5],[40,0,40,1],[41,0,41,5],[0,0,0,5],[1,0,1,5],[3,0,3,5],[4,0,5,0],[4,1,5,1],[4,2,4,3],[4,4,4,5]]}
["PREFEITURA MUNICIPAL DE PORTO ALEGRE"]
[]
[]
["COMPOSIÇÃO DOS ENCARGOS SOCIAIS SOBRE A MÃO DE OBRA"]
["CÓDIGO","DESCRIÇÃO","COM DESONERAÇÃO",null,"SEM DESONERAÇÃO"]
[null,null,"HORISTA %","MENSALISTA %","HORISTA %","MENSALISTA %"]
["GRUPO A"]
["A1","INSS",0,0,0.2,0.2]
["A2","SESI",1.4999999999999999E-2,1.4999999999999999E-2,1.4999999999999999E-2,1.4999999999999999E-2]
["A3","SENAI",0.01,0.01,0.01,0.01]
["A4","INCRA",2E-3,2E-3,2E-3,2E-3]
["A5","SEBRAE",6.0000000000000001E-3,6.0000000000000001E-3,6.0000000000000001E-3,6.0000000000000001E-3]
["A6","Salário Educação",2.5000000000000001E-2,2.5000000000000001E-2,2.5000000000000001E-2,2.5000000000000001E-2]
["A7","Seguro Contra Acidentes de Trabalho",0.03,0.03,0.03,0.03]
["A8","FGTS",0.08,0.08,0.08,0.08]
["A9","SECONCI",0,0,0,0]
["A","Total",{"$f":"SUM(C8:C16)","v":0.16799999999999998},0.16799999999999998,0.36800000000000005,0.36800000000000005]
["GRUPO B"]
["B1","Repouso Semanal Remunerado",0.17929999999999999,0,0.17929999999999999,0]
["B2","Feriados",4.24E-2,0,4.24E-2,0]
["B3","Auxílio - Enfermidade",8.5000000000000006E-3,6.6E-3,8.5000000000000006E-3,6.6E-3]
["B4","13º Salário",0.1081,8.3299999999999999E-2,0.1081,8.3299999999999999E-2]
["B5","Licença Paternidade",6.9999999999999999E-4,5.9999999999999995E-4,6.9999999999999999E-4,5.9999999999999995E-4]
["B6","Faltas Justificadas",7.1999999999999998E-3,5.5999999999999999E-3,7.1999999999999998E-3,5.5999999999999999E-3]
["B7"," Dias de Chuvas",1.5299999999999999E-2,0,1.5299999999999999E-2,0]
["B8","Auxílio Acidente de Trabalho",1E-3,8.0000000000000004E-4,1E-3,8.0000000000000004E-4]
["B9","Férias Gozadas",8.14E-2,6.2799999999999995E-2,8.14E-2,6.2799999999999995E-2]
["B10","Salário Maternidade",2.9999999999999997E-4,2.0000000000000001E-4,2.9999999999999997E-4,2.0000000000000001E-4]
["B","Total",{"$f":"SUM(C19:C28)","v":0.44419999999999998},0.15989999999999999,0.44419999999999998,0.15989999999999999]
["GRUPO C"]
["C1","Aviso Prévio Indenizado",4.4999999999999998E-2,3.4700000000000002E-2,4.4999999999999998E-2,3.4700000000000002E-2]
["C2","Aviso Prévio Trabalhado",1.1000000000000001E-3,8.0000000000000004E-4,1.1000000000000001E-3,8.0000000000000004E-4]
["C3","Férias Indenizadas",4.7800000000000002E-2,3.6799999999999999E-2,4.7800000000000002E-2,3.6799999999999999E-2]
["C4","Depósito Rescisão Sem Justa Causa",3.4799999999999998E-2,2.69E-2,3.4799999999999998E-2,2.69E-2]
["C5","Indenização Adicional",3.8E-3,2.8999999999999998E-3,3.8E-3,2.8999999999999998E-3]
["C","Total",{"$f":"SUM(C31:C35)","v":0.13249999999999998},0.10210000000000001,0.13249999999999998,0.10210000000000001]
["GRUPO D"]
["D1","Reincidência de Grupo A sobre Grupo B",{"$f":"ROUND(C17*C29,4)","v":7.46E-2},2.69E-2,0.16350000000000001,5.8799999999999998E-2]
["D2","Reincidência de Grupo A sobre Aviso Prévio Trabalhado e Reincidência do FGTS sobre Aviso Prévio Indenizado\n",{"$f":"ROUND((C17*C32)+(C15*C31),4)","v":3.8E-3},2.8999999999999998E-3,4.0000000000000001E-3,3.0999999999999999E-3]
["D","Total",{"$f":"SUM(C38:C39)","v":7.8399999999999997E-2},2.98E-2,0.16750000000000001,6.1899999999999997E-2]
["TOTAL ( A+B+C+D)",null,{"$f":"SUM(C40,C36,C29,C17)","v":0.82309999999999994},{"$f":"SUM(D40,D36,D29,D17)","v":0.45979999999999999},1.1122000000000001,0.69189999999999996]
["Observação: composição baseada na Metodologia SINAPI, de acordo com o Decreto Municipal nº 19.224/2015."]

{"sheet":"BDI Diferenciado","index":9,"n_rows":34,"n_cols":5,"rows_kept":34,"cut":false,"hidden":true,"merged":[[26,4,28,9],[29,4,30,9],[30,3,33,3],[31,4,34,9],[2,0,3,9],[9,0,10,9],[12,0,12,3],[17,4,24,9],[24,1,24,3],[25,4,25,9]]}
[]
[]
["BDI DIFERENCIADO"]
[]
["OBRA :","REFORMA DA EDIFICAÇÃO DO GINÁSIO MUNICIPAL OSMAR FORTES BARCELLOS"]
["END.   :","AV. ÉRICO VERÍSSIMO S/Nº"]
["PROPR. :","PREFEITURA MUNICIPAL DE PORTO ALEGRE"]
[]
[]
["Em atenção ao estabelecido pelo Acórdão 2622/2013 – TCU – Plenário reformamos a orientação e indicamos a utilização dos seguintes parâmetros para taxas de BDI:"]
[]
[]
["VALORES DE BDI POR TIPO DE OBRA"]
["TIPO DE OBRA","1 Quartil","Médio","3 Quartil"]
["Construção de Edificios",0.111,0.14019999999999999,0.16800000000000001]
[]
[]
["2.2  Para o tipo de obra  \"Construção de Edificios\""]
["PARCELA DO BDI","1 Quartil","Médio","3 Quartil"]
["Administração Central",1.4999999999999999E-2,3.4500000000000003E-2,4.4900000000000002E-2]
["Seguro e Garantia",3.0000000000000001E-3,4.7999999999999996E-3,8.2000000000000007E-3]
["Risco",5.5999999999999999E-3,8.5000000000000006E-3,8.8999999999999999E-3]
["Despesas Financeira",8.5000000000000006E-3,8.5000000000000006E-3,1.11E-2]
["Lucro",3.5000000000000003E-2,5.11E-2,6.2199999999999998E-2]
["PIS, CONFINS E ISSQN","Conforme legislação especifica"]
[{"$nulls":4},"OBSERVAÇÕES"]
["Parâmetro","%","Verificação"," BDI ADOTADO","a) Os percentuais de Impostos a serem adotados devem ser indicados pelo Tomador, conforme legislação vigente.Para o ISS, deverão ser definidos pelo Tomador, através de declaração informativa, conforme legislação tributária municipal, a base de cálculo e, sobre esta, a respectiva alíquota do ISS, que será um percentual entre 2% e 5%."]
["Administração Central",1.4999999999999999E-2,{"$f":"IF(B28<0.015,\"FORA DO LIMITE\",IF(B28>0.0449,\"FORA DO LIMITE\",\"OK\"))","v":"OK"},{"$f":"((1+B28+B29+B30)*(1+B31)*(1+B32))/(1-(B33+B34))-1","v":0.13732836025437201}]
["Seguros e Garantias",4.7999999999999996E-3,{"$f":"IF(B29<0.003,\"FORA DO LIMITE\",IF(B29>0.0082,\"FORA DO LIMITE\",\"OK\"))","v":"OK"}]
["Riscos",5.5999999999999999E-3,{"$f":"IF(B30<0.0056,\"FORA DO LIMITE\",IF(B30>0.0089,\"FORA DO LIMITE\",\"OK\"))","v":"OK"},null,"b) As tabelas acima foram construídas sem considerar a desoneração sobre a folha de pagamento prevista na Lei n° 12.844/2013. Para análise de orçamentos considerando a contribuição previdenciária sobre a receita bruta deverá ser somada a alíquota de 2% no item impostos."]
["Despesas Financeiras",1.11E-2,{"$f":"IF(B31<0.0059,\"FORA DO LIMITE\",IF(B31>0.0139,\"FORA DO LIMITE\",\"OK\"))","v":"OK"}]
["Lucro",3.5000000000000003E-2,{"$f":"IF(B32<0.035,\"FORA DO LIMITE\",IF(B32>0.0622,\"FORA DO LIMITE\",\"OK\"))","v":"OK"},null,"c) Para o tipo de obra “Construção de Edifícios” enquadram-se: a construção e reforma de: edifícios, unidades habitacionais, escolas, hospitais, hotéis, restaurantes, armazéns e depósitos, edifícios para uso agropecuário, estações para trens e metropolitanos, estádios esportivos e quadras cobertas, instalações para embarque e desembarque de passageiros (em aeroportos, rodoviárias, portos, etc.), penitenciárias e presídios, a construção de edifícios industriais (fábricas, oficinas, galpões industriais, etc.), conforme classificação 4120-4 do CNAE 2.0. Também enquadram-se pórticos, mirantes e outros edifícios de finalidade turística."]
["Impostos: PIS e COFINS",{"$f":"3%+0.65%","v":3.6499999999999998E-2}]
["Impostos: ISS (mun.)",0.02,{"$f":"IF(B34<0.02,\"FORA DO LIMITE\",IF(B34>0.05,\"FORA DO LIMITE\",\"OK\"))","v":"OK"}]