{"text_format":"2","workbook":"xlsx","n_sheets":10,"sheets":["Proposta-TCE","Orçamento-TCE","Identificação-TCE","Orçamento","CFF","CPUE","Mapa Cotacões","BDI","Encargos Sociais","BDI Diferenciado"],"not_rendered":{"charts":0,"images":1,"macros":0,"external_links":2,"defined_names":189,"comments":3,"pivot_tables":0},"unopened":[],"bounds":{"document_bytes":16777216,"sheet_cells":100000,"run_cost":"one","rows_first":2000,"rows_last":500,"rows_between":2000,"halvings":0,"cell_chars":16384,"cell_head_chars":4096},"cells_cut":0,"cells_raw":0,"read":"whole","date_system":"1900"}

{"sheet":"Proposta-TCE","index":0,"n_rows":257,"n_cols":20,"rows_kept":257,"cut":false,"hidden":true,"merged":[[9,14,9,15],[9,16,9,17],[9,18,9,19],[5,2,5,3],[9,0,10,0],[9,1,10,1],[9,2,10,2],[9,3,10,3],[9,4,9,12],[4,2,4,3],[0,0,0,7],[1,2,1,3],[2,0,2,1],[2,2,2,7],[3,2,3,5]]}
["PROPOSTA"]
["Modalidade",null,"",null,"N° ","","Ano ",""]
["Descrição do Objeto",null,{"$f":"'Orçamento-TCE'!C3:K3","v":"Reforma dos setores 2 e 4 do Ginásio Municipal Osmar Fortes Barcellos (Ginásio Tesourinha) "}]
["Licitante",{"$nulls":5},"CNPJ*"]
["Tipo de Objeto",null,""]
["Preço Total Proposto",null,{"$f":"SUM(H12:H257)","v":2045309.4300000018}]
["Atenção! Se existirem itens sem preço proposto, deixe a célula do preço unitário proposto em branco."]
["Para incluir itens da proposta, selecione as células A13 a K13 e arraste para baixo, de acordo com o número de itens cadastrado na planilha Orçamento-base."]
["*Campos de preenchimento obrigatório",{"$nulls":4},"**Obrigatório só para Obras e Serviços de Engenharia"]
["Nº  do lote","Nº Ordem","Nº Item","Descrição do item","Proposta",{"$nulls":9},"Equipamento",null,"Mão de Obra",null,"Material"]
[{"$nulls":4},"Qtd.","Unid.","Preço unitário (R$)*","Preço Total (R$)","% BDI**","% Encargos Sociais**","Percentual de Desconto","Pr. Unit. Material","Pr. Unit. Mão de obra","Pr. Unit. Equipamento","Preço total","Preço unit.","Preço total","Preço unit.","Preço total","Preço unit."]
[1,{"$f":"'Orçamento-TCE'!B12","v":1},{"$f":"'Orçamento-TCE'!C12","v":"1.1"},{"$f":"'Orçamento-TCE'!G12","v":"PLACA DE OBRA"},{"$f":"'Orçamento-TCE'!H12","v":2.88},{"$f":"'Orçamento-TCE'!I12","v":"M2"},{"$f":"Orçamento!H10","v":390.92},{"$f":"Orçamento!I10","v":1125.8499999999999},{"$f":"Orçamento!G10","v":0.22159999999999999},1.1122000000000001,null,{"$f":"G12*0.7","v":273.64400000000001},{"$f":"G12-L12","v":117.27600000000001},{"$f":"P12","v":{"$error":"#REF!"}},{"$f":"IF(#REF!=\"Tabela Não Desonerada\",VLOOKUP($C12,#REF!,13,FALSE),VLOOKUP($C12,#REF!,13,FALSE))","v":{"$error":"#REF!"}},{"$f":"O12/E12","v":{"$error":"#REF!"}},{"$f":"IF(#REF!=\"Tabela Não Desonerada\",VLOOKUP($C12,#REF!,14,FALSE),VLOOKUP($C12,#REF!,14,FALSE))","v":{"$error":"#REF!"}},{"$f":"Q12/E12","v":{"$error":"#REF!"}},{"$f":"IF(#REF!=\"Tabela Não Desonerada\",VLOOKUP($C12,#REF!,15,FALSE),VLOOKUP($C12,#REF!,15,FALSE))","v":{"$error":"#REF!"}},{"$f":"S12/E12","v":{"$error":"#REF!"}}]
[1,{"$f":"'Orçamento-TCE'!B13","v":2},{"$f":"'Orçamento-TCE'!C13","v":"1.2"},{"$f":"'Orçamento-TCE'!G13","v":"ANDAIME TUBULAR METÁLICO"},{"$f":"'Orçamento-TCE'!H13","v":8},{"$f":"'Orçamento-TCE'!I13","v":"MÊS"},{"$f":"Orçamento!H11","v":789.78},{"$f":"Orçamento!I11","v":6318.24},{"$f":"Orçamento!G11","v":0.22159999999999999},1.1122000000000001,null,{"$f":"G13*0.7","v":552.84599999999989},{"$f":"G13-L13","v":236.93400000000008},{"$f":"P13","v":{"$error":"#REF!"}},{"$f":"IF(#REF!=\"Tabela Não Desonerada\",VLOOKUP($C13,#REF!,13,FALSE),VLOOKUP($C13,#REF!,13,FALSE))","v":{"$error":"#REF!"}},{"$f":"O13/E13","v":{"$error":"#REF!"}},{"$f":"IF(#REF!=\"Tabela Não Desonerada\",VLOOKUP($C13,#REF!,14,FALSE),VLOOKUP($C13,#REF!,14,FALSE))","v":{"$error":"#REF!"}},{"$f":"Q13/E13","v":{"$error":"#REF!"}},{"$f":"IF(#REF!=\"Tabela Não Desonerada\",VLOOKUP($C13,#REF!,15,FALSE),VLOOKUP($C13,#REF!,15,FALSE))","v":{"$error":"#REF!"}},{"$f":"S13/E13","v":{"$error":"#REF!"}}]
[1,{"$f":"'Orçamento-TCE'!B14","v":3},{"$f":"'Orçamento-TCE'!C14","v":"1.3"},{"$f":"'Orçamento-TCE'!G14","v":"EXTINTOR DE INCÊNDIO PORTÁTIL COM CARGA DE PQS DE 4 KG, CLASSE BC - FORNECIMENTO E INSTALAÇÃO. AF_10/2020_P"},{"$f":"'Orçamento-TCE'!H14","v":2},{"$f":"'Orçamento-TCE'!I14","v":"UN"},{"$f":"Orçamento!H12","v":282.97000000000003},{"$f":"Orçamento!I12","v":565.94000000000005},{"$f":"Orçamento!G12","v":0.22159999999999999},1.1122000000000001,null,198.07900000000001,84.89100000000002,{"$error":"#REF!"},{"$f":"IF(#REF!=\"Tabela Não Desonerada\",VLOOKUP($C14,#REF!,13,FALSE),VLOOKUP($C14,#REF!,13,FALSE))","v":{"$error":"#REF!"}},{"$error":"#REF!"},{"$f":"IF(#REF!=\"Tabela Não Desonerada\",VLOOKUP($C14,#REF!,14,FALSE),VLOOKUP($C14,#REF!,14,FALSE))","v":{"$error":"#REF!"}},{"$error":"#REF!"},{"$f":"IF(#REF!=\"Tabela Não Desonerada\",VLOOKUP($C14,#REF!,15,FALSE),VLOOKUP($C14,#REF!,15,FALSE))","v":{"$error":"#REF!"}},{"$error":"#REF!"}]
[1,{"$f":"'Orçamento-TCE'!B15","v":4},{"$f":"'Orçamento-TCE'!C15","v":"1.4"},{"$f":"'Orçamento-TCE'!G15","v":"EXTINTOR DE INCÊNDIO PORTÁTIL COM CARGA DE ÁGUA PRESSURIZADA DE 10 L, CLASSE A - FORNECIMENTO E INSTALAÇÃO. AF_10/2020_P"},{"$f":"'Orçamento-TCE'!H15","v":2},{"$f":"'Orçamento-TCE'!I15","v":"UN"},{"$f":"Orçamento!H13","v":291.82},{"$f":"Orçamento!I13","v":583.64},{"$f":"Orçamento!G13","v":0.22159999999999999},1.1122000000000001,null,204.27399999999997,87.546000000000021,{"$error":"#REF!"},{"$f":"IF(#REF!=\"Tabela Não Desonerada\",VLOOKUP($C15,#REF!,13,FALSE),VLOOKUP($C15,#REF!,13,FALSE))","v":{"$error":"#REF!"}},{"$error":"#REF!"},{"$f":"IF(#REF!=\"Tabela Não Desonerada\",VLOOKUP($C15,#REF!,14,FALSE),VLOOKUP($C15,#REF!,14,FALSE))","v":{"$error":"#REF!"}},{"$error":"#REF!"},{"$f":"IF(#REF!=\"Tabela Não Desonerada\",VLOOKUP($C15,#REF!,15,FALSE),VLOOKUP($C15,#REF!,15,FALSE))","v":{"$error":"#REF!"}},{"$error":"#REF!"}]
{"$rows_left_out":243}
{"sheet":"Orçamento-TCE","index":1,"n_rows":257,"n_cols":20,"rows_kept":257,"cut":false,"hidden":true,"merged":[[9,19,10,19],[5,2,5,6],[9,0,10,0],[9,1,10,1],[9,2,10,2],[9,3,10,3],[9,4,10,4],[9,5,10,5],[9,6,10,6],[9,7,9,12],[9,13,9,14],[9,15,9,16],[9,17,10,17],[9,18,10,18],[4,2,4,6],[0,0,0,10],[1,2,1,6],[2,0,2,1],[2,2,2,10],[3,2,3,8]]}
["ORÇAMENTO"]
["Modalidade",null,"",{"$nulls":4},"N° ","","Ano ",""]
["Descrição do Objeto",null,{"$f":"'Identificação-TCE'!B3","v":"Reforma dos setores 2 e 4 do Ginásio Municipal Osmar Fortes Barcellos (Ginásio Tesourinha) "}]
["Órgão",null,{"$f":"'Identificação-TCE'!B4","v":"SMELJ"},{"$nulls":6},"CNPJ ",""]
["Tipo de Objeto",null,""]
["Preço T. Estimado",null,{"$f":"SUM(K12:K257)","v":2045309.4300000018}]
[]
["Atenção! Para incluir mais de 100 linhas de itens, selecione as células A113 a R113 e arraste as fórmulas para baixo, de acordo com o número de itens necessário."]
["*Preenchimento obrigatório",{"$nulls":4},"**Obrigatório só para Obras e Serviços de Engenharia",null,"***Obrigatório só para licitação composta por Lotes"]
["Nº  do Lote***","N° Ordem","Nº Item*","Fonte de Referência**","Código de Referência**","Data de Referência**","Descrição do item*","Estimativa",{"$nulls":5},"Família",null,"Subfamília",null,"Tipo de Orçamento","Pr. Unit. Material","Pr. Unit. Mão de obra"]
[{"$nulls":7},"Qtd.*","Unid.*","Preço unitário (R$)*","Preço Total (R$)","% BDI**","% Encargos Sociais**","Código","Descrição","Código","Descrição"]
[{"$f":"'[1]Identificação-TCE'!$A$13","v":1},{"$f":"IF(AND(G12<>\"\",H12>0,I12<>\"\",J12<>0,K12<>0),COUNT($B$11:B11)+1,\"\")","v":1},{"$f":"Orçamento!A10","v":"1.1"},"CCU","CPUE  30","2022-02-11",{"$f":"VLOOKUP($C12,Orçamento!A10:C268,3,FALSE)","v":"PLACA DE OBRA"},{"$f":"IFERROR(VLOOKUP($C12,Orçamento!A10:E268,5,FALSE),0)","v":2.88},{"$f":"VLOOKUP($C12,Orçamento!A10:D268,4,FALSE)","v":"M2"},{"$f":"VLOOKUP($C12,Orçamento!A10:H269,8,FALSE)","v":390.92},{"$f":"VLOOKUP($C12,Orçamento!A10:I269,9,FALSE)","v":1125.8499999999999},{"$f":"VLOOKUP($C12,Orçamento!A10:G269,7,FALSE)","v":0.22159999999999999},1.1122000000000001,null,"",null,""]
[{"$f":"'[1]Identificação-TCE'!$A$13","v":1},{"$f":"IF(AND(G13<>\"\",H13>0,I13<>\"\",J13<>0,K13<>0),COUNT($B$11:B12)+1,\"\")","v":2},{"$f":"Orçamento!A11","v":"1.2"},"CCU","CPUE  54","2022-02-11",{"$f":"VLOOKUP($C13,Orçamento!A11:C269,3,FALSE)","v":"ANDAIME TUBULAR METÁLICO"},{"$f":"IFERROR(VLOOKUP($C13,Orçamento!A11:E269,5,FALSE),0)","v":8},{"$f":"VLOOKUP($C13,Orçamento!A11:D269,4,FALSE)","v":"MÊS"},{"$f":"VLOOKUP($C13,Orçamento!A11:H270,8,FALSE)","v":789.78},{"$f":"VLOOKUP($C13,Orçamento!A11:I270,9,FALSE)","v":6318.24},{"$f":"VLOOKUP($C13,Orçamento!A11:G270,7,FALSE)","v":0.22159999999999999},1.1122000000000001,null,"",null,""]
[{"$f":"'[1]Identificação-TCE'!$A$13","v":1},{"$f":"IF(AND(G14<>\"\",H14>0,I14<>\"\",J14<>0,K14<>0),COUNT($B$11:B13)+1,\"\")","v":3},{"$f":"Orçamento!A12","v":"1.3"},"SINAPI","SINAPI 101908","2022-02-11",{"$f":"VLOOKUP($C14,Orçamento!A12:C270,3,FALSE)","v":"EXTINTOR DE INCÊNDIO PORTÁTIL COM CARGA DE PQS DE 4 KG, CLASSE BC - FORNECIMENTO E INSTALAÇÃO. AF_10/2020_P"},{"$f":"IFERROR(VLOOKUP($C14,Orçamento!A12:E270,5,FALSE),0)","v":2},"UN",{"$f":"VLOOKUP($C14,Orçamento!A12:H271,8,FALSE)","v":282.97000000000003},{"$f":"VLOOKUP($C14,Orçamento!A12:I271,9,FALSE)","v":565.94000000000005},{"$f":"VLOOKUP($C14,Orçamento!A12:G271,7,FALSE)","v":0.22159999999999999},1.1122000000000001,null,"",null,""]
[{"$f":"'[1]Identificação-TCE'!$A$13","v":1},{"$f":"IF(AND(G15<>\"\",H15>0,I15<>\"\",J15<>0,K15<>0),COUNT($B$11:B14)+1,\"\")","v":4},{"$f":"Orçamento!A13","v":"1.4"},"SINAPI","SINAPI 101905","2022-02-11",{"$f":"VLOOKUP($C15,Orçamento!A13:C271,3,FALSE)","v":"EXTINTOR DE INCÊNDIO PORTÁTIL COM CARGA DE ÁGUA PRESSURIZADA DE 10 L, CLASSE A - FORNECIMENTO E INSTALAÇÃO. AF_10/2020_P"},{"$f":"IFERROR(VLOOKUP($C15,Orçamento!A13:E271,5,FALSE),0)","v":2},"UN",{"$f":"VLOOKUP($C15,Orçamento!A13:H272,8,FALSE)","v":291.82},{"$f":"VLOOKUP($C15,Orçamento!A13:I272,9,FALSE)","v":583.64},{"$f":"VLOOKUP($C15,Orçamento!A13:G272,7,FALSE)","v":0.22159999999999999},1.1122000000000001,null,"",null,""]
{"$rows_left_out":243}
{"sheet":"Identificação-TCE","index":2,"n_rows":62,"n_cols":7,"rows_kept":62,"cut":false,"hidden":true,"merged":[[10,0,11,0],[10,1,11,1],[0,0,0,6],[1,1,1,2],[2,1,2,6],[3,1,3,4],[4,5,4,6]]}
["IDENTIFICAÇÃO"]
["Modalidade*",null,null,"N° *",null,"Ano *"]
["Descrição do Objeto",{"$f":"Orçamento!B3","v":"Reforma dos setores 2 e 4 do Ginásio Municipal Osmar Fortes Barcellos (Ginásio Tesourinha) "}]
["Órgão ","SMELJ",null,null,null,"CNPJ *"]
["Tipo de Objeto*",null,"N° CENTRAL DE COMPRAS"]
["Preço Total Estimado",{"$f":"'Orçamento-TCE'!C6","v":2045309.4300000018}]
["Preço Total Proposto",{"$f":"'Proposta-TCE'!C6","v":2045309.4300000018}]
["Qtd. Itens Orçamento",{"$f":"COUNTIF('Orçamento-TCE'!$H$12:$H$257,\"<>0\")","v":246}]
["Atenção! Para incluir mais de 50 lotes, selecione as células A62 a G62 e arraste as fórmulas para baixo, de acordo com o número de lotes necessário."]
["*Campos de preenchimento obrigatório",null,"**Campos de preenchimento obrigatório para licitação composta por lotes"]
["Nº do lote**","Descrição do Lote**","Estimativa",null,null,null,"Proposta"]
[null,null,"Valor do lote (R$)",null,null,null,"Valor do lote (R$)"]
[1,{"$f":"B3","v":"Reforma dos setores 2 e 4 do Ginásio Municipal Osmar Fortes Barcellos (Ginásio Tesourinha) "},{"$f":"B6","v":2045309.4300000018},null,null,null,{"$f":"B7","v":2045309.4300000018}]
[null,null,0,null,null,null,0]
[null,null,0,null,null,null,0]
{"$rows_left_out":48}
{"sheet":"Orçamento","index":3,"n_rows":272,"n_cols":12,"rows_kept":272,"cut":false,"hidden":false,"merged":[[271,0,271,1],[1,2,1,8],[5,0,5,8],[4,6,4,8],[2,6,2,8],[3,6,3,8]]}
[]
[null,null,"PREFEITURA DE PORTO ALEGRE"]
["Obra:","Reforma dos setores 2 e 4 do Ginásio Municipal Osmar Fortes Barcellos (Ginásio Tesourinha) ",{"$nulls":4},"SINAPI data base jan/2022 - não desonerado"]
["Endereço:","Av. Erico Veríssimo, s/n",{"$nulls":4},"Data referência técnica SINAPI: 11/02/2022"]
["SEI:","22.0.000029811-9",{"$nulls":4},"Data base ORSE:  jan/2022"]
["ORÇAMENTO DISCRIMINADO"]
["ITEM","FONTE PREÇO"," DISCRIMINAÇÃO","UNID.","QUANT.","PREÇO UNITÁRIO (R$)","BDI","PREÇO UNITÁRIO C/ BDI       (R$)","CUSTO TOTAL                    (R$)"]
[]
[1,null,"INSTALAÇÕES PROVISÓRIAS",{"$nulls":5},{"$f":"SUM(I10:I13)","v":8593.67}]
["1.1","CPUE  30","PLACA DE OBRA","M2",2.88,{"$f":"CPUE!J21","v":320.00669999999997},0.22159999999999999,{"$f":"ROUND(F10*(1+G10),2)","v":390.92},{"$f":"ROUND(E10*H10,2)","v":1125.8499999999999}]
["1.2","CPUE  54","ANDAIME TUBULAR METÁLICO","MÊS",8,{"$f":"CPUE!J103","v":646.51040000000012},0.22159999999999999,{"$f":"ROUND(F11*(1+G11),2)","v":789.78},{"$f":"ROUND(E11*H11,2)","v":6318.24}]
["1.3","SINAPI 101908","EXTINTOR DE INCÊNDIO PORTÁTIL COM CARGA DE PQS DE 4 KG, CLASSE BC - FORNECIMENTO E INSTALAÇÃO. AF_10/2020_P","UNID",2,231.64,0.22159999999999999,282.97000000000003,565.94000000000005]
["1.4","SINAPI 101905","EXTINTOR DE INCÊNDIO PORTÁTIL COM CARGA DE ÁGUA PRESSURIZADA DE 10 L, CLASSE A - FORNECIMENTO E INSTALAÇÃO. AF_10/2020_P","UNID",2,238.88,0.22159999999999999,291.82,583.64]
[2,null,"ADMINISTRAÇÃO DA OBRA",{"$nulls":5},{"$f":"SUM(I15:I15)","v":116639.28}]
["2.1","CPUE 116","ADMINISTRAÇÃO LOCAL","UNID",1,{"$f":"CPUE!J521","v":95480.75},0.22159999999999999,116639.28,{"$f":"ROUND(E15*H15,2)","v":116639.28}]
{"$rows_left_out":258}
{"sheet":"CFF","index":4,"n_rows":22,"n_cols":15,"rows_kept":22,"cut":false,"hidden":false,"merged":[[5,0,5,2],[4,0,4,14],[0,2,0,14]]}
[null,null,"PREFEITURA DE PORTO ALEGRE"]
["Obra:",{"$f":"Orçamento!B3","v":"Reforma dos setores 2 e 4 do Ginásio Municipal Osmar Fortes Barcellos (Ginásio Tesourinha) "}]
["Endereço:","Av. Erico Veríssimo, s/n"]
["SEI: ","22.0.000029811-9"]
["CRONOGRAMA FÍSICO FINANCEIRO (MENSAL)"]
["SERVIÇO",null,null,"% total","MÊS 1","%","MÊS 2","%","MÊS 3","%","MÊS 4","%","MÊS 5","%","TOTAL"]
[{"$nulls":4},"JUNHO 2022",null,"JULHO 2022",null,"AGOSTO 2022",null,"SETEMBRO 2022",null,"OUTUBRO 2022"]
[1,{"$f":"Orçamento!C9","v":"INSTALAÇÕES PROVISÓRIAS"},{"$f":"Orçamento!I9","v":8593.67},{"$f":"F8+H8+J8+L8+N8","v":1},{"$f":"C8*F8","v":6015.5689999999995},0.7,{"$f":"C8*H8","v":429.68350000000004},0.05,{"$f":"C8*J8","v":429.68350000000004},0.05,{"$f":"C8*L8","v":429.68350000000004},0.05,{"$f":"C8*N8","v":1289.0505000000001},0.15,{"$f":"E8+G8+I8+K8+M8","v":8593.67}]
[2,{"$f":"Orçamento!C14","v":"ADMINISTRAÇÃO DA OBRA"},{"$f":"Orçamento!I14","v":116639.28},{"$f":"F9+H9+J9+L9+N9","v":1},{"$f":"C9*F9","v":23327.856},0.2,{"$f":"C9*H9","v":23327.856},0.2,{"$f":"C9*J9","v":23327.856},0.2,{"$f":"C9*L9","v":23327.856},0.2,{"$f":"C9*N9","v":23327.856},0.2,{"$f":"E9+G9+I9+K9+M9","v":116639.28}]
[3,{"$f":"Orçamento!C16","v":"REMOÇÕES E DEMOLIÇÕES"},{"$f":"Orçamento!I16","v":43890.93},1,35112.743999999999,0.8,8778.1859999999997,0.2,0,null,0,null,0,null,43890.93]
[4,{"$f":"Orçamento!C28","v":"PAREDES E PAINÉIS"},{"$f":"Orçamento!I28","v":62287.359999999993},1,12457.472,0.2,31143.679999999997,0.5,18686.207999999999,0.3,0,null,0,null,62287.359999999993]
[5,{"$f":"Orçamento!C34","v":"ESQUADRIAS METÁLICAS E DE MADEIRA C/FERRAGENS E VIDROS"},{"$f":"Orçamento!I34","v":260278.17999999996},1,0,null,0,null,104111.272,0.4,78083.453999999983,0.3,78083.453999999983,0.3,260278.17999999993]
[6,{"$f":"Orçamento!C53","v":"PROTEÇÕES"},{"$f":"Orçamento!I53","v":25972.42},0.99999999999999989,0,null,18180.693999999996,0.7,5194.4840000000004,0.2,2597.2420000000002,0.1,0,null,25972.42]
[7,{"$f":"Orçamento!C59","v":"REVESTIMENTOS - FORROS - PINTURAS"},{"$f":"Orçamento!I59","v":252435.65},1,0,null,0,null,50487.130000000005,0.2,50487.130000000005,0.2,151461.38999999998,0.6,252435.65]
[8,{"$f":"Orçamento!C71","v":"PAVIMENTAÇÕES INTERNAS"},{"$f":"Orçamento!I71","v":325733.75},1,0,null,0,null,130293.5,0.4,130293.5,0.4,65146.75,0.2,325733.75]
{"$rows_left_out":8}
{"sheet":"CPUE","index":5,"n_rows":540,"n_cols":10,"rows_kept":540,"cut":false,"hidden":false,"merged":[[539,0,539,6],[527,0,527,6],[520,0,520,6],[426,0,426,6],[432,0,432,6],[438,0,438,6],[444,0,444,6],[450,0,450,6],[460,0,460,6],[470,0,470,6],[532,0,532,6],[397,0,397,6],[403,0,403,6],[409,0,409,6],[414,0,414,6],[420,0,420,6],[249,0,249,6],[231,0,231,6],[364,0,364,6],[328,0,328,6],[334,0,334,6],[297,0,297,6],[340,0,340,6],[346,0,346,6],[353,0,353,6],[358,0,358,6],[243,0,243,6],[255,0,255,6],[264,0,264,6],[271,0,271,6],[277,0,277,6],[237,0,237,6],[50,0,50,6],[64,0,64,6],[71,0,71,6],[147,0,147,6],[162,0,162,6],[117,0,117,6],[195,0,195,6],[78,0,78,6],[84,0,84,6],[90,0,90,6],[96,0,96,6],[183,0,183,6],[219,0,219,6],[225,0,225,6],[5,0,5,6],[20,0,20,6],[24,0,24,6],[34,0,34,6],[43,0,43,6],[10,0,10,6],[102,0,102,6],[132,0,132,6],[201,0,201,6],[207,0,207,6],[213,0,213,6],[57,0,57,6],[177,0,177,6],[189,0,189,6],[284,0,284,6],[513,0,513,6],[476,0,476,6],[484,0,484,6],[493,0,493,6],[500,0,500,6],[508,0,508,6],[369,0,369,6],[291,0,291,6],[378,0,378,6],[385,0,385,6],[391,0,391,6],[302,0,302,6],[308,0,308,6],[314,0,314,6],[321,0,321,6]]}
[]
[]
["REFERÊNCIA",null,"CPUE 17","LIMPEZA FINAL DA OBRA","M2","COEF.","CUSTO","MATERIAL","MÃO OBRA","TOTAL"]
["SINAPI","INSUMO",3,"ÁCIDO MURIÁTICO","L",0.05,18.07,{"$f":"F4*G4","v":0.90350000000000008}]
["SINAPI","COMPOSICAO",88316,"SERVENTE COM ENCARGOS COMPLEMENTARES","H",0.15,18.84,null,{"$f":"F5*G5","v":2.8260000000000001}]
["TOTAL",{"$nulls":6},{"$f":"SUM(H4:H5)","v":0.90350000000000008},{"$f":"SUM(I4:I5)","v":2.8260000000000001},{"$f":"H6+I6","v":3.7295000000000003}]
[]
["REFERÊNCIA",null,"CPUE 18","TESTES FINAIS EM INSTALAÇÕES","UN","COEF.","CUSTO","MATERIAL","MÃO OBRA","TOTAL"]
["SINAPI","COMPOSICAO",90778,"ENGENHEIRO CIVIL DE OBRA PLENO COM ENCARGOS COMPLEMENTARES","H",4,114.57,null,{"$f":"F9*G9","v":458.28},{"$f":"F9*G9","v":458.28}]
["SINAPI","COMPOSICAO","88267","ENCANADOR OU BOMBEIRO HIDRÁULICO COM ENCARGOS COMPLEMENTARES","H",4,22.36,null,{"$f":"F10*G10","v":89.44},{"$f":"F10*G10","v":89.44}]
["TOTAL",{"$nulls":7},{"$f":"SUM(I9:I10)","v":547.72},{"$f":"SUM(J8:J10)","v":547.72}]
[]
["REFERÊNCIA",null,"CPUE 30","PLACA DE OBRA EM CHAPA DE ACO GALVANIZADO","M2","COEF.","CUSTO","MATERIAL","MÃO OBRA","TOTAL"]
["SINAPI","INSUMO",4417,"SARRAFO DE MADEIRA NAO APARELHADA *2,5 X 7* CM, MACARANDUBA, ANGELIM OU EQUIVALENTE DA REGIAO","M",1,4.32,{"$f":"F14*G14","v":4.32}]
["SINAPI","INSUMO",4491,"PONTALETE DE MADEIRA NAO APARELHADA *7,5 X 7,5* CM (3 X 3 \") PINUS, MISTA OU EQUIVALENTE DA REGIAO","M",4,6.25,{"$f":"F15*G15","v":25}]
{"$rows_left_out":526}
{"sheet":"Mapa Cotacões","index":6,"n_rows":306,"n_cols":8,"rows_kept":306,"cut":false,"hidden":false,"merged":[[71,5,71,6],[72,5,72,6],[73,5,73,6],[85,5,85,6],[86,5,86,6],[87,5,87,6],[88,5,88,6],[74,5,74,6],[76,2,76,5],[77,2,77,5],[78,5,78,6],[79,5,79,6],[80,5,80,6],[81,5,81,6],[83,2,83,5],[84,2,84,5],[60,5,60,6],[62,2,62,5],[63,2,63,5],[64,5,64,6],[65,5,65,6],[66,5,66,6],[67,5,67,6],[69,2,69,5],[70,2,70,5],[300,2,300,5],[301,2,301,5],[302,5,302,6],[303,5,303,6],[304,5,304,6],[305,5,305,6],[10,5,10,6],[11,5,11,6],[13,2,13,5],[14,2,14,5],[15,5,15,6],[18,5,18,6],[20,2,20,5],[21,2,21,5],[22,5,22,6],[23,5,23,6],[24,5,24,6],[25,5,25,6],[27,2,27,5],[28,2,28,5],[29,5,29,6],[30,5,30,6],[31,5,31,6],[32,5,32,6],[298,5,298,6],[287,2,287,5],[288,2,288,5],[289,5,289,6],[290,5,290,6],[291,5,291,6],[285,5,285,6],[277,5,277,6],[278,5,278,6],[293,2,293,5],[294,2,294,5],[295,5,295,6],[296,5,296,6],[297,5,297,6],[275,2,275,5],[276,5,276,6],[280,2,280,5],[281,2,281,5],[282,5,282,6],[283,5,283,6],[284,5,284,6],[265,5,265,6],[266,5,266,6],[268,2,268,5],[269,2,269,5],[270,5,270,6],[271,5,271,6],[272,5,272,6],[274,2,274,5],[260,5,260,6],[252,5,252,6],[251,2,251,5],[250,2,250,5],[262,2,262,5],[263,2,263,5],[264,5,264,6],[247,5,247,6],[248,5,248,6],[253,5,253,6],[254,5,254,6],[256,2,256,5],[257,2,257,5],[258,5,258,6],[259,5,259,6],[245,2,245,5],[237,2,237,5],[238,2,238,5],[239,5,239,6],[240,5,240,6],[241,5,241,6],[242,5,242,6],[246,5,246,6],[234,5,234,6],[235,5,235,6],[228,5,228,6],[231,2,231,5],[232,2,232,5],[233,5,233,6],[244,2,244,5],[222,5,222,6],[223,5,223,6],[225,2,225,5],[226,2,226,5],[227,5,227,6],[229,5,229,6],[220,5,220,6],[221,5,221,6],[211,2,211,5],[212,2,212,5],[213,5,213,6],[214,5,214,6],[215,5,215,6],[216,5,216,6],[218,2,218,5],[219,2,219,5],[206,2,206,5],[207,5,207,6],[208,5,208,6],[209,5,209,6],[201,5,201,6],[202,5,202,6],[203,5,203,6],[205,2,205,5],[196,5,196,6],[197,5,197,6],[199,2,199,5],[200,2,200,5],[189,5,189,6],[190,5,190,6],[191,5,191,6],[193,2,193,5],[194,2,194,5],[195,5,195,6],[183,5,183,6],[184,5,184,6],[186,2,186,5],[187,2,187,5],[188,5,188,6],[177,5,177,6],[179,2,179,5],[180,2,180,5],[181,5,181,6],[182,5,182,6],[172,2,172,5],[173,2,173,5],[174,5,174,6],[175,5,175,6],[176,5,176,6],[167,2,167,5],[168,5,168,6],[169,5,169,6],[170,5,170,6],[154,5,154,6],[155,5,155,6],[156,5,156,6],[157,5,157,6],[166,2,166,5],[163,5,163,6],[164,5,164,6],[148,5,148,6],[149,5,149,6],[150,5,150,6],[152,2,152,5],[153,2,153,5],[159,2,159,5],[160,2,160,5],[161,5,161,6],[162,5,162,6],[142,5,142,6],[143,5,143,6],[145,2,145,5],[146,2,146,5],[147,5,147,6],[136,5,136,6],[137,5,137,6],[139,2,139,5],[140,2,140,5],[141,5,141,6],[132,2,132,5],[133,2,133,5],[134,5,134,6],[135,5,135,6],[125,2,125,5],[126,2,126,5],[127,5,127,6],[128,5,128,6],[129,5,129,6],[121,5,121,6],[122,5,122,6],[123,5,123,6],[113,5,113,6],[114,5,114,6],[115,5,115,6],[116,5,116,6],[118,2,118,5],[130,5,130,6],[112,2,112,5],[100,5,100,6],[101,5,101,6],[102,5,102,6],[104,2,104,5],[105,2,105,5],[106,5,106,6],[119,2,119,5],[120,5,120,6],[107,5,107,6],[108,5,108,6],[109,5,109,6],[34,2,34,5],[35,2,35,5],[36,5,36,6],[37,5,37,6],[38,5,38,6],[39,5,39,6],[41,2,41,5],[42,2,42,5],[111,2,111,5],[43,5,43,6],[44,5,44,6],[45,5,45,6],[46,5,46,6],[48,2,48,5],[49,2,49,5],[50,5,50,6],[51,5,51,6],[52,5,52,6],[53,5,53,6],[55,2,55,5],[56,2,56,5],[57,5,57,6],[58,5,58,6],[59,5,59,6],[94,5,94,6],[95,5,95,6],[97,2,97,5],[98,2,98,5],[99,5,99,6],[90,2,90,5],[91,2,91,5],[92,5,92,6],[93,5,93,6],[4,1,4,7],[1,1,2,1],[1,2,2,7],[6,2,6,5],[7,2,7,5],[8,5,8,6],[9,5,9,6],[16,5,16,6],[17,5,17,6]]}
[]
[null,"OBRA :","Reforma da edificação do Ginásio Municipal Osmar Fortes Barcellos (Ginásio Tesourinha)"]
[]
[]
[null,"MAPA COTAÇÕES"]
[]
[null,"CÓDIGO","DESCRIÇÃO",null,null,null,"UNIDADE","VALOR MEDIANO"]
[null,"COT 01","EA01 (80X70)",null,null,null,"PÇ",{"$f":"MEDIAN(H10:H12)","v":961}]
[null,"DATA COTAÇÃO","FORNECEDOR","CNPJ","CONTATO","TELEFONE",null,"COTAÇÕES"]
[null,"2022-03-15","INOVA VIDROS","35.896.856.0001-71","CONTATO@INOVAVIDROS.COM.BR","(51) 39336900",null,961]
[null,"2022-03-15","SERRALHEIRA HÍPICA","29.432.935/0001-29",null,"(51) 32464777",null,1350]
[null,"2022-03-15","TRIAL","20.063.653/0001-27","TRIAL@TRIALESQUADRIAS.COM","(48) 3632-4038",null,582]
[]
[null,"CÓDIGO","DESCRIÇÃO",null,null,null,"UNIDADE","VALOR MEDIANO"]
[null,"COT 01","EA03 (130X70)",null,null,null,"PÇ",{"$f":"MEDIAN(H17:H19)","v":1750}]
{"$rows_left_out":292}
{"sheet":"BDI","index":7,"n_rows":19,"n_cols":2,"rows_kept":19,"cut":false,"hidden":false,"merged":[[0,0,0,1],[1,0,1,1],[5,0,5,1]]}
["PREFEITURA MUNICIPAL DE PORTO ALEGRE"]
["Secretaria Municipal de Desenvolvimento Social"]
[]
["Objeto:","REFORMA DA EDIFICAÇÃO DO GINÁSIO MUNICIPAL OSMAR FORTES BARCELLOS"]
["Local:","AV. ÉRICO VERÍSSIMO S/Nº"]
["COMPOSIÇÃO DO BDI"]
[null,"BDI para contratação de obras e serviços"]
["Parcelas"]
["(AC) - Administração Central",4.0300000000000002E-2]
["(S) + (G) - Seguro e Garantia",6.4999999999999997E-3]
["(R) - Risco",1.3299999999999999E-2]
["(DF) - Despesas Financeiras",1.52E-2]
["(L) - Lucro",7.5499999999999998E-2]
["Impostos (I= I1+I2+I3+I4):"]
["(I1) - PIS",6.4999999999999997E-3]
{"$rows_left_out":5}
{"sheet":"Encargos Sociais","index":8,"n_rows":42,"n_cols":6,"rows_kept":42,"cut":false,"hidden":false,"merged":[[6,0,6,5],[17,0,17,5],[29,0,29,5],[36,0,36,5],[40,0,40,1],[41,0,41,5],[0,0,0,5],[1,0,1,5],[3,0,3,5],[4,0,5,0],[4,1,5,1],[4,2,4,3],[4,4,4,5]]}
["PREFEITURA MUNICIPAL DE PORTO ALEGRE"]
[]
[]
["COMPOSIÇÃO DOS ENCARGOS SOCIAIS SOBRE A MÃO DE OBRA"]
["CÓDIGO","DESCRIÇÃO","COM DESONERAÇÃO",null,"SEM DESONERAÇÃO"]
[null,null,"HORISTA %","MENSALISTA %","HORISTA %","MENSALISTA %"]
["GRUPO A"]
["A1","INSS",0,0,0.2,0.2]
["A2","SESI",1.4999999999999999E-2,1.4999999999999999E-2,1.4999999999999999E-2,1.4999999999999999E-2]
["A3","SENAI",0.01,0.01,0.01,0.01]
["A4","INCRA",2E-3,2E-3,2E-3,2E-3]
["A5","SEBRAE",6.0000000000000001E-3,6.0000000000000001E-3,6.0000000000000001E-3,6.0000000000000001E-3]
["A6","Salário Educação",2.5000000000000001E-2,2.5000000000000001E-2,2.5000000000000001E-2,2.5000000000000001E-2]
["A7","Seguro Contra Acidentes de Trabalho",0.03,0.03,0.03,0.03]
["A8","FGTS",0.08,0.08,0.08,0.08]
{"$rows_left_out":28}
{"sheet":"BDI Diferenciado","index":9,"n_rows":34,"n_cols":5,"rows_kept":34,"cut":false,"hidden":true,"merged":[[26,4,28,9],[29,4,30,9],[30,3,33,3],[31,4,34,9],[2,0,3,9],[9,0,10,9],[12,0,12,3],[17,4,24,9],[24,1,24,3],[25,4,25,9]]}
[]
[]
["BDI DIFERENCIADO"]
[]
["OBRA :","REFORMA DA EDIFICAÇÃO DO GINÁSIO MUNICIPAL OSMAR FORTES BARCELLOS"]
["END.   :","AV. ÉRICO VERÍSSIMO S/Nº"]
["PROPR. :","PREFEITURA MUNICIPAL DE PORTO ALEGRE"]
[]
[]
["Em atenção ao estabelecido pelo Acórdão 2622/2013 – TCU – Plenário reformamos a orientação e indicamos a utilização dos seguintes parâmetros para taxas de BDI:"]
[]
[]
["VALORES DE BDI POR TIPO DE OBRA"]
["TIPO DE OBRA","1 Quartil","Médio","3 Quartil"]
["Construção de Edificios",0.111,0.14019999999999999,0.16800000000000001]
{"$rows_left_out":19}